{"text_format":"3","workbook":"xlsx","n_sheets":30,"sheets":["DEKOMPOZYCJA RÓŻNIC","Podkarpackie","odwolania","2013","2012","2011","2010","2009","2008","2007","2006","2005","2004","2003","2002","Łódzkie","Mazowieckie","Małopolskie","Śląskie","Lubelskie","Podlaskie","Świętokrzyskie","Lubuskie","Wielkopolskie","Zachodniopomorskie","Dolnośląskie","Opolskie","Kujawsko-Pomorskie","Pomorskie","Warmińsko-Mazurskie"],"not_rendered":{"charts":2,"images":20,"macros":1},"read":"whole","date_system":"1900"}

{"sheet":"DEKOMPOZYCJA RÓŻNIC","index":0,"n_rows":3,"n_cols":14,"rows_kept":3,"merged":[[20,0,20,4]]}
[{"$nulls":7},"DEKOMPOZYCJA RÓŻNIC WDB PER CAPITA"]
["WYBIERZ PONIŻEJ PORÓWNANIE:",{"$nulls":6},"dla województw"]
[{"$nulls":13},2012]

{"sheet":"Podkarpackie","index":1,"n_rows":46,"n_cols":9,"rows_kept":46,"hidden":true,"merged":[[0,0,0,9],[1,0,1,9],[2,1,3,1],[17,1,18,1],[32,1,33,1]]}
["DEKOMPOZYCJA RÓŻNIC W POZIOMIE WDB PER CAPITA"]
["PODKARPACKIE"]
[null,"Różnice względem średniej","WDB per capita","WDB na 1 pracującego","Współczynnik dojazdów netto","Udział pracujących wśród aktwnych zawodowo","Współczynnik aktywności zawodowej","Wskaźnik różnicy w metodologii BAEL/demo","Wskaźnik struktury wiekowej"]
[null,null,"WDB_i/N_i","WDB_i/Pp_i","Pp_i/Pz_i","Pz_i/Az_i","Az_i/NB15+_i","NB15+_i/N15+_i*(N15+/NB15+)","Ni15+_i/N_i"]
[null,2013]
[null,2012,{"$f":"(C21-C36)/C36","v":{"v":-0.300838201453261,"d":"-30.1%"}},{"v":-0.27000922982307907,"d":"-27.0%"},{"v":0.02280814724917802,"d":"2.3%"},{"v":-0.03589569872894106,"d":"-3.6%"},{"v":0.00740889395005518,"d":"0.7%"},{"v":-0.027840500748090316,"d":"-2.8%"},{"v":-0.008257744481068807,"d":"-0.8%"}]
[null,2011,{"v":-0.29909169225905335,"d":"-29.9%"},{"v":-0.2705629019627921,"d":"-27.1%"},{"v":1.1575369019422286E-3,"d":"0.1%"},{"v":-0.028889589206659967,"d":"-2.9%"},{"v":0.012314342868718317,"d":"1.2%"},{"v":-0.013609754915560277,"d":"-1.4%"},{"v":-0.010221147275662174,"d":"-1.0%"}]
[null,2010,{"v":-0.30440331641374613,"d":"-30.4%"},{"v":-0.2677434345792704,"d":"-26.8%"},{"v":-0.026656314438888856,"d":"-2.7%"},{"v":-0.023519720475708352,"d":"-2.4%"},{"v":0.02383643039931014,"d":"2.4%"},{"v":-0.011756950969218867,"d":"-1.2%"},{"v":-0.012197345847177061,"d":"-1.2%"}]
[null,2009,{"v":-0.2929617013395242,"d":"-29.3%"},{"v":-0.25407419147711885,"d":"-25.4%"},{"v":-0.0663070587889208,"d":"-6.6%"},{"v":-0.021286940090719953,"d":"-2.1%"},{"v":0.030844907407407595,"d":"3.1%"},{"v":0.01785835132267837,"d":"1.8%"},{"v":-0.011430579327684997,"d":"-1.1%"}]
[null,2008,{"v":-0.28362310372256316,"d":"-28.4%"},{"v":-0.25355717824988466,"d":"-25.4%"},{"v":-0.043694898928317856,"d":"-4.4%"},{"v":-0.01172229446005996,"d":"-1.2%"},{"v":0.008701131686634087,"d":"0.9%"},{"v":0.020708129083946106,"d":"2.1%"},{"v":-0.013708085565003334,"d":"-1.4%"}]
[null,2007,{"v":-0.29523186385315797,"d":"-29.5%"},{"v":-0.2679565671588501,"d":"-26.8%"},{"v":-0.02139906160278631,"d":"-2.1%"},{"v":6.4537574250580652E-4,"d":"0.1%"},{"v":0.013959553283529061,"d":"1.4%"},{"v":-0.014516233000800927,"d":"-1.5%"},{"v":-0.01609428140547354,"d":"-1.6%"}]
[null,2006,{"v":-0.28537735599827874,"d":"-28.5%"},{"v":-0.2621848888003615,"d":"-26.2%"},{"v":-0.008123366372762878,"d":"-0.8%"},{"v":0.004337711282844556,"d":"0.4%"},{"v":-6.2772063588596345E-5,"d":"-0.0%"},{"v":-0.008759768768495914,"d":"-0.9%"},{"v":-0.019065203864763985,"d":"-1.9%"}]
[null,2005,{"v":-0.27922029242321167,"d":"-27.9%"},{"v":-0.2582256171423193,"d":"-25.8%"},{"v":0.009733680359872045,"d":"1.0%"},{"v":0.011288821669135373,"d":"1.1%"},{"v":-0.010989034992379916,"d":"-1.1%"},{"v":-0.01617684169493453,"d":"-1.6%"},{"v":-0.022018762257926927,"d":"-2.2%"}]
[null,2004,{"v":-0.27347847200153924,"d":"-27.3%"},{"v":-0.2578940963810282,"d":"-25.8%"},{"v":0.009910678863177584,"d":"1.0%"},{"v":0.028317386682130106,"d":"2.8%"},{"v":-0.01676227535301655,"d":"-1.7%"},{"v":-0.016948719049259948,"d":"-1.7%"},{"v":-0.024701062130309905,"d":"-2.5%"}]
[null,2003,{"v":-0.2532687370807075,"d":"-25.3%"},{"v":-0.2388987367801917,"d":"-23.9%"},{"v":-0.04477994833537712,"d":"-4.5%"},{"v":0.023428791420598515,"d":"2.3%"},{"v":0.024472870817356416,"d":"2.4%"},{"v":0.007087788553655009,"d":"0.7%"},{"v":-0.027268369654090803,"d":"-2.7%"}]
[null,2002,{"v":-0.25863266059645784,"d":"-25.9%"},{"v":-0.24053390917138634,"d":"-24.1%"},{"v":-0.01852604094194823,"d":"-1.9%"},{"v":0.022728488949873647,"d":"2.3%"},{"v":0.037321513505494425,"d":"3.7%"},{"v":-0.033715581229695014,"d":"-3.4%"},{"v":-0.029785937893888833,"d":"-3.0%"}]
[]
[null,"Wskaźniki","WDB per capita","WDB na 1 pracującego","Współczynnik dojazdów netto","Udział pracujących wśród aktwnych zawodowo","Współczynnik aktywności zawodowej","Wskaźnik różnicy w metodologii BAEL/demo","Wskaźnik struktury wiekowej"]
[null,null,"WDB_i/N_i","WDB_i/Pp_i","Pp_i/Pz_i","Pz_i/Az_i","Az_i/NB15+_i","NB15+_i/N15+_i","Ni15+_i/N_i"]
[null,2013]
[null,2012,{"v":25980.409877973718,"d":"25,980.41"},{"v":75204.9954555341,"d":"75,205.00"},{"v":0.9117911800086517,"d":"0.91"},{"v":0.8668098818474759,"d":"0.87"},{"v":0.5628778718258767,"d":"0.56"},{"v":0.9216553911546715,"d":"0.92"},{"v":0.8425531854958166,"d":"0.84"}]
[null,2011,{"v":24836.906506217212,"d":"24,836.91"},{"v":71432.24868776365,"d":"71,432.25"},{"v":0.8971416924723836,"d":"0.90"},{"v":0.8776595744680851,"d":"0.88"},{"v":0.562200956937799,"d":"0.56"},{"v":0.9347043075221895,"d":"0.93"},{"v":0.8403306827166229,"d":"0.84"}]
[null,2010,{"v":22853.941919633377,"d":"22,853.94"},{"v":67010.19121352301,"d":"67,010.19"},{"v":0.8701922728994207,"d":"0.87"},{"v":0.8825396825396825,"d":"0.88"},{"v":0.5662073097663272,"d":"0.57"},{"v":0.9363085767885233,"d":"0.94"},{"v":0.837676484575751,"d":"0.84"}]
[null,2009,{"v":22410.088441342665,"d":"22,410.09"},{"v":64177.03927585548,"d":"64,177.04"},{"v":0.8274039877481857,"d":"0.83"},{"v":0.8986828774062816,"d":"0.90"},{"v":0.5662650602409639,"d":"0.57"},{"v":0.988705051641829,"d":"0.99"},{"v":0.8387901026391567,"d":"0.84"}]
[null,2008,{"v":20946.465697703497,"d":"20,946.47"},{"v":58729.20768188325,"d":"58,729.21"},{"v":0.8577430623548989,"d":"0.86"},{"v":0.917981072555205,"d":"0.92"},{"v":0.5468660149511213,"d":"0.55"},{"v":0.9913429932743735,"d":"0.99"},{"v":0.8355275911588262,"d":"0.84"}]
[null,2007,{"v":19149.512381885994,"d":"19,149.51"},{"v":55639.72520900733,"d":"55,639.73"},{"v":0.874958027911741,"d":"0.87"},{"v":0.9046052631578947,"d":"0.90"},{"v":0.5444776119402985,"d":"0.54"},{"v":0.9603757563317431,"d":"0.96"},{"v":0.8315822247057937,"d":"0.83"}]
[null,2006,{"v":17488.381760937926,"d":"17,488.38"},{"v":52263.248563895875,"d":"52,263.25"},{"v":0.8952665994178048,"d":"0.90"},{"v":0.8653421633554084,"d":"0.87"},{"v":0.5399284862932062,"d":"0.54"},{"v":0.9685112631280028,"d":"0.97"},{"v":0.825984809045159,"d":"0.83"}]
[null,2005,{"v":16335.893069648562,"d":"16,335.89"},{"v":49270.9132132578,"d":"49,270.91"},{"v":0.9313042629047616,"d":"0.93"},{"v":0.8318485523385301,"d":"0.83"},{"v":0.5429262394195888,"d":"0.54"},{"v":0.9620686686691344,"d":"0.96"},{"v":0.8193501005355383,"d":"0.82"}]
[null,2004,{"v":15598.374623148511,"d":"15,598.37"},{"v":47124.76584804682,"d":"47,124.77"},{"v":0.9448070186147121,"d":"0.94"},{"v":0.8333333333333334,"d":"0.83"},{"v":0.5378048780487805,"d":"0.54"},{"v":0.962256656146385,"d":"0.96"},{"v":0.8123676402245023,"d":"0.81"}]
[null,2003,{"v":14570.999710096277,"d":"14,571.00"},{"v":43780.26620426656,"d":"43,780.27"},{"v":0.9088652955576503,"d":"0.91"},{"v":0.8222698072805139,"d":"0.82"},{"v":0.5609609609609609,"d":"0.56"},{"v":0.9860466989347735,"d":"0.99"},{"v":0.8051317726849662,"d":"0.81"}]
[null,2002,{"v":13869.029239210471,"d":"13,869.03"},{"v":41699.73088166234,"d":"41,699.73"},{"v":0.9273171158327608,"d":"0.93"},{"v":0.8188720173535792,"d":"0.82"},{"v":0.5748129675810474,"d":"0.57"},{"v":0.9554796519766634,"d":"0.96"},{"v":0.7974812949811169,"d":"0.80"}]
[]
[null,"Wskaźniki dla Polski","WDB per capita","WDB na 1 pracującego","Współczynnik dojazdów netto","Udział pracujących wśród aktwnych zawodowo","Współczynnik aktywności zawodowej","Wskaźnik różnicy w metodologii BAEL/demo","Wskaźnik struktury wiekowej"]
[null,null,"WDB/N","WDB/Pp","Pp/Pz","Pz/Az","Az/NB15+","NB15+/N15+","Ni15+/N"]
[null,2013]
[null,2012,{"v":37159.367019159195,"d":"37,159.37"},{"v":103021.84428620567,"d":"103,021.84"},{"v":0.8914586596331832,"d":"0.89"},{"v":0.8990830978605616,"d":"0.90"},{"v":0.5587382394638485,"d":"0.56"},{"v":0.948049565800569,"d":"0.95"},{"v":0.8495687067956471,"d":"0.85"}]
[null,2011,{"v":35435.31476501895,"d":"35,435.31"},{"v":97927.9075330495,"d":"97,927.91"},{"v":0.8961044185399302,"d":"0.90"},{"v":0.9037690922817817,"d":"0.90"},{"v":0.5553620383809063,"d":"0.56"},{"v":0.9476009238535954,"d":"0.95"},{"v":0.8490085238774671,"d":"0.85"}]
[null,2010,{"v":32855.1622785296,"d":"32,855.16"},{"v":91511.90221834507,"d":"91,511.90"},{"v":0.894023648386617,"d":"0.89"},{"v":0.9037967289719626,"d":"0.90"},{"v":0.553025163937074,"d":"0.55"},{"v":0.947447672621434,"d":"0.95"},{"v":0.8480200787617584,"d":"0.85"}]
[null,2009,{"v":31695.720703955994,"d":"31,695.72"},{"v":86036.75934332129,"d":"86,036.76"},{"v":0.8861628392252514,"d":"0.89"},{"v":0.9182291666666667,"d":"0.92"},{"v":0.5493212957370378,"d":"0.55"},{"v":0.9713581957224544,"d":"0.97"},{"v":0.8484888214210641,"d":"0.85"}]
[null,2008,{"v":29239.448964014882,"d":"29,239.45"},{"v":78678.77615084611,"d":"78,678.78"},{"v":0.8969345258052793,"d":"0.90"},{"v":0.9288695549938275,"d":"0.93"},{"v":0.5421487076521019,"d":"0.54"},{"v":0.971230624139413,"d":"0.97"},{"v":0.8471402623608278,"d":"0.85"}]
[null,2007,{"v":27171.365162139078,"d":"27,171.37"},{"v":76006.04378494697,"d":"76,006.04"},{"v":0.8940907305328947,"d":"0.89"},{"v":0.9040218293985052,"d":"0.90"},{"v":0.5369815888386316,"d":"0.54"},{"v":0.9745221468802983,"d":"0.97"},{"v":0.8451848678079427,"d":"0.85"}]
[null,2006,{"v":24472.190893654082,"d":"24,472.19"},{"v":70835.15608526816,"d":"70,835.16"},{"v":0.9025987396677198,"d":"0.90"},{"v":0.861604770620535,"d":"0.86"},{"v":0.5399623808461121,"d":"0.54"},{"v":0.9770701719044806,"d":"0.98"},{"v":0.8420384436350294,"d":"0.84"}]
[null,2005,{"v":22664.19669966668,"d":"22,664.20"},{"v":66423.04500115244,"d":"66,423.05"},{"v":0.9223266302980426,"d":"0.92"},{"v":0.8225627877163335,"d":"0.82"},{"v":0.548958766514187,"d":"0.55"},{"v":0.9778878048841524,"d":"0.98"},{"v":0.8377973614577959,"d":"0.84"}]
[null,2004,{"v":21469.941387864226,"d":"21,469.94"},{"v":63501.40272195254,"d":"63,501.40"},{"v":0.9355352293910284,"d":"0.94"},{"v":0.8103853383458647,"d":"0.81"},{"v":0.546973396735638,"d":"0.55"},{"v":0.9788468565096178,"d":"0.98"},{"v":0.832942197188205,"d":"0.83"}]
[null,2003,{"v":19513.043625804545,"d":"19,513.04"},{"v":57522.261911714486,"d":"57,522.26"},{"v":0.9514721701809001,"d":"0.95"},{"v":0.8034460376467811,"d":"0.80"},{"v":0.5475605815831988,"d":"0.55"},{"v":0.9791069955787072,"d":"0.98"},{"v":0.8277018527696652,"d":"0.83"}]
[null,2002,{"v":18707.364759781063,"d":"18,707.36"},{"v":54906.63952641513,"d":"54,906.64"},{"v":0.9448209066318307,"d":"0.94"},{"v":0.8006739092546331,"d":"0.80"},{"v":0.554131925441844,"d":"0.55"},{"v":0.9888182334478789,"d":"0.99"},{"v":0.821964271729858,"d":"0.82"}]

{"sheet":"odwolania","index":2,"n_rows":17,"n_cols":4,"rows_kept":17,"hidden":true}
[null,"wybierz:","województwo","rok"]
[null,"różnice","Łódzkie",2012]
[null,"dekompozycje różnic","Mazowieckie",2011]
[null,null,"Małopolskie",2010]
[null,null,"Śląskie",2009]
[null,null,"Lubelskie",2008]
[null,null,"Podkarpackie",2007]
[null,null,"Podlaskie",2006]
[null,null,"Świętokrzyskie",2005]
[null,null,"Lubuskie",2004]
[null,null,"Wielkopolskie",2003]
[null,null,"Zachodniopomorskie",2002]
[null,null,"Dolnośląskie"]
[null,null,"Opolskie"]
[null,null,"Kujawsko-Pomorskie"]
[null,null,"Pomorskie"]
[null,null,"Warmińsko-Mazurskie"]

{"sheet":"2013","index":3,"n_rows":59,"n_cols":9,"rows_kept":59,"hidden":true,"merged":[[0,0,0,16383],[1,0,1,9],[2,1,3,1],[21,1,22,1]]}
["DEKOMPOZYCJA RÓŻNIC W POZIOMIE WDB PER CAPITA"]
[2013]
[null,"Różnice względem średniej","WDB per capita","WDB na 1 pracującego","Współczynnik dojazdów netto","Udział pracujących wśród aktwnych zawodowo","Współczynnik aktywności zawodowej","Wskaźnik różnicy w metodologii BAEL/demo","Wskaźnik struktury wiekowej"]
[null,null,"WDB_i/N_i","WDB_i/Pp_i","Pp_i/Pz_i","Pz_i/Az_i","Az_i/NB15+_i","NB15+_i/N15+_i*(N15+/NB15+)","Ni15+_i/N_i"]
[null,"ŁÓDZKIE",{"$f":"(C24-C$40)/C$40","v":{"$error":"#DIV/0!"}},{"$f":"(D24-D$40)/D$40","v":{"$error":"#DIV/0!"}},{"$error":"#DIV/0!"},{"$f":"(F24-F$40)/F$40","v":{"$error":"#DIV/0!"}},{"$f":"(G24-G$40)/G$40","v":{"$error":"#DIV/0!"}}]
[null,"MAZOWIECKIE",{"$f":"(C25-C$40)/C$40","v":{"$error":"#DIV/0!"}},{"$error":"#DIV/0!"},{"$error":"#DIV/0!"},{"$error":"#DIV/0!"},{"$error":"#DIV/0!"}]
[null,"MAŁOPOLSKIE",{"$error":"#DIV/0!"},{"$error":"#DIV/0!"},{"$error":"#DIV/0!"},{"$error":"#DIV/0!"},{"$error":"#DIV/0!"}]
[null,"ŚLĄSKIE",{"$error":"#DIV/0!"},{"$error":"#DIV/0!"},{"$error":"#DIV/0!"},{"$error":"#DIV/0!"},{"$error":"#DIV/0!"}]
[null,"LUBELSKIE",{"$error":"#DIV/0!"},{"$error":"#DIV/0!"},{"$error":"#DIV/0!"},{"$error":"#DIV/0!"},{"$error":"#DIV/0!"}]
[null,"PODKARPACKIE",{"$error":"#DIV/0!"},{"$error":"#DIV/0!"},{"$error":"#DIV/0!"},{"$error":"#DIV/0!"},{"$error":"#DIV/0!"}]
[null,"PODLASKIE",{"$error":"#DIV/0!"},{"$error":"#DIV/0!"},{"$error":"#DIV/0!"},{"$error":"#DIV/0!"},{"$error":"#DIV/0!"}]
[null,"ŚWIĘTOKRZYSKIE",{"$error":"#DIV/0!"},{"$error":"#DIV/0!"},{"$error":"#DIV/0!"},{"$error":"#DIV/0!"},{"$error":"#DIV/0!"}]
[null,"LUBUSKIE",{"$error":"#DIV/0!"},{"$error":"#DIV/0!"},{"$error":"#DIV/0!"},{"$error":"#DIV/0!"},{"$error":"#DIV/0!"}]
[null,"WIELKOPOLSKIE",{"$error":"#DIV/0!"},{"$error":"#DIV/0!"},{"$error":"#DIV/0!"},{"$error":"#DIV/0!"},{"$error":"#DIV/0!"}]
[null,"ZACHODNIOPOMORSKIE",{"$error":"#DIV/0!"},{"$error":"#DIV/0!"},{"$error":"#DIV/0!"},{"$error":"#DIV/0!"},{"$error":"#DIV/0!"}]
[null,"DOLNOŚLĄSKIE",{"$error":"#DIV/0!"},{"$error":"#DIV/0!"},{"$error":"#DIV/0!"},{"$error":"#DIV/0!"},{"$error":"#DIV/0!"}]
[null,"OPOLSKIE",{"$error":"#DIV/0!"},{"$error":"#DIV/0!"},{"$error":"#DIV/0!"},{"$error":"#DIV/0!"},{"$error":"#DIV/0!"}]
[null,"KUJAWSKO-POMORSKIE",{"$error":"#DIV/0!"},{"$error":"#DIV/0!"},{"$error":"#DIV/0!"},{"$error":"#DIV/0!"},{"$error":"#DIV/0!"}]
[null,"POMORSKIE",{"$error":"#DIV/0!"},{"$error":"#DIV/0!"},{"$error":"#DIV/0!"},{"$error":"#DIV/0!"},{"$error":"#DIV/0!"}]
[null,"WARMIŃSKO-MAZURSKIE",{"$error":"#DIV/0!"},{"$error":"#DIV/0!"},{"$error":"#DIV/0!"},{"$error":"#DIV/0!"},{"$error":"#DIV/0!"}]
[]
[null,"Wartości","WDB per capita","WDB na 1 pracującego","Współczynnik dojazdów netto","Udział pracujących wśród aktwnych zawodowo","Współczynnik aktywności zawodowej","Wskaźnik różnicy w metodologii BAEL/demo","Wskaźnik struktury wiekowej"]
[null,null,"WDB_i/N_i","WDB_i/Pp_i","Pp_i/Pz_i","Pz_i/Az_i","Az_i/NB15+_i","NB15+_i/N15+_i*(N15+/NB15+)","Ni15+_i/N_i"]
[null,"ŁÓDZKIE"]
[null,"MAZOWIECKIE"]
[null,"MAŁOPOLSKIE"]
[null,"ŚLĄSKIE"]
[null,"LUBELSKIE"]
[null,"PODKARPACKIE"]
[null,"PODLASKIE"]
[null,"ŚWIĘTOKRZYSKIE"]
[null,"LUBUSKIE"]
[null,"WIELKOPOLSKIE"]
[null,"ZACHODNIOPOMORSKIE"]
[null,"DOLNOŚLĄSKIE"]
[null,"OPOLSKIE"]
[null,"KUJAWSKO-POMORSKIE"]
[null,"POMORSKIE"]
[null,"WARMIŃSKO-MAZURSKIE"]
[null,"POLSKA"]
[]
[null,"Dane","WDB_i","PP_i","PZ_i","AZ_i","NB15+_i","N15+_i","N_i"]
[null,"ŁÓDZKIE"]
[null,"MAZOWIECKIE"]
[null,"MAŁOPOLSKIE"]
[null,"ŚLĄSKIE"]
[null,"LUBELSKIE"]
[null,"PODKARPACKIE"]
[null,"PODLASKIE"]
[null,"ŚWIĘTOKRZYSKIE"]
[null,"LUBUSKIE"]
[null,"WIELKOPOLSKIE"]
[null,"ZACHODNIOPOMORSKIE"]
[null,"DOLNOŚLĄSKIE"]
[null,"OPOLSKIE"]
[null,"KUJAWSKO-POMORSKIE"]
[null,"POMORSKIE"]
[null,"WARMIŃSKO-MAZURSKIE"]
[null,"POLSKA"]

{"sheet":"2012","index":4,"n_rows":59,"n_cols":10,"rows_kept":59,"hidden":true,"merged":[[0,0,0,16383],[1,0,1,11],[2,1,3,1],[21,1,22,1]]}
["DEKOMPOZYCJA RÓŻNIC W POZIOMIE WDB PER CAPITA"]
[2012]
[null,"Różnice względem średniej","WDB per capita","WDB na 1 pracującego","Współczynnik dojazdów netto","Udział pracujących wśród aktwnych zawodowo","Współczynnik aktywności zawodowej","Wskaźnik różnicy w metodologii BAEL/demo","Wskaźnik struktury wiekowej","Interakcje"]
[null,null,"WDB_i/N_i","WDB_i/Pp_i","Pp_i/Pz_i","Pz_i/Az_i","Az_i/NB15+_i","NB15+_i/N15+_i","Ni15+_i/N_i"]
[null,"ŁÓDZKIE",{"$f":"(C24-C$40)/C$40","v":{"v":-0.06661418444143814,"d":"-6.7%"}},{"$f":"(D24-D$40)/D$40","v":{"v":-0.09354017707737187,"d":"-9.4%"}},{"$f":"(E24-E$40)/E$40","v":{"v":-0.11831932135196202,"d":"-11.8%"}},{"$f":"(F24-F$40)/F$40","v":{"v":-0.009827713462703742,"d":"-1.0%"}},{"$f":"(G24-G$40)/G$40","v":{"v":0.011621102158579913,"d":"1.2%"}},{"$f":"(H24-H$40)/H$40","v":{"v":0.15146328901506562,"d":"15.1%"}},{"$f":"(I24-I$40)/I$40","v":{"v":0.0125642039419553,"d":"1.3%"}},{"$f":"C5-SUM(D5:I5)","v":{"v":-0.02057556766500135,"d":"-2.1%"}}]
[null,"MAZOWIECKIE",{"$f":"(C25-C$40)/C$40","v":{"v":0.589300776910861,"d":"58.9%"}},{"$f":"(D25-D$40)/D$40","v":{"v":0.3081483530489184,"d":"30.8%"}},{"v":0.06375314207131902,"d":"6.4%"},{"v":0.023222401265469192,"d":"2.3%"},{"v":0.07843390377178278,"d":"7.8%"},{"v":0.04010003125128493,"d":"4.0%"},{"v":-0.004893508504465788,"d":"-0.5%"},{"$f":"C6-SUM(D6:I6)","v":{"v":0.08053645400655252,"d":"8.1%"}}]
[null,"MAŁOPOLSKIE",{"v":-0.11959928095177763,"d":"-12.0%"},{"v":-0.1292366191954662,"d":"-12.9%"},{"v":0.057100667156067986,"d":"5.7%"},{"v":-3.7199621324241054E-3,"d":"-0.4%"},{"v":-0.010053487942101053,"d":"-1.0%"},{"v":-0.020307050583406126,"d":"-2.0%"},{"v":-0.01012411596716719,"d":"-1.0%"},{"v":-3.258712287280946E-3,"d":"-0.3%"}]
[null,"ŚLĄSKIE",{"v":0.05919515654336704,"d":"5.9%"},{"v":0.06480108265293905,"d":"6.5%"},{"v":-0.02579992830597846,"d":"-2.6%"},{"v":0.00756648843179681,"d":"0.8%"},{"v":-0.04368599933254888,"d":"-4.4%"},{"v":0.04625243382812691,"d":"4.6%"},{"v":0.012858169066290706,"d":"1.3%"},{"v":-2.7970897972590877E-3,"d":"-0.3%"}]
[null,"LUBELSKIE",{"v":-0.2960722164221493,"d":"-29.6%"},{"v":-0.27482684011811737,"d":"-27.5%"},{"v":-0.10182149856665791,"d":"-10.2%"},{"v":-4.5041981105137605E-3,"d":"-0.5%"},{"v":0.012177119723923132,"d":"1.2%"},{"v":0.0727865339188149,"d":"7.3%"},{"v":-1.9692672564920608E-4,"d":"-0.0%"},{"v":3.1359345605086464E-4,"d":"0.0%"}]
[null,"PODKARPACKIE",{"v":-0.30083771316813596,"d":"-30.1%"},{"v":-0.2700127696667538,"d":"-27.0%"},{"v":0.02281382135468287,"d":"2.3%"},{"v":-0.03595129554004026,"d":"-3.6%"},{"v":0.007531913825349464,"d":"0.8%"},{"v":-0.027903143927370734,"d":"-2.8%"},{"v":-0.008257744481068807,"d":"-0.8%"},{"v":0.010941505267065332,"d":"1.1%"}]
[null,"PODLASKIE",{"v":-0.28266311748443057,"d":"-28.3%"},{"v":-0.21528527934070293,"d":"-21.5%"},{"v":-0.034075154357394506,"d":"-3.4%"},{"v":0.010872609292870877,"d":"1.1%"},{"v":-0.003382000053410005,"d":"-0.3%"},{"v":-0.06462541868981492,"d":"-6.5%"},{"v":0.004285759534994769,"d":"0.4%"},{"v":0.019546366129026105,"d":"2.0%"}]
[null,"ŚWIĘTOKRZYSKIE",{"v":-0.2489356127951809,"d":"-24.9%"},{"v":-0.23385338818848359,"d":"-23.4%"},{"v":-0.1347174608242522,"d":"-13.5%"},{"v":-0.03489869140986291,"d":"-3.5%"},{"v":0.024359449662217793,"d":"2.4%"},{"v":0.13431759373926638,"d":"13.4%"},{"v":0.01029311556222646,"d":"1.0%"},{"v":-0.014436231336292848,"d":"-1.4%"}]
[null,"LUBUSKIE",{"v":-0.16885345961389617,"d":"-16.9%"},{"v":-0.054318703556527584,"d":"-5.4%"},{"v":-0.10148414148621099,"d":"-10.1%"},{"v":0.009939332022355089,"d":"1.0%"},{"v":-0.03816317171801388,"d":"-3.8%"},{"v":9.718855981868257E-3,"d":"1.0%"},{"v":-2.736554246182079E-3,"d":"-0.3%"},{"v":0.008190923388814997,"d":"0.8%"}]
[null,"WIELKOPOLSKIE",{"v":0.06175590782751073,"d":"6.2%"},{"v":-0.0322822385354695,"d":"-3.2%"},{"v":0.1202405578469186,"d":"12.0%"},{"v":0.017274068372779176,"d":"1.7%"},{"v":0.0251806402771336,"d":"2.5%"},{"v":-0.04944658761905297,"d":"-4.9%"},{"v":-0.01201628417959351,"d":"-1.2%"},{"v":-0.007194248335204663,"d":"-0.7%"}]
[null,"ZACHODNIOPOMORSKIE",{"v":-0.1570558146502807,"d":"-15.7%"},{"v":0.006244591628616818,"d":"0.6%"},{"v":0.0381970338337518,"d":"3.8%"},{"v":-0.009437054841159987,"d":"-0.9%"},{"v":-0.06578315459887059,"d":"-6.6%"},{"v":-0.1325408136437248,"d":"-13.3%"},{"v":0.005163370291321338,"d":"0.5%"},{"v":1.1002126797847178E-3,"d":"0.1%"}]
[null,"DOLNOŚLĄSKIE",{"v":0.131604662336363,"d":"13.2%"},{"v":0.16259858773875716,"d":"16.3%"},{"v":0.05588511519392886,"d":"5.6%"},{"v":-0.012304107070318347,"d":"-1.2%"},{"v":-0.03653577525997202,"d":"-3.7%"},{"v":-0.04331349425472219,"d":"-4.3%"},{"v":0.012557699080597113,"d":"1.3%"},{"v":-7.283363091907552E-3,"d":"-0.7%"}]
[null,"OPOLSKIE",{"v":-0.19021756443818227,"d":"-19.0%"},{"v":-0.04566122211770934,"d":"-4.6%"},{"v":-0.039261902569699005,"d":"-3.9%"},{"v":6.2581892483759526E-3,"d":"0.6%"},{"v":-0.026980662436476503,"d":"-2.7%"},{"v":-0.11531780384760988,"d":"-11.5%"},{"v":0.019629946634231153,"d":"2.0%"},{"v":0.011115890650705368,"d":"1.1%"}]
[null,"KUJAWSKO-POMORSKIE",{"v":-0.18637749042980312,"d":"-18.6%"},{"v":-0.10743190413771805,"d":"-10.7%"},{"v":-0.022497512459156543,"d":"-2.2%"},{"v":-0.020340242550417713,"d":"-2.0%"},{"v":0.00776735256152981,"d":"0.8%"},{"v":-0.05248281240483188,"d":"-5.2%"},{"v":-3.1241508279255563E-3,"d":"-0.3%"},{"v":0.011731779388716834,"d":"1.2%"}]
[null,"POMORSKIE",{"v":-0.0226503995456356,"d":"-2.3%"},{"v":0.06705788897258265,"d":"6.7%"},{"v":-0.012003669473407662,"d":"-1.2%"},{"v":5.6449571108838515E-3,"d":"0.6%"},{"v":-6.155974267865896E-3,"d":"-0.6%"},{"v":-0.05817674503702131,"d":"-5.8%"},{"v":-0.015140437502619642,"d":"-1.5%"},{"v":-0.003876419348187589,"d":"-0.4%"}]
[null,"WARMIŃSKO-MAZURSKIE",{"v":-0.2824486662939615,"d":"-28.2%"},{"v":-0.11823839349291437,"d":"-11.8%"},{"v":-0.05414425721405546,"d":"-5.4%"},{"v":-0.012915725004252398,"d":"-1.3%"},{"v":-0.07828931093331676,"d":"-7.8%"},{"v":-0.04706573607352072,"d":"-4.7%"},{"v":-7.649515945872618E-3,"d":"-0.8%"},{"v":0.03585427236997085,"d":"3.6%"}]
[]
[null,"Wartości","WDB per capita","WDB na 1 pracującego","Współczynnik dojazdów netto","Udział pracujących wśród aktwnych zawodowo","Współczynnik aktywności zawodowej","Wskaźnik różnicy w metodologii BAEL/demo","Wskaźnik struktury wiekowej","Weryfikacja"]
[null,null,"WDB_i/N_i","WDB_i/Pp_i","Pp_i/Pz_i","Pz_i/Az_i","Az_i/NB15+_i","NB15+_i/N15+_i","Ni15+_i/N_i"]
[null,"ŁÓDZKIE",{"$f":"C43/I43*1000000","v":{"v":34684.001867980965,"d":"34,684.00"}},{"$f":"C43/D43*1000000","v":{"v":93385.61557083689,"d":"93,385.62"}},{"$f":"D43/E43/1000","v":{"v":0.7859775157423793,"d":"0.79"}},{"$f":"E43/F43","v":{"v":0.8902985074626866,"d":"0.89"}},{"$f":"F43/G43","v":{"v":0.5651623787431463,"d":"0.57"}},{"$f":"G43/H43*1000","v":{"v":1.0917146181554305,"d":"1.09"}},{"$f":"H43/I43","v":{"v":0.8602428612905308,"d":"0.86"}},{"$f":"IF(PRODUCT(D24:I24)-C24<0.0001,\"prawidłowo\",\"nieprawidłowo\")","v":"prawidłowo"}]
[null,"MAZOWIECKIE",{"$f":"C44/I44*1000000","v":{"v":59057.36962819893,"d":"59,057.37"}},{"$f":"C44/D44*1000000","v":{"v":134768.50944542856,"d":"134,768.51"}},{"$f":"D44/E44/1000","v":{"v":0.9482866895193997,"d":"0.95"}},{"$f":"E44/F44","v":{"v":0.9200150206533985,"d":"0.92"}},{"v":0.6024886877828054,"d":"0.60"},{"$f":"G44/H44*1000","v":{"v":0.9861299264106119,"d":"0.99"}},{"$f":"H44/I44","v":{"v":0.8454113351038146,"d":"0.85"}},"prawidłowo"]
[null,"MAŁOPOLSKIE",{"v":32715.11059525467,"d":"32,715.11"},{"v":89708.08443642993,"d":"89,708.08"},{"v":0.9423563160474017,"d":"0.94"},{"v":0.8957902001380262,"d":"0.90"},{"v":0.5530534351145038,"d":"0.55"},{"v":0.9288573282234363,"d":"0.93"},{"v":0.8409675746859717,"d":"0.84"},"prawidłowo"]
[null,"ŚLĄSKIE",{"v":39358.99407912268,"d":"39,358.99"},{"v":109698.30327772381,"d":"109,698.30"},{"v":0.8684542723111864,"d":"0.87"},{"v":0.9059382422802851,"d":"0.91"},{"v":0.5342639593908629,"d":"0.53"},{"v":0.991963084874275,"d":"0.99"},{"v":0.8604926048610555,"d":"0.86"},"prawidłowo"]
[null,"LUBELSKIE",{"v":26157.492596914275,"d":"26,157.49"},{"v":74709.03863413581,"d":"74,709.04"},{"v":0.8006845611409863,"d":"0.80"},{"v":0.8950850661625709,"d":"0.90"},{"v":0.5654730090860502,"d":"0.57"},{"v":1.0171203480062865,"d":"1.02"},{"v":0.8494014040120038,"d":"0.85"},"prawidłowo"]
[null,"PODKARPACKIE",{"v":25980.409877973718,"d":"25,980.41"},{"v":75204.9954555341,"d":"75,205.00"},{"v":0.9117911800086517,"d":"0.91"},{"v":0.8668098818474759,"d":"0.87"},{"v":0.5628778718258767,"d":"0.56"},{"v":0.9216553911546715,"d":"0.92"},{"v":0.8425531854958166,"d":"0.84"},"prawidłowo"]
[null,"PODLASKIE",{"v":26655.765877749876,"d":"26,655.77"},{"v":80843.14978240438,"d":"80,843.15"},{"v":0.8610772913115892,"d":"0.86"},{"v":0.9089108910891089,"d":"0.91"},{"v":0.5567805953693495,"d":"0.56"},{"v":0.8868386110171365,"d":"0.89"},{"v":0.8532097539814297,"d":"0.85"},"prawidłowo"]
[null,"ŚWIĘTOKRZYSKIE",{"v":27909.057727856074,"d":"27,909.06"},{"v":78930.21968789063,"d":"78,930.22"},{"v":0.7713593334034049,"d":"0.77"},{"v":0.8677563150074294,"d":"0.87"},{"v":0.5722789115646258,"d":"0.57"},{"v":1.0754586017026266,"d":"1.08"},{"v":0.858313415672746,"d":"0.86"},"prawidłowo"]
[null,"LUBUSKIE",{"v":30884.857771345538,"d":"30,884.86"},{"v":97426.30370252914,"d":"97,426.30"},{"v":0.8009852993633713,"d":"0.80"},{"v":0.9080717488789237,"d":"0.91"},{"v":0.5373493975903615,"d":"0.54"},{"v":0.9573252102943602,"d":"0.96"},{"v":0.8472438159436421,"d":"0.85"},"prawidłowo"]
[null,"WIELKOPOLSKIE",{"v":39454.14990947942,"d":"39,454.15"},{"v":99696.55197934921,"d":"99,696.55"},{"v":0.9986426061196045,"d":"1.00"},{"v":0.9146666666666666,"d":"0.91"},{"v":0.572737686139748,"d":"0.57"},{"v":0.9012298225516675,"d":"0.90"},{"v":0.8393600477847009,"d":"0.84"},"prawidłowo"]
[null,"ZACHODNIOPOMORSKIE",{"v":31323.25048434273,"d":"31,323.25"},{"v":103665.67632428269,"d":"103,665.68"},{"v":0.9255046019098504,"d":"0.93"},{"v":0.8906497622820919,"d":"0.89"},{"v":0.52191894127378,"d":"0.52"},{"v":0.8224473011279569,"d":"0.82"},{"v":0.853955344616752,"d":"0.85"},"prawidłowo"]
[null,"DOLNOŚLĄSKIE",{"v":42049.683601419456,"d":"42,049.68"},{"v":119773.63147515537,"d":"119,773.63"},{"v":0.9412727077359176,"d":"0.94"},{"v":0.8880718954248366,"d":"0.89"},{"v":0.5382585751978892,"d":"0.54"},{"v":0.9070446737451252,"d":"0.91"},{"v":0.8602373349638789,"d":"0.86"},"prawidłowo"]
[null,"OPOLSKIE",{"v":30090.98171357638,"d":"30,090.98"},{"v":98318.21773226562,"d":"98,318.22"},{"v":0.8564535453529736,"d":"0.86"},{"v":0.9047619047619048,"d":"0.90"},{"v":0.5435967302452316,"d":"0.54"},{"v":0.838776620301594,"d":"0.84"},{"v":0.8662456951721584,"d":"0.87"},"prawidłowo"]
[null,"KUJAWSKO-POMORSKIE",{"v":30233.676333378487,"d":"30,233.68"},{"v":91954.45728884074,"d":"91,954.46"},{"v":0.8713982231837557,"d":"0.87"},{"v":0.8808463251670379,"d":"0.88"},{"v":0.5630094043887147,"d":"0.56"},{"v":0.8983511454681141,"d":"0.90"},{"v":0.8469145260169318,"d":"0.85"},"prawidłowo"]
[null,"POMORSKIE",{"v":36317.66714554577,"d":"36,317.67"},{"v":109930.80475440764,"d":"109,930.80"},{"v":0.8807529984899094,"d":"0.88"},{"v":0.9042105263157895,"d":"0.90"},{"v":0.5552308591466978,"d":"0.56"},{"v":0.8929526672459638,"d":"0.89"},{"v":0.8367058648862262,"d":"0.84"},"prawidłowo"]
[null,"WARMIŃSKO-MAZURSKIE",{"v":26663.734742678866,"d":"26,663.73"},{"v":90841.14742658903,"d":"90,841.15"},{"v":0.8431866150288286,"d":"0.84"},{"v":0.8875219683655536,"d":"0.89"},{"v":0.5149321266968325,"d":"0.51"},{"v":0.903487133280296,"d":"0.90"},{"v":0.8430699174258994,"d":"0.84"},"prawidłowo"]
[null,"POLSKA",{"v":37159.34106757898,"d":"37,159.34"},{"v":103022.34385826488,"d":"103,022.34"},{"v":0.8914537142263238,"d":"0.89"},{"v":0.8991349480968858,"d":"0.90"},{"v":0.5586700173980282,"d":"0.56"},{"v":0.9481106593413475,"d":"0.95"},{"v":0.8495687067956471,"d":"0.85"},{"$f":"IF(PRODUCT(D40:I40)-C40<0.0001,\"prawidłowo\",\"nieprawidłowo\")","v":"prawidłowo"}]
[]
[null,"Dane","WDB_i","PP_i","PZ_i","AZ_i","NB15+_i","N15+_i","N_i"]
[null,"ŁÓDZKIE",87565,937671.1762806585,1193,1340,2371,2171813,2524651]
[null,"MAZOWIECKIE",313108,2323302.389322529,2450,2663,4420,4482168,5301760]
[null,"MAŁOPOLSKIE",109729,1223178.4982295274,1298,1449,2620,2820670,3354077]
[null,"ŚLĄSKIE",181676,1656142.2972974326,1907,2105,3940,3971922,4615870]
[null,"LUBELSKIE",56648,758248.279400514,947,1058,1871,1839507,2165651]
[null,"PODKARPACKIE",55337,735815.4822669819,807,931,1654,1794597,2129951]
[null,"PODLASKIE",31952,395234.4767120194,459,505,907,1022734,1198690]
[null,"ŚWIĘTOKRZYSKIE",35556,450473.8507075884,584,673,1176,1093487,1273995]
[null,"LUBUSKIE",31605,324399.0462421654,405,446,830,866999,1023317]
[null,"WIELKOPOLSKIE",136598,1370137.6555960975,1372,1500,2619,2906029,3462196]
[null,"ZACHODNIOPOMORSKIE",53920,520133.5862733359,562,631,1209,1470003,1721405]
[null,"DOLNOŚLĄSKIE",122548,1023163.4333089425,1087,1224,2274,2507043,2914362]
[null,"OPOLSKIE",30398,309179.72987242346,361,399,734,875084,1010203]
[null,"KUJAWSKO-POMORSKIE",63382,689275.9945383507,791,898,1595,1775475,2096404]
[null,"POMORSKIE",83170,756566.8257028322,859,950,1711,1916115,2290070]
[null,"WARMIŃSKO-MAZURSKIE",38681,425809.2405895585,505,569,1105,1223039,1450697]
[null,"POLSKA",1431872,13898654.858502613,15591,17340,31038,32736685,38533299]

{"sheet":"2011","index":5,"n_rows":59,"n_cols":10,"rows_kept":59,"hidden":true,"merged":[[0,0,0,10],[1,0,1,10],[2,1,3,1],[21,1,22,1]]}
["DEKOMPOZYCJA RÓŻNIC W POZIOMIE WDB PER CAPITA"]
[2011]
[null,"Różnice względem średniej","WDB per capita","WDB na 1 pracującego","Współczynnik dojazdów netto","Udział pracujących wśród aktwnych zawodowo","Współczynnik aktywności zawodowej","Wskaźnik różnicy w metodologii BAEL/demo","Wskaźnik struktury wiekowej","Interakcje"]
[null,null,"WDB_i/N_i","WDB_i/Pp_i","Pp_i/Pz_i","Pz_i/Az_i","Az_i/NB15+_i","NB15+_i/N15+_i","Ni15+_i/N_i"]
[null,"ŁÓDZKIE",{"$f":"(C24-C$40)/C$40","v":{"v":-0.07121471062562443,"d":"-7.1%"}},{"v":-0.10537794049318819,"d":"-10.5%"},{"v":-0.13573489519840073,"d":"-13.6%"},{"v":0.003645458636825157,"d":"0.4%"},{"v":0.024160710750684315,"d":"2.4%"},{"v":0.15359452339973947,"d":"15.4%"},{"v":0.0130412419538555,"d":"1.3%"},{"$f":"C5-SUM(D5:I5)","v":{"v":-0.02454380967513997,"d":"-2.5%"}}]
[null,"MAZOWIECKIE",{"v":0.5786367883340305,"d":"57.9%"},{"v":0.31034808086653076,"d":"31.0%"},{"v":0.06872444480917497,"d":"6.9%"},{"v":0.020053268571985687,"d":"2.0%"},{"v":0.07162165920404934,"d":"7.2%"},{"v":0.03479383738682064,"d":"3.5%"},{"v":-0.003421230454877728,"d":"-0.3%"},{"$f":"C6-SUM(D6:I6)","v":{"v":0.07651672795034692,"d":"7.7%"}}]
[null,"MAŁOPOLSKIE",{"v":-0.11398284888001829,"d":"-11.4%"},{"v":-0.11929777479250968,"d":"-11.9%"},{"v":0.05395912297208755,"d":"5.4%"},{"v":3.8246361227202113E-3,"d":"0.4%"},{"v":-0.004983269032068379,"d":"-0.5%"},{"v":-0.034285079757189356,"d":"-3.4%"},{"v":-0.010417302745214104,"d":"-1.0%"},{"v":-2.7831816478445376E-3,"d":"-0.3%"}]
[null,"ŚLĄSKIE",{"v":0.07489235004033536,"d":"7.5%"},{"v":0.08154806832721509,"d":"8.2%"},{"v":-0.02384456327175827,"d":"-2.4%"},{"v":0.004123128269978435,"d":"0.4%"},{"v":-0.040759524016185655,"d":"-4.1%"},{"v":0.04270822111803425,"d":"4.3%"},{"v":0.013731413400345125,"d":"1.4%"},{"v":-0.002614393787293612,"d":"-0.3%"}]
[null,"LUBELSKIE",{"v":-0.30194002919776575,"d":"-30.2%"},{"v":-0.2827047444332393,"d":"-28.3%"},{"v":-0.12011589884925247,"d":"-12.0%"},{"v":-0.007081102346009708,"d":"-0.7%"},{"v":0.02004163044775099,"d":"2.0%"},{"v":0.09351145689608341,"d":"9.4%"},{"v":-1.3477259110680376E-3,"d":"-0.1%"},{"v":-4.243645002030616E-3,"d":"-0.4%"}]
[null,"PODKARPACKIE",{"v":-0.29909169225905335,"d":"-29.9%"},{"v":-0.2705638167820702,"d":"-27.1%"},{"v":1.1587924993969982E-3,"d":"0.1%"},{"v":-0.028833191598738962,"d":"-2.9%"},{"v":0.012190259462403251,"d":"1.2%"},{"v":-0.013546122993160268,"d":"-1.4%"},{"v":-0.010221147275662174,"d":"-1.0%"},{"v":0.010723534428777992,"d":"1.1%"}]
[null,"PODLASKIE",{"v":-0.2687954532728381,"d":"-26.9%"},{"v":-0.2025620685166769,"d":"-20.3%"},{"v":-0.0638270605832153,"d":"-6.4%"},{"v":0.004985178634134285,"d":"0.5%"},{"v":-0.008828840393667142,"d":"-0.9%"},{"v":-0.019341892498088913,"d":"-1.9%"},{"v":2.674507079806366E-3,"d":"0.3%"},{"v":0.01810472300486954,"d":"1.8%"}]
[null,"ŚWIĘTOKRZYSKIE",{"v":-0.23619647132681063,"d":"-23.6%"},{"v":-0.22612053522554146,"d":"-22.6%"},{"v":-0.1524304639029767,"d":"-15.2%"},{"v":-0.03618625078926933,"d":"-3.6%"},{"v":0.026678089094940547,"d":"2.7%"},{"v":0.1660508107432662,"d":"16.6%"},{"v":0.009225262207076475,"d":"0.9%"},{"v":-0.023413383454306325,"d":"-2.3%"}]
[null,"LUBUSKIE",{"v":-0.16755676907773187,"d":"-16.8%"},{"v":-0.06194318903952623,"d":"-6.2%"},{"v":-0.1249651143976949,"d":"-12.5%"},{"v":-7.738789004161263E-4,"d":"-0.1%"},{"v":-0.014871912870072087,"d":"-1.5%"},{"v":0.03319123726468495,"d":"3.3%"},{"v":-2.844421543658081E-3,"d":"-0.3%"},{"v":4.65051040895062E-3,"d":"0.5%"}]
[null,"WIELKOPOLSKIE",{"v":0.050880299548278975,"d":"5.1%"},{"v":-0.03625521027526302,"d":"-3.6%"},{"v":0.11628363890564025,"d":"11.6%"},{"v":0.010868745031979623,"d":"1.1%"},{"v":0.03196561815791045,"d":"3.2%"},{"v":-0.05243302340015424,"d":"-5.2%"},{"v":-0.011795711882396656,"d":"-1.2%"},{"v":-0.007753756989437442,"d":"-0.8%"}]
[null,"ZACHODNIOPOMORSKIE",{"$f":"(C34-C$40)/C$40","v":{"v":-0.15863169825853354,"d":"-15.9%"}},{"v":-0.003209247114713217,"d":"-0.3%"},{"v":0.07345911026089581,"d":"7.3%"},{"v":-0.022167622178958443,"d":"-2.2%"},{"v":-0.07667636618371143,"d":"-7.7%"},{"v":-0.1330465394330083,"d":"-13.3%"},{"v":0.004575285547373991,"d":"0.5%"},{"v":-1.5663191564119772E-3,"d":"-0.2%"}]
[null,"DOLNOŚLĄSKIE",{"v":0.14005032039711748,"d":"14.0%"},{"v":0.17375985239316608,"d":"17.4%"},{"v":0.04370764356510459,"d":"4.4%"},{"v":-0.010791544132369168,"d":"-1.1%"},{"v":-0.03905164389040492,"d":"-3.9%"},{"v":-0.03352690005655658,"d":"-3.4%"},{"v":0.012950602881990573,"d":"1.3%"},{"v":-0.006997690363813119,"d":"-0.7%"}]
[null,"OPOLSKIE",{"v":-0.18042590668922368,"d":"-18.0%"},{"v":-0.040813585651235336,"d":"-4.1%"},{"v":-0.025507512911328453,"d":"-2.6%"},{"v":0.000625757310402456,"d":"0.1%"},{"v":-0.036709727609405544,"d":"-3.7%"},{"v":-0.10734007361520434,"d":"-10.7%"},{"v":0.019041372435146486,"d":"1.9%"},{"v":0.010277863352401079,"d":"1.0%"}]
[null,"KUJAWSKO-POMORSKIE",{"v":-0.18214170105809618,"d":"-18.2%"},{"v":-0.10769667741323384,"d":"-10.8%"},{"v":0.019210415806114996,"d":"1.9%"},{"v":-0.014971167485619798,"d":"-1.5%"},{"v":-0.023972154857710586,"d":"-2.4%"},{"v":-0.06103280037645496,"d":"-6.1%"},{"v":-3.8146991226529164E-3,"d":"-0.4%"},{"v":0.010135382391460945,"d":"1.0%"}]
[null,"POMORSKIE",{"v":-0.04205000872119342,"d":"-4.2%"},{"v":0.03704517062160022,"d":"3.7%"},{"v":0.06870799959082974,"d":"6.9%"},{"v":0.012530006635433692,"d":"1.3%"},{"v":-0.019290766078392522,"d":"-1.9%"},{"v":-0.11628312887225513,"d":"-11.6%"},{"v":-0.015025944976332199,"d":"-1.5%"},{"v":-0.009733345642077222,"d":"-1.0%"}]
[null,"WARMIŃSKO-MAZURSKIE",{"v":-0.27834285539641684,"d":"-27.8%"},{"v":-0.1204281342372929,"d":"-12.0%"},{"v":-0.0762851872774208,"d":"-7.6%"},{"v":-8.5240744407620746E-4,"d":"-0.1%"},{"v":-0.06914466590902461,"d":"-6.9%"},{"v":-0.03641982338368652,"d":"-3.6%"},{"v":-0.008889714239347452,"d":"-0.9%"},{"v":0.03367707709443174,"d":"3.4%"}]
[]
[null,"Wartości","WDB per capita","WDB na 1 pracującego","Współczynnik dojazdów netto","Udział pracujących wśród aktwnych zawodowo","Współczynnik aktywności zawodowej","Wskaźnik różnicy w metodologii BAEL/demo","Wskaźnik struktury wiekowej","Weryfikacja"]
[null,null,"WDB_i/N_i","WDB_i/Pp_i","Pp_i/Pz_i","Pz_i/Az_i","Az_i/NB15+_i","NB15+_i/N15+_i","Ni15+_i/N_i"]
[null,"ŁÓDZKIE",{"$f":"C43/I43*1000000","v":{"v":32911.79907810021,"d":"32,911.80"}},{"$f":"C43/D43*1000000","v":{"v":87608.57619419375,"d":"87,608.58"}},{"$f":"D43/E43/1000","v":{"v":0.7744708079033285,"d":"0.77"}},{"$f":"E43/F43","v":{"v":0.9070110701107011,"d":"0.91"}},{"$f":"F43/G43","v":{"v":0.5688497061293031,"d":"0.57"}},{"$f":"G43/H43*1000","v":{"v":1.093076721871171,"d":"1.09"}},{"$f":"H43/I43","v":{"v":0.8600806494582388,"d":"0.86"}},{"$f":"IF(PRODUCT(D24:I24)-C24<0.0001,\"prawidłowo\",\"nieprawidłowo\")","v":"prawidłowo"}]
[null,"MAZOWIECKIE",{"$f":"C44/I44*1000000","v":{"v":55939.491494254966,"d":"55,939.49"}},{"$f":"C44/D44*1000000","v":{"v":128319.80663074285,"d":"128,319.81"}},{"$f":"D44/E44/1000","v":{"v":0.9576874961154469,"d":"0.96"}},{"$f":"E44/F44","v":{"v":0.9218390804597701,"d":"0.92"}},{"v":0.5952109464082098,"d":"0.60"},{"$f":"G44/H44*1000","v":{"v":0.980508343824139,"d":"0.98"}},{"$f":"H44/I44","v":{"v":0.8461038700591267,"d":"0.85"}},"prawidłowo"]
[null,"MAŁOPOLSKIE",{"v":31396.296637141913,"d":"31,396.30"},{"v":86245.4342384779,"d":"86,245.43"},{"v":0.944456242569989,"d":"0.94"},{"v":0.9071729957805907,"d":"0.91"},{"v":0.55266226195103,"d":"0.55"},{"v":0.9150533206157636,"d":"0.92"},{"v":0.8401641450509681,"d":"0.84"},"prawidłowo"]
[null,"ŚLĄSKIE",{"v":38089.14876219021,"d":"38,089.15"},{"v":105913.87205896014,"d":"105,913.87"},{"v":0.8747361029874,"d":"0.87"},{"v":0.9074427480916031,"d":"0.91"},{"v":0.5327910523640061,"d":"0.53"},{"v":0.988007537387446,"d":"0.99"},{"v":0.8606666108992453,"d":"0.86"},"prawidłowo"]
[null,"LUBELSKIE",{"v":24735.97479023711,"d":"24,735.97"},{"v":70243.31155627596,"d":"70,243.31"},{"v":0.788467041991642,"d":"0.79"},{"v":0.8973172987974098,"d":"0.90"},{"v":0.5665618448637316,"d":"0.57"},{"v":1.036145625162916,"d":"1.04"},{"v":0.8478642930911198,"d":"0.85"},"prawidłowo"]
[null,"PODKARPACKIE",{"v":24836.906506217212,"d":"24,836.91"},{"v":71432.24868776365,"d":"71,432.25"},{"v":0.8971416924723836,"d":"0.90"},{"v":0.8776595744680851,"d":"0.88"},{"v":0.562200956937799,"d":"0.56"},{"v":0.9347043075221895,"d":"0.93"},{"v":0.8403306827166229,"d":"0.84"},"prawidłowo"]
[null,"PODLASKIE",{"v":25910.463270889988,"d":"25,910.46"},{"v":78091.52595567651,"d":"78,091.53"},{"v":0.8389076554164372,"d":"0.84"},{"v":0.9082217973231358,"d":"0.91"},{"v":0.5505263157894736,"d":"0.55"},{"v":0.9292125852552547,"d":"0.93"},{"v":0.8512792031853933,"d":"0.85"},"prawidłowo"]
[null,"ŚWIĘTOKRZYSKIE",{"v":27065.61845716664,"d":"27,065.62"},{"v":75784.49171283687,"d":"75,784.49"},{"v":0.7595098537803378,"d":"0.76"},{"v":0.8710144927536232,"d":"0.87"},{"v":0.5702479338842975,"d":"0.57"},{"v":1.1048795498665926,"d":"1.10"},{"v":0.8568408501262796,"d":"0.86"},"prawidłowo"]
[null,"LUBUSKIE",{"v":29497.887911739926,"d":"29,497.89"},{"v":91862.05585274563,"d":"91,862.06"},{"v":0.7841216439619926,"d":"0.78"},{"v":0.9030172413793104,"d":"0.90"},{"v":0.5471698113207547,"d":"0.55"},{"v":0.9789898164278648,"d":"0.98"},{"v":0.8465935857414006,"d":"0.85"},"prawidłowo"]
[null,"WIELKOPOLSKIE",{"v":37238.27419485067,"d":"37,238.27"},{"v":94377.62901677474,"d":"94,377.63"},{"v":1.0003054466383667,"d":"1.00"},{"v":0.9135388739946381,"d":"0.91"},{"v":0.5731847867844795,"d":"0.57"},{"v":0.8978574217591244,"d":"0.90"},{"v":0.8389938639441096,"d":"0.84"},"prawidłowo"]
[null,"ZACHODNIOPOMORSKIE",{"v":29814.150605518305,"d":"29,814.15"},{"v":97613.75510007025,"d":"97,613.76"},{"v":0.9619302454260164,"d":"0.96"},{"v":0.8836833602584814,"d":"0.88"},{"v":0.5128417564208783,"d":"0.51"},{"v":0.8214729070476522,"d":"0.82"},{"v":0.852892980306361,"d":"0.85"},"prawidłowo"]
[null,"DOLNOŚLĄSKIE",{"v":40398.04195123256,"d":"40,398.04"},{"v":114943.99044749838,"d":"114,943.99"},{"v":0.9352698580978853,"d":"0.94"},{"v":0.8939641109298532,"d":"0.89"},{"v":0.5337396604266434,"d":"0.53"},{"v":0.9157717260562771,"d":"0.92"},{"v":0.8600036961136291,"d":"0.86"},"prawidłowo"]
[null,"OPOLSKIE",{"v":29041.86596972237,"d":"29,041.87"},{"v":93931.23629461476,"d":"93,931.24"},{"v":0.873245928336468,"d":"0.87"},{"v":0.9042821158690176,"d":"0.90"},{"v":0.5350404312668463,"d":"0.54"},{"v":0.8458308064802951,"d":"0.85"},{"v":0.8651748113812319,"d":"0.87"},"prawidłowo"]
[null,"KUJAWSKO-POMORSKIE",{"v":28981.066256189326,"d":"28,981.07"},{"v":87381.50685471637,"d":"87,381.51"},{"v":0.9133178115921412,"d":"0.91"},{"v":0.8901869158878505,"d":"0.89"},{"v":0.5421152628245726,"d":"0.54"},{"v":0.8897087908187011,"d":"0.89"},{"v":0.8457698118063068,"d":"0.85"},"prawidłowo"]
[null,"POMORSKIE",{"v":33945.25947011167,"d":"33,945.26"},{"v":101555.79094182994,"d":"101,555.79"},{"v":0.9576727595011058,"d":"0.96"},{"v":0.9150401836969001,"d":"0.92"},{"v":0.5447154471544715,"d":"0.54"},{"v":0.837356905707014,"d":"0.84"},{"v":0.8362513685132472,"d":"0.84"},"prawidłowo"]
[null,"WARMIŃSKO-MAZURSKIE",{"v":25572.148071452764,"d":"25,572.15"},{"v":86134.74036446399,"d":"86,134.74"},{"v":0.8277438870400219,"d":"0.83"},{"v":0.902946273830156,"d":"0.90"},{"v":0.5170250896057348,"d":"0.52"},{"v":0.9130305660707697,"d":"0.91"},{"v":0.8414610807134262,"d":"0.84"},"prawidłowo"]
[null,"POLSKA",{"v":35435.31476501895,"d":"35,435.31"},{"v":97928.03034891706,"d":"97,928.03"},{"v":0.8961032946958052,"d":"0.90"},{"v":0.9037166085946574,"d":"0.90"},{"v":0.5554301196658388,"d":"0.56"},{"v":0.9475397981691024,"d":"0.95"},{"v":0.8490085238774671,"d":"0.85"},{"$f":"IF(PRODUCT(D40:I40)-C40<0.0001,\"prawidłowo\",\"nieprawidłowo\")","v":"prawidłowo"}]
[]
[null,"Dane","WDB_i","PP_i","PZ_i","AZ_i","NB15+_i","N15+_i","N_i"]
[null,"ŁÓDZKIE",83388,951824.6229131906,1229,1355,2382,2179170,2533681]
[null,"MAZOWIECKIE",295674,2304196.1156537654,2406,2610,4385,4472170,5285604]
[null,"MAŁOPOLSKIE",105077,1218348.5529152858,1290,1422,2573,2811858,3346796]
[null,"ŚLĄSKIE",176214,1663748.067882035,1902,2096,3934,3981751,4626357]
[null,"LUBELSKIE",53723,764813.0307318927,970,1081,1908,1841440,2171857]
[null,"PODKARPACKIE",52870,740141.8962897165,825,940,1672,1788801,2128687]
[null,"PODLASKIE",31118,398481.13632280764,475,523,950,1022371,1200982]
[null,"ŚWIĘTOKRZYSKIE",34593,456465.42212198296,601,690,1210,1095142,1278116]
[null,"LUBUSKIE",30181,328546.9688200749,419,464,848,866199,1023158]
[null,"WIELKOPOLSKIE",128676,1363416.323768094,1363,1492,2603,2899124,3455477]
[null,"ZACHODNIOPOMORSKIE",51362,526175.8442480309,547,619,1207,1469312,1722739]
[null,"DOLNOŚLĄSKIE",117824,1025055.7644752823,1096,1226,2297,2508267,2916577]
[null,"OPOLSKIE",29447,313495.288272792,359,397,742,877244,1013950]
[null,"KUJAWSKO-POMORSKIE",60813,695948.1724332116,762,856,1579,1774738,2098370]
[null,"POMORSKIE",77514,763265.1893223813,797,871,1599,1909580,2283500]
[null,"WARMIŃSKO-MAZURSKIE",37146,431254.56514785136,521,577,1116,1222303,1452596]
[null,"POLSKA",1365622,13945159.47205612,15562,17220,31003,32719470,38538447]

{"sheet":"2010","index":6,"n_rows":59,"n_cols":10,"rows_kept":59,"hidden":true,"merged":[[0,0,0,10],[1,0,1,10],[2,1,3,1],[21,1,22,1]]}
["DEKOMPOZYCJA RÓŻNIC W POZIOMIE WDB PER CAPITA"]
[2010]
[null,"Różnice względem średniej","WDB per capita","WDB na 1 pracującego","Współczynnik dojazdów netto","Udział pracujących wśród aktwnych zawodowo","Współczynnik aktywności zawodowej","Wskaźnik różnicy w metodologii BAEL/demo","Wskaźnik struktury wiekowej","Interakcje"]
[null,null,"WDB_i/N_i","WDB_i/Pp_i","Pp_i/Pz_i","Pz_i/Az_i","Az_i/NB15+_i","NB15+_i/N15+_i","Ni15+_i/N_i"]
[null,"ŁÓDZKIE",{"$f":"(C24-C$40)/C$40","v":{"v":-0.07004665326469413,"d":"-7.0%"}},{"$f":"(D24-D$40)/D$40","v":{"v":-0.10777518857573846,"d":"-10.8%"}},{"$f":"(E24-E$40)/E$40","v":{"v":-0.12629135369760214,"d":"-12.6%"}},{"$f":"(F24-F$40)/F$40","v":{"v":0.004384735180738388,"d":"0.4%"}},{"$f":"(G24-G$40)/G$40","v":{"v":0.01768001514505973,"d":"1.8%"}},{"$f":"(H24-H$40)/H$40","v":{"v":0.15163748399942725,"d":"15.2%"}},{"$f":"(I24-I$40)/I$40","v":{"v":0.013428445814362186,"d":"1.3%"}},{"$f":"C5-SUM(D5:I5)","v":{"v":-0.023110791130941083,"d":"-2.3%"}}]
[null,"MAZOWIECKIE",{"$f":"(C25-C$40)/C$40","v":{"v":0.5842080295362513,"d":"58.4%"}},{"v":0.3107236504360945,"d":"31.1%"},{"v":0.0981568639049425,"d":"9.8%"},{"v":0.02516983424060842,"d":"2.5%"},{"v":0.04898501966964195,"d":"4.9%"},{"v":0.025532415495725824,"d":"2.6%"},{"v":-2.0191749851921612E-3,"d":"-0.2%"},{"$f":"C6-SUM(D6:I6)","v":{"v":0.07765942077443011,"d":"7.8%"}}]
[null,"MAŁOPOLSKIE",{"v":-0.12355249955770466,"d":"-12.4%"},{"v":-0.12861825930905912,"d":"-12.9%"},{"v":0.07049780095845504,"d":"7.0%"},{"v":0.005235531539415757,"d":"0.5%"},{"v":-0.010389008658568118,"d":"-1.0%"},{"v":-0.04531107858206701,"d":"-4.5%"},{"v":-0.010678498589507458,"d":"-1.1%"},{"v":-0.004288986916373735,"d":"-0.4%"}]
[null,"ŚLĄSKIE",{"v":0.06972912353466874,"d":"7.0%"},{"v":0.07586319129987701,"d":"7.6%"},{"v":0.028170029595695534,"d":"2.8%"},{"v":0.006033971199097533,"d":"0.6%"},{"v":-0.0542762671913549,"d":"-5.4%"},{"v":1.7970923470626704E-3,"d":"0.2%"},{"v":0.01460063458953056,"d":"1.5%"},{"v":-2.4595283052396555E-3,"d":"-0.2%"}]
[null,"LUBELSKIE",{"v":-0.3063710724771434,"d":"-30.6%"},{"v":-0.2837204870090928,"d":"-28.4%"},{"v":-0.14074024490099152,"d":"-14.1%"},{"v":-0.002610196377933059,"d":"-0.3%"},{"v":0.011145033044326168,"d":"1.1%"},{"v":0.1201408117682917,"d":"12.0%"},{"v":-2.3706943929436407E-3,"d":"-0.2%"},{"v":-0.008215294608800217,"d":"-0.8%"}]
[null,"PODKARPACKIE",{"v":-0.30440331641374613,"d":"-30.4%"},{"v":-0.26775085531285,"d":"-26.8%"},{"v":-0.026646450413475742,"d":"-2.7%"},{"v":-0.023348608277193567,"d":"-2.3%"},{"v":0.023623984180717386,"d":"2.4%"},{"v":-0.011725026849531844,"d":"-1.2%"},{"v":-0.012197345847177061,"d":"-1.2%"},{"v":0.013640986105764696,"d":"1.4%"}]
[null,"PODLASKIE",{"v":-0.2680227335396461,"d":"-26.8%"},{"v":-0.1986938624864242,"d":"-19.9%"},{"v":-0.06862379423493215,"d":"-6.9%"},{"v":-0.004656332859185082,"d":"-0.5%"},{"v":-0.017791106313266542,"d":"-1.8%"},{"v":2.2165016871123267E-3,"d":"0.2%"},{"v":0.001003316048190765,"d":"0.1%"},{"v":0.018522544618858716,"d":"1.9%"}]
[null,"ŚWIĘTOKRZYSKIE",{"v":-0.22483741956257677,"d":"-22.5%"},{"v":-0.21081642340774087,"d":"-21.1%"},{"v":-0.16929381143833375,"d":"-16.9%"},{"v":-0.02468573472319033,"d":"-2.5%"},{"v":0.023121861993554982,"d":"2.3%"},{"v":0.17551884646024735,"d":"17.6%"},{"v":0.008012175141119312,"d":"0.8%"},{"v":-0.02669433358823342,"d":"-2.7%"}]
[null,"LUBUSKIE",{"v":-0.15304036408569155,"d":"-15.3%"},{"v":-0.04474836120778872,"d":"-4.5%"},{"v":-0.1487736125459482,"d":"-14.9%"},{"v":-0.007042361340597219,"d":"-0.7%"},{"v":-3.0640597999040445E-3,"d":"-0.3%"},{"v":0.05529273820000957,"d":"5.5%"},{"v":-2.9224902934628315E-3,"d":"-0.3%"},{"v":-1.7822170980001106E-3,"d":"-0.2%"}]
[null,"WIELKOPOLSKIE",{"v":0.05087833292268709,"d":"5.1%"},{"v":-0.03325363850692746,"d":"-3.3%"},{"v":0.11784351816829096,"d":"11.8%"},{"v":0.010538600920884517,"d":"1.1%"},{"v":0.04501442275210611,"d":"4.5%"},{"v":-0.06857987539577683,"d":"-6.9%"},{"v":-0.011360246505697932,"d":"-1.1%"},{"v":-0.00932444851019229,"d":"-0.9%"}]
[null,"ZACHODNIOPOMORSKIE",{"v":-0.14185506993742852,"d":"-14.2%"},{"v":0.014095084779516969,"d":"1.4%"},{"v":0.038608560520617494,"d":"3.9%"},{"v":-0.03083311221751534,"d":"-3.1%"},{"v":-0.054981869149947196,"d":"-5.5%"},{"v":-0.11374887016457667,"d":"-11.4%"},{"v":0.003770793495734773,"d":"0.4%"},{"v":1.2343427987414335E-3,"d":"0.1%"}]
[null,"DOLNOŚLĄSKIE",{"v":0.1259988190536555,"d":"12.6%"},{"v":0.16191502353025045,"d":"16.2%"},{"v":2.0355796713784576E-3,"d":"0.2%"},{"v":-0.018920079573211786,"d":"-1.9%"},{"v":-0.02016706247077161,"d":"-2.0%"},{"v":-0.007331447372085404,"d":"-0.7%"},{"v":0.013490635042012243,"d":"1.3%"},{"v":-0.005023829773916855,"d":"-0.5%"}]
[null,"OPOLSKIE",{"v":-0.17685014855176265,"d":"-17.7%"},{"v":-0.035906182357073366,"d":"-3.6%"},{"v":-0.039153827990943114,"d":"-3.9%"},{"v":0.004273411749499116,"d":"0.4%"},{"v":-0.038371929754802865,"d":"-3.8%"},{"v":-0.09617738523473145,"d":"-9.6%"},{"v":0.018036716078876452,"d":"1.8%"},{"v":0.01044904895741261,"d":"1.0%"}]
[null,"KUJAWSKO-POMORSKIE",{"v":-0.1693386426028342,"d":"-16.9%"},{"v":-0.09640788984215615,"d":"-9.6%"},{"v":-0.004132301560024579,"d":"-0.4%"},{"v":-0.012656109458500308,"d":"-1.3%"},{"v":-0.01717294685962194,"d":"-1.7%"},{"v":-0.044261855951396506,"d":"-4.4%"},{"v":-0.004673730510654611,"d":"-0.5%"},{"v":0.00996619157951989,"d":"1.0%"}]
[null,"POMORSKIE",{"v":-0.041167116581311926,"d":"-4.1%"},{"v":0.026129649770137535,"d":"2.6%"},{"v":0.060712103467760764,"d":"6.1%"},{"v":2.0732075329593265E-3,"d":"0.2%"},{"v":0.004492641476376879,"d":"0.4%"},{"v":-0.11177009831994761,"d":"-11.2%"},{"v":-0.01469302027187441,"d":"-1.5%"},{"v":-0.008111600236724407,"d":"-0.8%"}]
[null,"WARMIŃSKO-MAZURSKIE",{"v":-0.27282424184262266,"d":"-27.3%"},{"v":-0.11584057789124377,"d":"-11.6%"},{"v":-0.12539333454509471,"d":"-12.5%"},{"v":-7.5013946194896078E-4,"d":"-0.1%"},{"v":-0.04252669911753475,"d":"-4.3%"},{"v":-0.007074568368903356,"d":"-0.7%"},{"v":-0.010128940782836764,"d":"-1.0%"},{"v":0.028890018324939648,"d":"2.9%"}]
[]
[null,"Wartości","WDB per capita","WDB na 1 pracującego","Współczynnik dojazdów netto","Udział pracujących wśród aktwnych zawodowo","Współczynnik aktywności zawodowej","Wskaźnik różnicy w metodologii BAEL/demo","Wskaźnik struktury wiekowej","Weryfikacja"]
[null,null,"WDB_i/N_i","WDB_i/Pp_i","Pp_i/Pz_i","Pz_i/Az_i","Az_i/NB15+_i","NB15+_i/N15+_i","Ni15+_i/N_i"]
[null,"ŁÓDZKIE",{"$f":"C43/I43*1000000","v":{"v":30553.768118450178,"d":"30,553.77"}},{"$f":"C43/D43*1000000","v":{"v":81650.0171461907,"d":"81,650.02"}},{"$f":"D43/E43/1000","v":{"v":0.7811082757141318,"d":"0.78"}},{"$f":"E43/F43","v":{"v":0.9076005961251863,"d":"0.91"}},{"$f":"F43/G43","v":{"v":0.5629194630872483,"d":"0.56"}},{"$f":"G43/H43*1000","v":{"v":1.0910810077304736,"d":"1.09"}},{"$f":"H43/I43","v":{"v":0.8594076704389019,"d":"0.86"}},{"$f":"IF(PRODUCT(D24:I24)-C24<0.0001,\"prawidłowo\",\"nieprawidłowo\")","v":"prawidłowo"}]
[null,"MAZOWIECKIE",{"$f":"C44/I44*1000000","v":{"v":52049.41189336315,"d":"52,049.41"}},{"$f":"C44/D44*1000000","v":{"v":119948.03009477782,"d":"119,948.03"}},{"$f":"D44/E44/1000","v":{"v":0.9817682565676974,"d":"0.98"}},{"$f":"E44/F44","v":{"v":0.9263828093911659,"d":"0.93"}},{"v":0.5802355114292311,"d":"0.58"},{"$f":"G44/H44*1000","v":{"v":0.9716069135518862,"d":"0.97"}},{"$f":"H44/I44","v":{"v":0.846307777831782,"d":"0.85"}},{"$f":"IF(PRODUCT(D25:I25)-C25<0.0001,\"prawidłowo\",\"nieprawidłowo\")","v":"prawidłowo"}]
[null,"MAŁOPOLSKIE",{"v":28795.824855643255,"d":"28,795.82"},{"v":79742.60876551784,"d":"79,742.61"},{"v":0.957040650794958,"d":"0.96"},{"v":0.9083694083694084,"d":"0.91"},{"v":0.54739336492891,"d":"0.55"},{"v":0.9044885781525285,"d":"0.90"},{"v":0.838964497546827,"d":"0.84"},"prawidłowo"]
[null,"ŚLĄSKIE",{"v":35146.12394780078,"d":"35,146.12"},{"v":98455.28491453217,"d":"98,455.28"},{"v":0.9191990057066206,"d":"0.92"},{"v":0.9090909090909091,"d":"0.91"},{"v":0.523117569352708,"d":"0.52"},{"v":0.9491196633019936,"d":"0.95"},{"v":0.8604017100563438,"d":"0.86"},"prawidłowo"]
[null,"LUBELSKIE",{"v":22789.2909748459,"d":"22,789.29"},{"v":65548.7650290896,"d":"65,548.77"},{"v":0.7681907561936092,"d":"0.77"},{"v":0.9012797074954296,"d":"0.90"},{"v":0.5593047034764826,"d":"0.56"},{"v":1.0612405228942567,"d":"1.06"},{"v":0.8460096823159343,"d":"0.85"},"prawidłowo"]
[null,"PODKARPACKIE",{"v":22853.941919633377,"d":"22,853.94"},{"v":67010.19121352301,"d":"67,010.19"},{"v":0.8701922728994207,"d":"0.87"},{"v":0.8825396825396825,"d":"0.88"},{"v":0.5662073097663272,"d":"0.57"},{"v":0.9363085767885233,"d":"0.94"},{"v":0.837676484575751,"d":"0.84"},"prawidłowo"]
[null,"PODLASKIE",{"v":24049.231873749428,"d":"24,049.23"},{"v":73329.7920317756,"d":"73,329.79"},{"v":0.8326639151451487,"d":"0.83"},{"v":0.8994307400379506,"d":"0.90"},{"v":0.5432989690721649,"d":"0.54"},{"v":0.9495170188689588,"d":"0.95"},{"v":0.8488709109159681,"d":"0.85"},"prawidłowo"]
[null,"ŚWIĘTOKRZYSKIE",{"v":25468.092372515293,"d":"25,468.09"},{"v":72220.42217968506,"d":"72,220.42"},{"v":0.7426634511613631,"d":"0.74"},{"v":0.8813314037626628,"d":"0.88"},{"v":0.5659295659295659,"d":"0.57"},{"v":1.1137066181172064,"d":"1.11"},{"v":0.8548145641559834,"d":"0.85"},"prawidłowo"]
[null,"LUBUSKIE",{"v":27826.99628132895,"d":"27,827.00"},{"v":87417.78046029121,"d":"87,417.78"},{"v":0.761008808325878,"d":"0.76"},{"v":0.8972746331236897,"d":"0.90"},{"v":0.5514450867052023,"d":"0.55"},{"v":0.9998023512114945,"d":"1.00"},{"v":0.8455417483129156,"d":"0.85"},"prawidłowo"]
[null,"WIELKOPOLSKIE",{"v":34526.77816316554,"d":"34,526.78"},{"v":88469.6950602874,"d":"88,469.70"},{"v":0.9993684126738579,"d":"1.00"},{"v":0.9131614654002713,"d":"0.91"},{"v":0.5780392156862745,"d":"0.58"},{"v":0.8824433229147346,"d":"0.88"},{"v":0.8383863616252435,"d":"0.84"},"prawidłowo"]
[null,"ZACHODNIOPOMORSKIE",{"v":28194.49093570322,"d":"28,194.49"},{"v":92802.71070689005,"d":"92,802.71"},{"v":0.9285312046338731,"d":"0.93"},{"v":0.8757763975155279,"d":"0.88"},{"v":0.5227272727272727,"d":"0.52"},{"v":0.8396494463561464,"d":"0.84"},{"v":0.8512177873590058,"d":"0.85"},"prawidłowo"]
[null,"DOLNOŚLĄSKIE",{"v":36994.87392544054,"d":"36,994.87"},{"v":106330.1315754934,"d":"106,330.13"},{"v":0.8958344262172067,"d":"0.90"},{"v":0.8865414710485133,"d":"0.89"},{"v":0.5419847328244275,"d":"0.54"},{"v":0.9404711289721743,"d":"0.94"},{"v":0.8594604081526318,"d":"0.86"},"prawidłowo"]
[null,"OPOLSKIE",{"v":27044.72194887937,"d":"27,044.72"},{"v":88226.95326688254,"d":"88,226.95"},{"v":0.8590104948838466,"d":"0.86"},{"v":0.9075,"d":"0.91"},{"v":0.5319148936170213,"d":"0.53"},{"v":0.8562969710772034,"d":"0.86"},{"v":0.8633155761515707,"d":"0.86"},"prawidłowo"]
[null,"KUJAWSKO-POMORSKIE",{"v":27291.513695787555,"d":"27,291.51"},{"v":82690.27081838042,"d":"82,690.27"},{"v":0.8903202504174592,"d":"0.89"},{"v":0.8922018348623854,"d":"0.89"},{"v":0.543640897755611,"d":"0.54"},{"v":0.9054826295802659,"d":"0.91"},{"v":0.8440566614460019,"d":"0.84"},"prawidłowo"]
[null,"POMORSKIE",{"v":31502.60998271145,"d":"31,502.61"},{"v":93904.02780236799,"d":"93,904.03"},{"v":0.9482920944816321,"d":"0.95"},{"v":0.905511811023622,"d":"0.91"},{"v":0.555625,"d":"0.56"},{"v":0.8415241685741214,"d":"0.84"},{"v":0.8355601025535554,"d":"0.84"},"prawidłowo"]
[null,"WARMIŃSKO-MAZURSKIE",{"v":23891.477539273426,"d":"23,891.48"},{"v":80911.9305479818,"d":"80,911.93"},{"v":0.781911117937042,"d":"0.78"},{"v":0.9029605263157895,"d":"0.90"},{"v":0.5296167247386759,"d":"0.53"},{"v":0.9407145005240305,"d":"0.94"},{"v":0.839430533601324,"d":"0.84"},"prawidłowo"]
[null,"POLSKA",{"v":32855.1622785296,"d":"32,855.16"},{"v":91512.8296150524,"d":"91,512.83"},{"v":0.8940145882953568,"d":"0.89"},{"v":0.9036383811248029,"d":"0.90"},{"v":0.553139940560796,"d":"0.55"},{"v":0.9474170673407989,"d":"0.95"},{"v":0.8480200787617584,"d":"0.85"},"prawidłowo"]
[]
[null,"Dane","WDB_i","PP_i","PZ_i","AZ_i","NB15+_i","N15+_i","N_i"]
[null,"ŁÓDZKIE",77681,951389.8798198125,1218,1342,2384,2184989,2542436]
[null,"MAZOWIECKIE",274148,2285556.5012895996,2328,2513,4331,4457564,5267072]
[null,"MAŁOPOLSKIE",96083,1204914.1793508523,1259,1386,2532,2799372,3336699]
[null,"ŚLĄSKIE",162900,1654558.210271917,1800,1980,3785,3987906,4634935]
[null,"LUBELSKIE",49649,757436.0856068986,986,1094,1956,1843126,2178611]
[null,"PODKARPACKIE",48632,725740.3555981169,834,945,1669,1782532,2127948]
[null,"PODLASKIE",28942,394682.6957788005,474,527,970,1021572,1203448]
[null,"ŚWIĘTOKRZYSKIE",32664,452282.0417572701,609,691,1221,1096339,1282546]
[null,"LUBUSKIE",28473,325711.7699634758,428,477,865,865171,1023215]
[null,"WIELKOPOLSKIE",119005,1345149.8834590127,1346,1474,2550,2889704,3446745]
[null,"ZACHODNIOPOMORSKIE",48600,523691.59941350436,564,644,1232,1467279,1723741]
[null,"DOLNOŚLĄSKIE",107923,1014980.4049040951,1133,1278,2358,2507254,2917242]
[null,"OPOLSKIE",27511,311820.80964283634,363,400,752,878200,1017241]
[null,"KUJAWSKO-POMORSKIE",57277,692669.1548247832,778,872,1604,1771431,2098711]
[null,"POMORSKIE",71684,763375.1360577139,805,889,1600,1901312,2275494]
[null,"WARMIŃSKO-MAZURSKIE",34733,429269.20374743605,549,608,1148,1220349,1453782]
[null,"POLSKA",1265905,13833087.724694056,15473,17123,30956,32674100,38529866]

{"sheet":"2009","index":7,"n_rows":59,"n_cols":10,"rows_kept":59,"hidden":true,"merged":[[0,0,0,10],[1,0,1,10],[2,1,3,1],[21,1,22,1]]}
["DEKOMPOZYCJA RÓŻNIC W POZIOMIE WDB PER CAPITA"]
[2009]
[null,"Różnice względem średniej","WDB per capita","WDB na 1 pracującego","Współczynnik dojazdów netto","Udział pracujących wśród aktwnych zawodowo","Współczynnik aktywności zawodowej","Wskaźnik różnicy w metodologii BAEL/demo","Wskaźnik struktury wiekowej","Interakcje"]
[null,null,"WDB_i/N_i","WDB_i/Pp_i","Pp_i/Pz_i","Pz_i/Az_i","Az_i/NB15+_i","NB15+_i/N15+_i","Ni15+_i/N_i"]
[null,"ŁÓDZKIE",{"$f":"(C24-C$40)/C$40","v":{"v":-0.08089345497876795,"d":"-8.1%"}},{"$f":"(D24-D$40)/D$40","v":{"v":-0.1146888537282791,"d":"-11.5%"}},{"$f":"(E24-E$40)/E$40","v":{"v":-0.14092926339106635,"d":"-14.1%"}},{"$f":"(F24-F$40)/F$40","v":{"v":0.006980363153580212,"d":"0.7%"}},{"$f":"(G24-G$40)/G$40","v":{"v":-2.0811527616516423E-4,"d":"-0.0%"}},{"$f":"(H24-H$40)/H$40","v":{"v":0.18461490001848327,"d":"18.5%"}},{"$f":"(I24-I$40)/I$40","v":{"v":0.013288704477366828,"d":"1.3%"}},{"$f":"C5-SUM(D5:I5)","v":{"v":-0.02995119023268765,"d":"-3.0%"}}]
[null,"MAZOWIECKIE",{"$f":"(C25-C$40)/C$40","v":{"v":0.5533135661188224,"d":"55.3%"}},{"v":0.2814615603666124,"d":"28.1%"},{"v":0.061526485449846124,"d":"6.2%"},{"v":0.023353121113417506,"d":"2.3%"},{"v":0.07142054627033564,"d":"7.1%"},{"v":0.0411847359425586,"d":"4.1%"},{"v":2.5201747358932563E-4,"d":"0.0%"},{"$f":"C6-SUM(D6:I6)","v":{"v":0.07411509950246276,"d":"7.4%"}}]
[null,"MAŁOPOLSKIE",{"v":-0.11318085405805604,"d":"-11.3%"},{"v":-0.1112823883496983,"d":"-11.1%"},{"v":0.055736484640954397,"d":"5.6%"},{"v":2.365544268550479E-3,"d":"0.2%"},{"v":-0.011323853634439409,"d":"-1.1%"},{"v":-0.036479767224810354,"d":"-3.6%"},{"v":-0.010137847612651832,"d":"-1.0%"},{"v":-2.0590261459610126E-3,"d":"-0.2%"}]
[null,"ŚLĄSKIE",{"v":0.06436062430687349,"d":"6.4%"},{"v":0.08784249225367256,"d":"8.8%"},{"v":0.01702984102388281,"d":"1.7%"},{"v":0.015150644655851423,"d":"1.5%"},{"v":-0.04375011993416224,"d":"-4.4%"},{"v":-0.023476989069232092,"d":"-2.3%"},{"v":0.014856680565524936,"d":"1.5%"},{"v":-3.291925188663905E-3,"d":"-0.3%"}]
[null,"LUBELSKIE",{"v":-0.3081149249827883,"d":"-30.8%"},{"v":-0.2921642182150842,"d":"-29.2%"},{"v":-0.10643467081170781,"d":"-10.6%"},{"v":-0.01720430331964261,"d":"-1.7%"},{"v":0.014959822283162652,"d":"1.5%"},{"v":0.10083281275858783,"d":"10.1%"},{"v":-3.8111495845671198E-3,"d":"-0.4%"},{"v":-4.293218093536999E-3,"d":"-0.4%"}]
[null,"PODKARPACKIE",{"v":-0.2929617013395242,"d":"-29.3%"},{"v":-0.25407554884070327,"d":"-25.4%"},{"v":-0.06630535974179151,"d":"-6.6%"},{"v":-0.021343578577983226,"d":"-2.1%"},{"v":0.031035653697607794,"d":"3.1%"},{"v":0.017728939244064032,"d":"1.8%"},{"v":-0.011430579327684997,"d":"-1.1%"},{"v":0.011428772206966975,"d":"1.1%"}]
[null,"PODLASKIE",{"v":-0.26246469971319547,"d":"-26.2%"},{"v":-0.215184001052765,"d":"-21.5%"},{"v":-0.06290176837486341,"d":"-6.3%"},{"v":0.011496076113970858,"d":"1.1%"},{"v":2.968707465495286E-4,"d":"0.0%"},{"v":-0.009955033184017309,"d":"-1.0%"},{"v":1.110030182030057E-3,"d":"0.1%"},{"v":0.012673125855899803,"d":"1.3%"}]
[null,"ŚWIĘTOKRZYSKIE",{"v":-0.206480677508491,"d":"-20.6%"},{"v":-0.21293693573894248,"d":"-21.3%"},{"v":-0.08688131960758398,"d":"-8.7%"},{"v":-0.029233928282672385,"d":"-2.9%"},{"v":0.01950374078281729,"d":"2.0%"},{"v":0.10836437539212669,"d":"10.8%"},{"v":0.006548660981909356,"d":"0.7%"},{"v":-0.011845271036145466,"d":"-1.2%"}]
[null,"LUBUSKIE",{"v":-0.14378532860712823,"d":"-14.4%"},{"v":-0.02081769743082718,"d":"-2.1%"},{"v":-0.09786956087558006,"d":"-9.8%"},{"v":-0.015069291261387997,"d":"-1.5%"},{"v":-0.02459013005051553,"d":"-2.5%"},{"v":0.013143946690554105,"d":"1.3%"},{"v":-4.16864873248561E-3,"d":"-0.4%"},{"v":0.005586053053114021,"d":"0.6%"}]
[null,"WIELKOPOLSKIE",{"v":0.07686973089168082,"d":"7.7%"},{"v":-3.835286730326402E-3,"d":"-0.4%"},{"v":0.1800373952086311,"d":"18.0%"},{"v":0.008208748776271192,"d":"0.8%"},{"v":0.021085062792985627,"d":"2.1%"},{"v":-0.09997207645151822,"d":"-10.0%"},{"v":-0.011292389279702143,"d":"-1.1%"},{"v":-0.017361723424660344,"d":"-1.7%"}]
[null,"ZACHODNIOPOMORSKIE",{"v":-0.12464111257224636,"d":"-12.5%"},{"v":0.01097150560223692,"d":"1.1%"},{"v":0.01919397206314107,"d":"1.9%"},{"v":-0.022198413198602288,"d":"-2.2%"},{"v":-0.05115058660313063,"d":"-5.1%"},{"v":-0.08599383811236677,"d":"-8.6%"},{"v":1.8281467595897803E-3,"d":"0.2%"},{"v":2.7081009168855585E-3,"d":"0.3%"}]
[null,"DOLNOŚLĄSKIE",{"v":0.09327194213201186,"d":"9.3%"},{"v":0.12808358457271413,"d":"12.8%"},{"v":0.013088776522117724,"d":"1.3%"},{"v":-0.020594144803522004,"d":"-2.1%"},{"v":-0.01780610890243588,"d":"-1.8%"},{"v":-0.018561469736927568,"d":"-1.9%"},{"v":0.0132494815403783,"d":"1.3%"},{"v":-0.004188177060312853,"d":"-0.4%"}]
[null,"OPOLSKIE",{"v":-0.17573816040546197,"d":"-17.6%"},{"v":-0.03432494596662637,"d":"-3.4%"},{"v":-0.049666522581231456,"d":"-5.0%"},{"v":-0.020418119308339325,"d":"-2.0%"},{"v":-0.0222240166060542,"d":"-2.2%"},{"v":-0.07954675169506513,"d":"-8.0%"},{"v":0.018770378906441013,"d":"1.9%"},{"v":0.011671816845413518,"d":"1.2%"}]
[null,"KUJAWSKO-POMORSKIE",{"v":-0.1604590437017271,"d":"-16.0%"},{"v":-0.10001483030098682,"d":"-10.0%"},{"v":-0.03326062423757058,"d":"-3.3%"},{"v":-0.022852461082750294,"d":"-2.3%"},{"v":-0.002246618021656937,"d":"-0.2%"},{"v":-0.004288731199380918,"d":"-0.4%"},{"v":-0.006013803486808486,"d":"-0.6%"},{"v":0.008218024627426934,"d":"0.8%"}]
[null,"POMORSKIE",{"v":-0.0180321475328392,"d":"-1.8%"},{"v":0.057479344490183895,"d":"5.7%"},{"v":0.08974649759868501,"d":"9.0%"},{"v":0.021736204767450126,"d":"2.2%"},{"v":-0.047181972491027735,"d":"-4.7%"},{"v":-0.11082619330807704,"d":"-11.1%"},{"v":-0.015616135931452472,"d":"-1.6%"},{"v":-0.013369892658601003,"d":"-1.3%"}]
[null,"WARMIŃSKO-MAZURSKIE",{"v":-0.2627814501642948,"d":"-26.3%"},{"v":-0.09674516282112909,"d":"-9.7%"},{"v":-0.1399167288820298,"d":"-14.0%"},{"v":-3.0874530715434096E-3,"d":"-0.3%"},{"v":-0.044564393598969146,"d":"-4.5%"},{"v":9.443071682988113E-3,"d":"0.9%"},{"v":-0.013027295659044943,"d":"-1.3%"},{"v":0.02511651218543337,"d":"2.5%"}]
[]
[null,"Wartości","WDB per capita","WDB na 1 pracującego","Współczynnik dojazdów netto","Udział pracujących wśród aktwnych zawodowo","Współczynnik aktywności zawodowej","Wskaźnik różnicy w metodologii BAEL/demo","Wskaźnik struktury wiekowej","Weryfikacja"]
[null,null,"WDB_i/N_i","WDB_i/Pp_i","Pp_i/Pz_i","Pz_i/Az_i","Az_i/NB15+_i","NB15+_i/N15+_i","Ni15+_i/N_i"]
[null,"ŁÓDZKIE",{"$f":"C43/I43*1000000","v":{"v":29131.744348170927,"d":"29,131.74"}},{"$f":"C43/D43*1000000","v":{"v":76169.44064151522,"d":"76,169.44"}},{"$f":"D43/E43/1000","v":{"v":0.7612751777512992,"d":"0.76"}},{"$f":"E43/F43","v":{"v":0.9246922519913107,"d":"0.92"}},{"$f":"F43/G43","v":{"v":0.5491053677932406,"d":"0.55"}},{"$f":"G43/H43*1000","v":{"v":1.1508317104242016,"d":"1.15"}},{"$f":"H43/I43","v":{"v":0.8597641386212779,"d":"0.86"}},{"$f":"IF(PRODUCT(D24:I24)-C24<0.0001,\"prawidłowo\",\"nieprawidłowo\")","v":"prawidłowo"}]
[null,"MAZOWIECKIE",{"$f":"C44/I44*1000000","v":{"v":49233.39295736808,"d":"49,233.39"}},{"$f":"C44/D44*1000000","v":{"v":110253.0005047176,"d":"110,253.00"}},{"$f":"D44/E44/1000","v":{"v":0.9406836124909388,"d":"0.94"}},{"$f":"E44/F44","v":{"v":0.9397270659590599,"d":"0.94"}},{"v":0.5884452375641311,"d":"0.59"},{"$f":"G44/H44*1000","v":{"v":1.0114919291608182,"d":"1.01"}},{"$f":"H44/I44","v":{"v":0.8487026554302074,"d":"0.85"}},{"$f":"IF(PRODUCT(D25:I25)-C25<0.0001,\"prawidłowo\",\"nieprawidłowo\")","v":"prawidłowo"}]
[null,"MAŁOPOLSKIE",{"v":28108.371964696646,"d":"28,108.37"},{"v":76462.52241682538,"d":"76,462.52"},{"v":0.9355527382717,"d":"0.94"},{"v":0.9204545454545454,"d":"0.92"},{"v":0.543000385653683,"d":"0.54"},{"v":0.9360422847084696,"d":"0.94"},{"v":0.8398869710484588,"d":"0.84"},"prawidłowo"]
[null,"ŚLĄSKIE",{"v":33735.6770763189,"d":"33,735.68"},{"v":93594.61302388537,"d":"93,594.61"},{"v":0.9012524114836441,"d":"0.90"},{"v":0.9321948769462581,"d":"0.93"},{"v":0.525191242416249,"d":"0.53"},{"v":0.9486742458840526,"d":"0.95"},{"v":0.8610945488043356,"d":"0.86"},"prawidłowo"]
[null,"LUBELSKIE",{"v":21929.796096981183,"d":"21,929.80"},{"v":60900.007631959554,"d":"60,900.01"},{"v":0.7918429482249707,"d":"0.79"},{"v":0.9024839006439742,"d":"0.90"},{"v":0.5574358974358974,"d":"0.56"},{"v":1.0694389449079897,"d":"1.07"},{"v":0.8452551036017953,"d":"0.85"},"prawidłowo"]
[null,"PODKARPACKIE",{"v":22410.088441342665,"d":"22,410.09"},{"v":64177.03927585548,"d":"64,177.04"},{"v":0.8274039877481857,"d":"0.83"},{"v":0.8986828774062816,"d":"0.90"},{"v":0.5662650602409639,"d":"0.57"},{"v":0.988705051641829,"d":"0.99"},{"v":0.8387901026391567,"d":"0.84"},"prawidłowo"]
[null,"PODLASKIE",{"v":23376.71288719887,"d":"23,376.71"},{"v":67523.14810230056,"d":"67,523.15"},{"v":0.8304201184489926,"d":"0.83"},{"v":0.9288389513108615,"d":"0.93"},{"v":0.5493827160493827,"d":"0.55"},{"v":0.9618105787289455,"d":"0.96"},{"v":0.8494306696219566,"d":"0.85"},"prawidłowo"]
[null,"ŚWIĘTOKRZYSKIE",{"v":25151.166818883255,"d":"25,151.17"},{"v":67716.47867173889,"d":"67,716.48"},{"v":0.8091703699135634,"d":"0.81"},{"v":0.8914373088685015,"d":"0.89"},{"v":0.559931506849315,"d":"0.56"},{"v":1.0767557202647637,"d":"1.08"},{"v":0.8540452870594905,"d":"0.85"},"prawidłowo"]
[null,"LUBUSKIE",{"v":27138.341087097924,"d":"27,138.34"},{"v":84245.82542178166,"d":"84,245.83"},{"v":0.7994330165525493,"d":"0.80"},{"v":0.9044444444444445,"d":"0.90"},{"v":0.5357142857142857,"d":"0.54"},{"v":0.9842508152291722,"d":"0.98"},{"v":0.844951769571119,"d":"0.84"},"prawidłowo"]
[null,"WIELKOPOLSKIE",{"v":34132.16222488697,"d":"34,132.16"},{"v":85706.93966308435,"d":"85,706.94"},{"v":1.0457033856567857,"d":"1.05"},{"v":0.9258202567760342,"d":"0.93"},{"v":0.5608,"d":"0.56"},{"v":0.8743606674799387,"d":"0.87"},{"v":0.8389073553501017,"d":"0.84"},"prawidłowo"]
[null,"ZACHODNIOPOMORSKIE",{"v":27745.130811635736,"d":"27,745.13"},{"v":86980.8704098235,"d":"86,980.87"},{"v":0.9031701805000719,"d":"0.90"},{"v":0.8978978978978979,"d":"0.90"},{"v":0.5211267605633803,"d":"0.52"},{"v":0.8879402703840654,"d":"0.89"},{"v":0.8500399835104931,"d":"0.85"},"prawidłowo"]
[null,"DOLNOŚLĄSKIE",{"v":34652.04213128779,"d":"34,652.04"},{"v":97056.832499663,"d":"97,056.83"},{"v":0.8977599929303669,"d":"0.90"},{"v":0.89937106918239,"d":"0.90"},{"v":0.539440203562341,"d":"0.54"},{"v":0.9534495830174374,"d":"0.95"},{"v":0.8597308583976998,"d":"0.86"},"prawidłowo"]
[null,"OPOLSKIE",{"v":26125.573054717453,"d":"26,125.57"},{"v":83083.70341539953,"d":"83,083.70"},{"v":0.8421486800967815,"d":"0.84"},{"v":0.8995327102803738,"d":"0.90"},{"v":0.5370138017565872,"d":"0.54"},{"v":0.8942034969303128,"d":"0.89"},{"v":0.864415278097017,"d":"0.86"},"prawidłowo"]
[null,"KUJAWSKO-POMORSKIE",{"v":26609.855670362183,"d":"26,609.86"},{"v":77431.94836111677,"d":"77,431.95"},{"v":0.8566869510976544,"d":"0.86"},{"v":0.8972972972972973,"d":"0.90"},{"v":0.5479857819905213,"d":"0.55"},{"v":0.9673152874783099,"d":"0.97"},{"v":0.8433861763882841,"d":"0.84"},"prawidłowo"]
[null,"POMORSKIE",{"v":31124.178792062594,"d":"31,124.18"},{"v":90982.26143314783,"d":"90,982.26"},{"v":0.9656910930734496,"d":"0.97"},{"v":0.9382422802850356,"d":"0.94"},{"v":0.5233064014916097,"d":"0.52"},{"v":0.8638160914603539,"d":"0.86"},{"v":0.8352387046494348,"d":"0.84"},"prawidłowo"]
[null,"WARMIŃSKO-MAZURSKIE",{"v":23366.673253367975,"d":"23,366.67"},{"v":77713.26046711851,"d":"77,713.26"},{"v":0.7621724465738746,"d":"0.76"},{"v":0.9154471544715447,"d":"0.92"},{"v":0.5247440273037542,"d":"0.52"},{"v":0.9806554828431311,"d":"0.98"},{"v":0.8374353066810173,"d":"0.84"},"prawidłowo"]
[null,"POLSKA",{"v":31695.720703955994,"d":"31,695.72"},{"v":86036.9159049729,"d":"86,036.92"},{"v":0.8861612266718928,"d":"0.89"},{"v":0.9182823080039354,"d":"0.92"},{"v":0.5492196687962875,"d":"0.55"},{"v":0.9714817114036346,"d":"0.97"},{"v":0.8484888214210641,"d":"0.85"},"prawidłowo"]
[]
[null,"Dane","WDB_i","PP_i","PZ_i","AZ_i","NB15+_i","N15+_i","N_i"]
[null,"ŁÓDZKIE",74048,972148.401988409,1277,1381,2515,2185376,2541832]
[null,"MAZOWIECKIE",257105,2331954.6753650373,2479,2638,4483,4432067,5222167]
[null,"MAŁOPOLSKIE",92709,1212476.3488001232,1296,1408,2593,2770174,3298270]
[null,"ŚLĄSKIE",156558,1672724.4757136435,1856,1991,3791,3996103,4640725]
[null,"LUBELSKIE",47307,776797.9322086963,981,1087,1950,1823386,2157202]
[null,"PODKARPACKIE",47100,733907.3371326408,887,987,1743,1762912,2101732]
[null,"PODLASKIE",27812,411888.37875070027,496,534,972,1010594,1189731]
[null,"ŚWIĘTOKRZYSKIE",31945,471746.3256596075,583,654,1168,1084740,1270120]
[null,"LUBUSKIE",27411,325369.23773688753,407,450,840,853441,1010047]
[null,"WIELKOPOLSKIE",116332,1357322.994582508,1298,1402,2500,2859232,3408281]
[null,"ZACHODNIOPOMORSKIE",46978,540095.767939043,598,666,1278,1439286,1693198]
[null,"DOLNOŚLĄSKIE",99681,1027037.4319123398,1144,1272,2358,2473125,2876627]
[null,"OPOLSKIE",26938,324227.2418372609,385,428,797,891296,1031097]
[null,"KUJAWSKO-POMORSKIE",55058,711050.1694110532,830,925,1688,1745036,2069083]
[null,"POMORSKIE",69410,762895.9635280252,790,842,1609,1862665,2230099]
[null,"WARMIŃSKO-MAZURSKIE",33347,429103.0874210914,563,615,1172,1195119,1427118]
[null,"POLSKA",1209741,14060720.183602924,15867,17279,31461,32384552,38167329]

{"sheet":"2008","index":8,"n_rows":59,"n_cols":10,"rows_kept":59,"hidden":true,"merged":[[0,0,0,10],[1,0,1,10],[2,1,3,1],[21,1,22,1]]}
["DEKOMPOZYCJA RÓŻNIC W POZIOMIE WDB PER CAPITA"]
[2008]
[null,"Różnice względem średniej","WDB per capita","WDB na 1 pracującego","Współczynnik dojazdów netto","Udział pracujących wśród aktwnych zawodowo","Współczynnik aktywności zawodowej","Wskaźnik różnicy w metodologii BAEL/demo","Wskaźnik struktury wiekowej","Interakcje"]
[null,null,"WDB_i/N_i","WDB_i/Pp_i","Pp_i/Pz_i","Pz_i/Az_i","Az_i/NB15+_i","NB15+_i/N15+_i","Ni15+_i/N_i"]
[null,"ŁÓDZKIE",{"$f":"(C24-C$40)/C$40","v":{"v":-0.06769722942629194,"d":"-6.8%"}},{"$f":"(D24-D$40)/D$40","v":{"v":-0.11617942410246362,"d":"-11.6%"}},{"$f":"(E24-E$40)/E$40","v":{"v":-0.16428207759058847,"d":"-16.4%"}},{"$f":"(F24-F$40)/F$40","v":{"v":0.005601510056733532,"d":"0.6%"}},{"$f":"(G24-G$40)/G$40","v":{"v":0.020098619599050196,"d":"2.0%"}},{"$f":"(H24-H$40)/H$40","v":{"v":0.21372304387148505,"d":"21.4%"}},{"$f":"(I24-I$40)/I$40","v":{"v":0.013784102494603653,"d":"1.4%"}},{"$f":"C5-SUM(D5:I5)","v":{"v":-0.04044300375511231,"d":"-4.0%"}}]
[null,"MAZOWIECKIE",{"$f":"(C25-C$40)/C$40","v":{"v":0.5234605839216154,"d":"52.3%"}},{"v":0.28457102460081396,"d":"28.5%"},{"v":0.03163487631978138,"d":"3.2%"},{"v":0.012397027559866087,"d":"1.2%"},{"v":0.08518875451415138,"d":"8.5%"},{"v":0.044677216001677005,"d":"4.5%"},{"v":1.6334413079814871E-3,"d":"0.2%"},{"$f":"C6-SUM(D6:I6)","v":{"v":0.0633582436173441,"d":"6.3%"}}]
[null,"MAŁOPOLSKIE",{"v":-0.10424121966237708,"d":"-10.4%"},{"v":-0.09242579189504177,"d":"-9.2%"},{"v":0.01759421611333705,"d":"1.8%"},{"v":0.009996580337262865,"d":"1.0%"},{"v":-0.011114916945500064,"d":"-1.1%"},{"v":-0.018432614263958938,"d":"-1.8%"},{"v":-0.010653436142425747,"d":"-1.1%"},{"v":7.9474313394951868E-4,"d":"0.1%"}]
[null,"ŚLĄSKIE",{"v":0.0737673725829587,"d":"7.4%"},{"v":0.09448652419870003,"d":"9.4%"},{"v":0.03645427653588339,"d":"3.6%"},{"v":0.005850652100889322,"d":"0.6%"},{"v":-0.046543640039574896,"d":"-4.7%"},{"v":-0.02809449886667302,"d":"-2.8%"},{"v":0.015526532671695346,"d":"1.6%"},{"v":-0.003912474017961451,"d":"-0.4%"}]
[null,"LUBELSKIE",{"v":-0.2880169721081719,"d":"-28.8%"},{"v":-0.2702639935016764,"d":"-27.0%"},{"v":-0.11366124756920427,"d":"-11.4%"},{"v":-0.017182456806531264,"d":"-1.7%"},{"v":0.018860877684407026,"d":"1.9%"},{"v":0.1047989762189215,"d":"10.5%"},{"v":-0.00497709536281538,"d":"-0.5%"},{"v":-5.5920327712731255E-3,"d":"-0.6%"}]
[null,"PODKARPACKIE",{"v":-0.28362310372256316,"d":"-28.4%"},{"v":-0.253558161850578,"d":"-25.4%"},{"v":-0.04369363878678724,"d":"-4.4%"},{"v":-0.011780390850956498,"d":"-1.2%"},{"v":0.008599683776988692,"d":"0.9%"},{"v":0.020870807288887464,"d":"2.1%"},{"v":-0.013708085565003334,"d":"-1.4%"},{"v":9.646682264885742E-3,"d":"1.0%"}]
[null,"PODLASKIE",{"v":-0.2703928525372604,"d":"-27.0%"},{"v":-0.22712563217563014,"d":"-22.7%"},{"v":-0.06231332431488833,"d":"-6.2%"},{"v":7.5848020775341985E-3,"d":"0.8%"},{"v":7.5489363555206945E-3,"d":"0.8%"},{"v":-0.007617552410708102,"d":"-0.8%"},{"v":-0.00070066265848537,"d":"-0.1%"},{"v":0.012230580589396689,"d":"1.2%"}]
[null,"ŚWIĘTOKRZYSKIE",{"v":-0.17494061126665067,"d":"-17.5%"},{"v":-0.19091212890969864,"d":"-19.1%"},{"v":-0.09007081972576143,"d":"-9.0%"},{"v":-0.016661731835296657,"d":"-1.7%"},{"v":0.043076470854248566,"d":"4.3%"},{"v":0.08672572715054104,"d":"8.7%"},{"v":0.005409278962770847,"d":"0.5%"},{"v":-0.012507407763454409,"d":"-1.3%"}]
[null,"LUBUSKIE",{"v":-0.13126430306485654,"d":"-13.1%"},{"v":-0.016039734291748674,"d":"-1.6%"},{"v":-0.11275730602480553,"d":"-11.3%"},{"v":6.3592903023489454E-3,"d":"0.6%"},{"v":-0.0333033502775684,"d":"-3.3%"},{"v":0.027138578983812518,"d":"2.7%"},{"v":-0.004146717344878588,"d":"-0.4%"},{"v":1.4849355879831827E-3,"d":"0.1%"}]
[null,"WIELKOPOLSKIE",{"v":0.05639521073309925,"d":"5.6%"},{"v":-0.028153181269882935,"d":"-2.8%"},{"v":0.17890600819503769,"d":"17.9%"},{"v":0.010350947062440408,"d":"1.0%"},{"v":0.01459986334025059,"d":"1.5%"},{"v":-0.09074520477417672,"d":"-9.1%"},{"v":-0.010771152236140787,"d":"-1.1%"},{"v":-0.017792069584429,"d":"-1.8%"}]
[null,"ZACHODNIOPOMORSKIE",{"v":-0.10343460483593556,"d":"-10.3%"},{"v":0.01964784495331749,"d":"2.0%"},{"v":0.08971294291478062,"d":"9.0%"},{"v":-0.025108790582874588,"d":"-2.5%"},{"v":-0.07039976484420929,"d":"-7.0%"},{"v":-0.11063192316842259,"d":"-11.1%"},{"v":1.1190867014770906E-3,"d":"0.1%"},{"v":-7.774000810004289E-3,"d":"-0.8%"}]
[null,"DOLNOŚLĄSKIE",{"v":0.0818840204411801,"d":"8.2%"},{"v":0.11848688558460127,"d":"11.8%"},{"v":0.00527760203544382,"d":"0.5%"},{"v":-0.023131547514618225,"d":"-2.3%"},{"v":-0.02418201786603246,"d":"-2.4%"},{"v":-0.004313166853104651,"d":"-0.4%"},{"v":0.013762303431814416,"d":"1.4%"},{"v":-0.004016038376924075,"d":"-0.4%"}]
[null,"OPOLSKIE",{"v":-0.13671409427387946,"d":"-13.7%"},{"v":2.2213666165608156E-3,"d":"0.2%"},{"v":-0.04236888627140703,"d":"-4.2%"},{"v":0.005965887620483634,"d":"0.6%"},{"v":-0.05607121861090112,"d":"-5.6%"},{"v":-0.06894857587589331,"d":"-6.9%"},{"v":0.017411387176722696,"d":"1.7%"},{"v":0.005075945070554866,"d":"0.5%"}]
[null,"KUJAWSKO-POMORSKIE",{"v":-0.1412521872079187,"d":"-14.1%"},{"v":-0.09421366882938821,"d":"-9.4%"},{"v":0.10971884198858046,"d":"11.0%"},{"v":-0.023533638287916003,"d":"-2.4%"},{"v":-0.032268022558442966,"d":"-3.2%"},{"v":-0.08980234821396903,"d":"-9.0%"},{"v":-6.7036681125082695E-3,"d":"-0.7%"},{"v":-4.4496831942746895E-3,"d":"-0.4%"}]
[null,"POMORSKIE",{"v":-0.045014314859021964,"d":"-4.5%"},{"v":0.0412116548719721,"d":"4.1%"},{"v":0.059627246537029846,"d":"6.0%"},{"v":0.018912317670407276,"d":"1.9%"},{"v":-0.028146055909910064,"d":"-2.8%"},{"v":-0.11288336354710646,"d":"-11.3%"},{"v":-0.01465983472072399,"d":"-1.5%"},{"v":-0.00907627976069067,"d":"-0.9%"}]
[null,"WARMIŃSKO-MAZURSKIE",{"v":-0.2628483552984704,"d":"-26.3%"},{"v":-0.11180093908717191,"d":"-11.2%"},{"v":-0.12369449917122859,"d":"-12.4%"},{"v":-1.907415533680369E-3,"d":"-0.2%"},{"v":-0.054351929205730454,"d":"-5.4%"},{"v":0.01737763439156015,"d":"1.7%"},{"v":-0.013701357387605513,"d":"-1.4%"},{"v":0.02523015069538631,"d":"2.5%"}]
[]
[null,"Wartości","WDB per capita","WDB na 1 pracującego","Współczynnik dojazdów netto","Udział pracujących wśród aktwnych zawodowo","Współczynnik aktywności zawodowej","Wskaźnik różnicy w metodologii BAEL/demo","Wskaźnik struktury wiekowej","Weryfikacja"]
[null,null,"WDB_i/N_i","WDB_i/Pp_i","Pp_i/Pz_i","Pz_i/Az_i","Az_i/NB15+_i","NB15+_i/N15+_i","Ni15+_i/N_i"]
[null,"ŁÓDZKIE",{"$f":"C43/I43*1000000","v":{"v":27260.019279199612,"d":"27,260.02"}},{"$f":"C43/D43*1000000","v":{"v":69538.0128800036,"d":"69,538.01"}},{"$f":"D43/E43/1000","v":{"v":0.7495832707030397,"d":"0.75"}},{"$f":"E43/F43","v":{"v":0.9341275402943238,"d":"0.93"}},{"$f":"F43/G43","v":{"v":0.5531007751937984,"d":"0.55"}},{"$f":"G43/H43*1000","v":{"v":1.1786171440370652,"d":"1.18"}},{"$f":"H43/I43","v":{"v":0.8588173305645149,"d":"0.86"}},{"$f":"IF(PRODUCT(D24:I24)-C24<0.0001,\"prawidłowo\",\"nieprawidłowo\")","v":"prawidłowo"}]
[null,"MAZOWIECKIE",{"$f":"C44/I44*1000000","v":{"v":44545.147992264385,"d":"44,545.15"}},{"$f":"C44/D44*1000000","v":{"v":101068.60927429538,"d":"101,068.61"}},{"$f":"D44/E44/1000","v":{"v":0.9253077193003836,"d":"0.93"}},{"$f":"E44/F44","v":{"v":0.9404400606980273,"d":"0.94"}},{"v":0.5883928571428572,"d":"0.59"},{"$f":"G44/H44*1000","v":{"v":1.014460821998583,"d":"1.01"}},{"$f":"H44/I44","v":{"v":0.8485240162590223,"d":"0.85"}},{"$f":"IF(PRODUCT(D25:I25)-C25<0.0001,\"prawidłowo\",\"nieprawidłowo\")","v":"prawidłowo"}]
[null,"MAŁOPOLSKIE",{"v":26191.493141750143,"d":"26,191.49"},{"v":71406.92205391501,"d":"71,406.92"},{"v":0.9127141829908672,"d":"0.91"},{"v":0.9382102272727273,"d":"0.94"},{"v":0.5361766945925361,"d":"0.54"},{"v":0.9531763895377094,"d":"0.95"},{"v":0.838115307672089,"d":"0.84"},"prawidłowo"]
[null,"ŚLĄSKIE",{"v":31396.366289863774,"d":"31,396.37"},{"v":86112.97371011085,"d":"86,112.97"},{"v":0.9296304000517998,"d":"0.93"},{"v":0.9343589743589743,"d":"0.93"},{"v":0.5169671261930011,"d":"0.52"},{"v":0.9437939666744649,"d":"0.94"},{"v":0.8602934133218818,"d":"0.86"},"prawidłowo"]
[null,"LUBELSKIE",{"v":20817.991407287893,"d":"20,817.99"},{"v":57414.81156099012,"d":"57,414.81"},{"v":0.7949867810450651,"d":"0.79"},{"v":0.912962962962963,"d":"0.91"},{"v":0.5524296675191815,"d":"0.55"},{"v":1.07284361177878,"d":"1.07"},{"v":0.8429239644893776,"d":"0.84"},"prawidłowo"]
[null,"PODKARPACKIE",{"v":20946.465697703497,"d":"20,946.47"},{"v":58729.20768188325,"d":"58,729.21"},{"v":0.8577430623548989,"d":"0.86"},{"v":0.917981072555205,"d":"0.92"},{"v":0.5468660149511213,"d":"0.55"},{"v":0.9913429932743735,"d":"0.99"},{"v":0.8355275911588262,"d":"0.84"},"prawidłowo"]
[null,"PODLASKIE",{"v":21333.310952017255,"d":"21,333.31"},{"v":60808.889507711996,"d":"60,808.89"},{"v":0.8410424455518305,"d":"0.84"},{"v":0.935969868173258,"d":"0.94"},{"v":0.5462962962962963,"d":"0.55"},{"v":0.9636786349868882,"d":"0.96"},{"v":0.8465467028124921,"d":"0.85"},"prawidłowo"]
[null,"ŚWIĘTOKRZYSKIE",{"v":24124.281889150083,"d":"24,124.28"},{"v":63658.12737930047,"d":"63,658.13"},{"v":0.8161458223746936,"d":"0.82"},{"v":0.9134466769706336,"d":"0.91"},{"v":0.5655594405594405,"d":"0.57"},{"v":1.0552931159650905,"d":"1.06"},{"v":0.8517226803605324,"d":"0.85"},"prawidłowo"]
[null,"LUBUSKIE",{"v":25401.353073753027,"d":"25,401.35"},{"v":77416.89150057145,"d":"77,416.89"},{"v":0.795797556357172,"d":"0.80"},{"v":0.9348314606741573,"d":"0.93"},{"v":0.5241460541813898,"d":"0.52"},{"v":0.9974294750395917,"d":"1.00"},{"v":0.8436274111413512,"d":"0.84"},"prawidłowo"]
[null,"WIELKOPOLSKIE",{"v":30888.413850060202,"d":"30,888.41"},{"v":76463.81906148355,"d":"76,463.82"},{"v":1.057400108073055,"d":"1.06"},{"v":0.9385394070860448,"d":"0.94"},{"v":0.5501193317422435,"d":"0.55"},{"v":0.8829553787927745,"d":"0.88"},{"v":0.8380155856295751,"d":"0.84"},"prawidłowo"]
[null,"ZACHODNIOPOMORSKIE",{"v":26215.078114801498,"d":"26,215.08"},{"v":80224.75025932393,"d":"80,224.75"},{"v":0.9773998737786279,"d":"0.98"},{"v":0.9056,"d":"0.91"},{"v":0.5040322580645161,"d":"0.50"},{"v":0.863643866700748,"d":"0.86"},{"v":0.8480882857627217,"d":"0.85"},"prawidłowo"]
[null,"DOLNOŚLĄSKIE",{"v":31633.69260067312,"d":"31,633.69"},{"v":88001.29525940574,"d":"88,001.30"},{"v":0.9016670011404683,"d":"0.90"},{"v":0.9074367088607594,"d":"0.91"},{"v":0.5290916701548766,"d":"0.53"},{"v":0.9668874440215071,"d":"0.97"},{"v":0.8587988637007444,"d":"0.86"},"prawidłowo"]
[null,"OPOLSKIE",{"v":25242.004181832264,"d":"25,242.00"},{"v":78853.6544644519,"d":"78,853.65"},{"v":0.8589312770583576,"d":"0.86"},{"v":0.9344660194174758,"d":"0.93"},{"v":0.5118012422360249,"d":"0.51"},{"v":0.904121558862806,"d":"0.90"},{"v":0.8618901494617827,"d":"0.86"},"prawidłowo"]
[null,"KUJAWSKO-POMORSKIE",{"v":25109.312845093467,"d":"25,109.31"},{"v":71266.25389945143,"d":"71,266.25"},{"v":0.9953438317325981,"d":"1.00"},{"v":0.9070631970260223,"d":"0.91"},{"v":0.5247074122236671,"d":"0.52"},{"v":0.8838709640342675,"d":"0.88"},{"v":0.8414613151972177,"d":"0.84"},"prawidłowo"]
[null,"POMORSKIE",{"$f":"C57/I57*1000000","v":{"v":27923.255202044413,"d":"27,923.26"}},{"v":81921.36666853412,"d":"81,921.37"},{"v":0.9504150095230004,"d":"0.95"},{"v":0.9464922711058263,"d":"0.95"},{"v":0.5269423558897243,"d":"0.53"},{"v":0.8614575473072974,"d":"0.86"},{"v":0.8347213261293474,"d":"0.83"},"prawidłowo"]
[null,"WARMIŃSKO-MAZURSKIE",{"v":21553.907893990006,"d":"21,553.91"},{"v":69882.5071763477,"d":"69,882.51"},{"v":0.785987623135481,"d":"0.79"},{"v":0.9271523178807947,"d":"0.93"},{"v":0.5127334465195246,"d":"0.51"},{"v":0.9879508574121895,"d":"0.99"},{"v":0.8355332908687922,"d":"0.84"},"prawidłowo"]
[null,"POLSKA",{"v":29239.448964014882,"d":"29,239.45"},{"v":78678.87982737497,"d":"78,678.88"},{"v":0.8969333438990492,"d":"0.90"},{"v":0.9289241622574956,"d":"0.93"},{"v":0.5422032385566747,"d":"0.54"},{"v":0.9710758562163898,"d":"0.97"},{"v":0.8471402623608278,"d":"0.85"},"prawidłowo"]
[]
[null,"Dane","WDB_i","PP_i","PZ_i","AZ_i","NB15+_i","N15+_i","N_i"]
[null,"ŁÓDZKIE",69482,999194.4998471518,1333,1427,2580,2189006,2548861]
[null,"MAZOWIECKIE",231835,2293837.836145651,2479,2636,4480,4416139,5204495]
[null,"MAŁOPOLSKIE",86095,1205695.4357309355,1321,1408,2626,2754999,3287136]
[null,"ŚLĄSKIE",145857,1693786.588894379,1822,1950,3772,3996635,4645665]
[null,"LUBELSKIE",45005,783856.9661104343,986,1080,1955,1822260,2161832]
[null,"PODKARPACKIE",43977,748809.6934358268,873,951,1739,1754186,2099495]
[null,"PODLASKIE",25418,417998.0954392598,497,531,972,1008635,1191470]
[null,"ŚWIĘTOKRZYSKIE",30705,482342.1810234439,591,647,1144,1084059,1272784]
[null,"LUBUSKIE",25629,331051.78344458353,416,445,849,851188,1008962]
[null,"WIELKOPOLSKIE",104947,1372505.3402788253,1298,1383,2514,2847256,3397617]
[null,"ZACHODNIOPOMORSKIE",44381,553208.3285587034,566,625,1240,1435777,1692957]
[null,"DOLNOŚLĄSKIE",91012,1034212.0503081172,1147,1264,2389,2470815,2877059]
[null,"OPOLSKIE",26076,330688.5416674677,385,412,805,890367,1033040]
[null,"KUJAWSKO-POMORSKIE",51924,728591.6848282618,732,807,1538,1740073,2067918]
[null,"POMORSKIE",61976,756530.3475803083,796,841,1596,1852674,2219512]
[null,"WARMIŃSKO-MAZURSKIE",30759,440153.0689558693,560,604,1178,1192367,1427073]
[null,"POLSKA",1115072,14172443.766948877,15801,17010,31372,32306436,38135876]

{"sheet":"2007","index":9,"n_rows":59,"n_cols":10,"rows_kept":59,"hidden":true,"merged":[[0,0,0,10],[1,0,1,10],[2,1,3,1],[21,1,22,1]]}
["DEKOMPOZYCJA RÓŻNIC W POZIOMIE WDB PER CAPITA"]
[2007]
[null,"Różnice względem średniej","WDB per capita","WDB na 1 pracującego","Współczynnik dojazdów netto","Udział pracujących wśród aktwnych zawodowo","Współczynnik aktywności zawodowej","Wskaźnik różnicy w metodologii BAEL/demo","Wskaźnik struktury wiekowej","Interakcje"]
[null,null,"WDB_i/N_i","WDB_i/Pp_i","Pp_i/Pz_i","Pz_i/Az_i","Az_i/NB15+_i","NB15+_i/N15+_i","Ni15+_i/N_i"]
[null,"ŁÓDZKIE",{"$f":"(C24-C$40)/C$40","v":{"v":-0.07285009497820537,"d":"-7.3%"}},{"$f":"(D24-D$40)/D$40","v":{"v":-0.12090113393668189,"d":"-12.1%"}},{"$f":"(E24-E$40)/E$40","v":{"v":-0.131508216416094,"d":"-13.2%"}},{"$f":"(F24-F$40)/F$40","v":{"v":0.002861448381771925,"d":"0.3%"}},{"$f":"(G24-G$40)/G$40","v":{"v":0.021254814345895313,"d":"2.1%"}},{"$f":"(H24-H$40)/H$40","v":{"v":0.16908030575852165,"d":"16.9%"}},{"$f":"(I24-I$40)/I$40","v":{"v":0.014208220090370836,"d":"1.4%"}},{"$f":"C5-SUM(D5:I5)","v":{"v":-0.027845533201989216,"d":"-2.8%"}}]
[null,"MAZOWIECKIE",{"$f":"(C25-C$40)/C$40","v":{"v":0.542464313871681,"d":"54.2%"}},{"v":0.2892186138249086,"d":"28.9%"},{"v":0.08386609551752842,"d":"8.4%"},{"v":0.00612597174360351,"d":"0.6%"},{"v":0.0626627853078361,"d":"6.3%"},{"v":0.029345625757364328,"d":"2.9%"},{"v":0.003006786634500953,"d":"0.3%"},{"$f":"C6-SUM(D6:I6)","v":{"v":0.06823843508593913,"d":"6.8%"}}]
[null,"MAŁOPOLSKIE",{"v":-0.11017214304501045,"d":"-11.0%"},{"v":-0.09828153284968426,"d":"-9.8%"},{"v":0.014735309616695641,"d":"1.5%"},{"v":0.011133688934044523,"d":"1.1%"},{"v":-0.004421800256162207,"d":"-0.4%"},{"v":-0.022998130438234076,"d":"-2.3%"},{"v":-0.011212637039662498,"d":"-1.1%"},{"v":8.7295898799241711E-4,"d":"0.1%"}]
[null,"ŚLĄSKIE",{"v":0.05800584898234423,"d":"5.8%"},{"v":0.07953432759654065,"d":"8.0%"},{"v":0.03271328041873279,"d":"3.3%"},{"v":0.01703509081146219,"d":"1.7%"},{"v":-0.0653604547324204,"d":"-6.5%"},{"v":-0.017664486305104123,"d":"-1.8%"},{"v":0.016323376002811096,"d":"1.6%"},{"v":-4.5752848096779625E-3,"d":"-0.5%"}]
[null,"LUBELSKIE",{"v":-0.29995370474752847,"d":"-30.0%"},{"v":-0.28845205908884064,"d":"-28.8%"},{"v":-0.12332377784109608,"d":"-12.3%"},{"v":0.001231689614217293,"d":"0.1%"},{"v":0.05195561055147979,"d":"5.2%"},{"v":0.07203503082396973,"d":"7.2%"},{"v":-0.006100688377223933,"d":"-0.6%"},{"v":-0.007299510430034628,"d":"-0.7%"}]
[null,"PODKARPACKIE",{"v":-0.29523186385315797,"d":"-29.5%"},{"v":-0.2679610471492775,"d":"-26.8%"},{"v":-0.021393072682635142,"d":"-2.1%"},{"v":7.6409034397013616E-4,"d":"0.1%"},{"v":0.013806979338184588,"d":"1.4%"},{"v":-0.014484841169278123,"d":"-1.4%"},{"v":-0.01609428140547354,"d":"-1.6%"},{"v":0.010130308871351579,"d":"1.0%"}]
[null,"PODLASKIE",{"v":-0.25628429986717133,"d":"-25.6%"},{"v":-0.20911833933609925,"d":"-20.9%"},{"v":-0.012270590661579516,"d":"-1.2%"},{"v":0.010583184144235506,"d":"1.1%"},{"v":0.011371111500042117,"d":"1.1%"},{"v":-0.06551893935824243,"d":"-6.6%"},{"v":-0.003208458428374646,"d":"-0.3%"},{"v":0.011877732272846886,"d":"1.2%"}]
[null,"ŚWIĘTOKRZYSKIE",{"v":-0.2035416448159355,"d":"-20.4%"},{"v":-0.2166013888408142,"d":"-21.7%"},{"v":-0.1060123731839197,"d":"-10.6%"},{"v":-0.02484263935093222,"d":"-2.5%"},{"v":0.04806117302761027,"d":"4.8%"},{"v":0.1082138442571226,"d":"10.8%"},{"v":0.00406969793024458,"d":"0.4%"},{"v":-0.016429958655246824,"d":"-1.6%"}]
[null,"LUBUSKIE",{"v":-0.10629976586790116,"d":"-10.6%"},{"v":0.005684919903300053,"d":"0.6%"},{"v":-0.18003001302931737,"d":"-18.0%"},{"v":-1.1306696167110574E-3,"d":"-0.1%"},{"v":-0.00639601569969171,"d":"-0.6%"},{"v":0.09651950658506542,"d":"9.7%"},{"v":-0.004150722959994378,"d":"-0.4%"},{"v":-0.016796771050552134,"d":"-1.7%"}]
[null,"WIELKOPOLSKIE",{"v":0.05529720881228544,"d":"5.5%"},{"v":-0.031917043454968035,"d":"-3.2%"},{"v":0.1251493802491633,"d":"12.5%"},{"v":0.015010186663730043,"d":"1.5%"},{"v":0.01317840899447697,"d":"1.3%"},{"v":-0.047991630649187614,"d":"-4.8%"},{"v":-0.010410824203360628,"d":"-1.0%"},{"v":-0.00772126878756859,"d":"-0.8%"}]
[null,"ZACHODNIOPOMORSKIE",{"v":-0.11237854954740964,"d":"-11.2%"},{"v":0.014708813857190074,"d":"1.5%"},{"v":0.09405899834454291,"d":"9.4%"},{"v":-0.022045957490607802,"d":"-2.2%"},{"v":-0.081762784575635,"d":"-8.2%"},{"v":-0.11045180633756325,"d":"-11.0%"},{"v":9.2790003434431326E-4,"d":"0.1%"},{"v":-7.81371337968087E-3,"d":"-0.8%"}]
[null,"DOLNOŚLĄSKIE",{"v":0.08977932807339088,"d":"9.0%"},{"v":0.1504183441399234,"d":"15.0%"},{"v":-0.04366002418588325,"d":"-4.4%"},{"v":-0.03357769933930665,"d":"-3.4%"},{"v":-0.00861475670472205,"d":"-0.9%"},{"v":0.018883570387258998,"d":"1.9%"},{"v":0.014697300462223246,"d":"1.5%"},{"v":-0.008367406686102807,"d":"-0.8%"}]
[null,"OPOLSKIE",{"v":-0.15678631547192554,"d":"-15.7%"},{"v":-0.012110001626737775,"d":"-1.2%"},{"v":-0.030308605671574076,"d":"-3.0%"},{"v":4.4756532299134845E-3,"d":"0.4%"},{"v":-0.04768909655628305,"d":"-4.8%"},{"v":-0.09438838708044378,"d":"-9.4%"},{"v":0.016097450586036607,"d":"1.6%"},{"v":7.1366716471630565E-3,"d":"0.7%"}]
[null,"KUJAWSKO-POMORSKIE",{"v":-0.13683241701561216,"d":"-13.7%"},{"v":-0.08531832994378973,"d":"-8.5%"},{"v":0.05207713402411536,"d":"5.2%"},{"v":-0.018242255646187887,"d":"-1.8%"},{"v":-0.03968242628865268,"d":"-4.0%"},{"v":-0.04169990045646837,"d":"-4.2%"},{"v":-0.00721131584341168,"d":"-0.7%"},{"v":0.00324467713878282,"d":"0.3%"}]
[null,"POMORSKIE",{"v":-0.015925678470578224,"d":"-1.6%"},{"v":0.07064775239983052,"d":"7.1%"},{"v":0.06351274499057587,"d":"6.4%"},{"v":1.4367279919394451E-3,"d":"0.1%"},{"v":-0.011005675884099422,"d":"-1.1%"},{"v":-0.11525121346843317,"d":"-11.5%"},{"v":-0.013717559855956579,"d":"-1.4%"},{"v":-0.011548454644434885,"d":"-1.2%"}]
[null,"WARMIŃSKO-MAZURSKIE",{"v":-0.2598820128389596,"d":"-26.0%"},{"v":-0.10882760853542191,"d":"-10.9%"},{"v":-0.1213843426404474,"d":"-12.1%"},{"v":-0.009476286394433188,"d":"-0.9%"},{"v":-0.04113552254920771,"d":"-4.1%"},{"v":0.010385575729276274,"d":"1.0%"},{"v":-0.015011743974488413,"d":"-1.5%"},{"v":0.025567915525762652,"d":"2.6%"}]
[]
[null,"Wartości","WDB per capita","WDB na 1 pracującego","Współczynnik dojazdów netto","Udział pracujących wśród aktwnych zawodowo","Współczynnik aktywności zawodowej","Wskaźnik różnicy w metodologii BAEL/demo","Wskaźnik struktury wiekowej","Weryfikacja"]
[null,null,"WDB_i/N_i","WDB_i/Pp_i","Pp_i/Pz_i","Pz_i/Az_i","Az_i/NB15+_i","NB15+_i/N15+_i","Ni15+_i/N_i"]
[null,"ŁÓDZKIE",{"$f":"C43/I43*1000000","v":{"v":25191.928629389746,"d":"25,191.93"}},{"$f":"C43/D43*1000000","v":{"v":66817.23581625754,"d":"66,817.24"}},{"$f":"D43/E43/1000","v":{"v":0.7765057011247677,"d":"0.78"}},{"$f":"E43/F43","v":{"v":0.9065010956902849,"d":"0.91"}},{"$f":"F43/G43","v":{"v":0.5484775641025641,"d":"0.55"}},{"$f":"G43/H43*1000","v":{"v":1.1392583592397458,"d":"1.14"}},{"$f":"H43/I43","v":{"v":0.8571934404268089,"d":"0.86"}},{"$f":"IF(PRODUCT(D24:I24)-C24<0.0001,\"prawidłowo\",\"nieprawidłowo\")","v":"prawidłowo"}]
[null,"MAZOWIECKIE",{"$f":"C44/I44*1000000","v":{"v":41910.86112177575,"d":"41,910.86"}},{"$f":"C44/D44*1000000","v":{"v":97989.0060880173,"d":"97,989.01"}},{"$f":"D44/E44/1000","v":{"v":0.9690686985571144,"d":"0.97"}},{"$f":"E44/F44","v":{"v":0.90945194598888,"d":"0.91"}},{"v":0.570716228467815,"d":"0.57"},{"$f":"G44/H44*1000","v":{"v":1.0030881564890277,"d":"1.00"}},{"$f":"H44/I44","v":{"v":0.84772615837215,"d":"0.85"}},{"$f":"IF(PRODUCT(D25:I25)-C25<0.0001,\"prawidłowo\",\"nieprawidłowo\")","v":"prawidłowo"}]
[null,"MAŁOPOLSKIE",{"v":24177.837632767678,"d":"24,177.84"},{"v":68536.47272833284,"d":"68,536.47"},{"v":0.9072598819512562,"d":"0.91"},{"v":0.9139784946236559,"d":"0.91"},{"v":0.5346876197776926,"d":"0.53"},{"v":0.9520796316630521,"d":"0.95"},{"v":0.8357081166537971,"d":"0.84"},"prawidłowo"]
[null,"ŚLĄSKIE",{"v":28747.463266378247,"d":"28,747.46"},{"v":82051.63551373268,"d":"82,051.64"},{"v":0.9233337206291874,"d":"0.92"},{"v":0.9193128578865174,"d":"0.92"},{"v":0.501959759602822,"d":"0.50"},{"v":0.9572772204291513,"d":"0.96"},{"v":0.8589811381970579,"d":"0.86"},"prawidłowo"]
[null,"LUBELSKIE",{"v":19021.213518707533,"d":"19,021.21"},{"v":54082.274926980775,"d":"54,082.27"},{"v":0.7838232870065429,"d":"0.78"},{"v":0.9050279329608939,"d":"0.91"},{"v":0.5649658074697528,"d":"0.56"},{"v":1.04468860201321,"d":"1.04"},{"v":0.8400286583083012,"d":"0.84"},"prawidłowo"]
[null,"PODKARPACKIE",{"v":19149.512381885994,"d":"19,149.51"},{"v":55639.72520900733,"d":"55,639.73"},{"v":0.874958027911741,"d":"0.87"},{"v":0.9046052631578947,"d":"0.90"},{"v":0.5444776119402985,"d":"0.54"},{"v":0.9603757563317431,"d":"0.96"},{"v":0.8315822247057937,"d":"0.83"},"prawidłowo"]
[null,"PODLASKIE",{"v":20207.770865125014,"d":"20,207.77"},{"v":60112.15400603991,"d":"60,112.15"},{"v":0.8831143046107865,"d":"0.88"},{"v":0.9134808853118712,"d":"0.91"},{"v":0.5431693989071038,"d":"0.54"},{"v":0.9106434815841016,"d":"0.91"},{"v":0.8424731272952896,"d":"0.84"},"prawidłowo"]
[null,"ŚWIĘTOKRZYSKIE",{"v":21640.860805142882,"d":"21,640.86"},{"v":59543.393537015196,"d":"59,543.39"},{"v":0.7993011587203133,"d":"0.80"},{"v":0.8814589665653495,"d":"0.88"},{"v":0.562874251497006,"d":"0.56"},{"v":1.0799445339009277,"d":"1.08"},{"v":0.8486245149151347,"d":"0.85"},"prawidłowo"]
[null,"LUBUSKIE",{"v":24283.055407092448,"d":"24,283.06"},{"v":76438.59984821426,"d":"76,438.60"},{"v":0.7331230780405226,"d":"0.73"},{"v":0.9028925619834711,"d":"0.90"},{"v":0.5336273428886439,"d":"0.53"},{"v":1.068548505858167,"d":"1.07"},{"v":0.8416767395716924,"d":"0.84"},"prawidłowo"]
[null,"WIELKOPOLSKIE",{"v":28673.86581522474,"d":"28,673.87"},{"v":73580.60588433317,"d":"73,580.61"},{"v":1.0059794748721036,"d":"1.01"},{"v":0.9174825174825175,"d":"0.92"},{"v":0.5441400304414004,"d":"0.54"},{"v":0.9277236880193734,"d":"0.93"},{"v":0.8363857967298536,"d":"0.84"},"prawidłowo"]
[null,"ZACHODNIOPOMORSKIE",{"v":24117.88655599487,"d":"24,117.89"},{"v":77124.47452462926,"d":"77,124.47"},{"v":0.9781820227195218,"d":"0.98"},{"v":0.8839869281045751,"d":"0.88"},{"v":0.4931506849315068,"d":"0.49"},{"v":0.8668568023810971,"d":"0.87"},{"v":0.845969114875809,"d":"0.85"},"prawidłowo"]
[null,"DOLNOŚLĄSKIE",{"v":29610.792069232666,"d":"29,610.79"},{"v":87439.28215033017,"d":"87,439.28"},{"v":0.8550494748134141,"d":"0.86"},{"v":0.8735632183908046,"d":"0.87"},{"v":0.5324357405140759,"d":"0.53"},{"v":0.9928929765886287,"d":"0.99"},{"v":0.8576068037562404,"d":"0.86"},"prawidłowo"]
[null,"OPOLSKIE",{"v":22911.266932025053,"d":"22,911.27"},{"v":75086.06998598293,"d":"75,086.07"},{"v":0.866986781291642,"d":"0.87"},{"v":0.9079601990049752,"d":"0.91"},{"v":0.5114503816793893,"d":"0.51"},{"v":0.8825104615664449,"d":"0.88"},{"v":0.8587901894535469,"d":"0.86"},"prawidłowo"]
[null,"KUJAWSKO-POMORSKIE",{"v":23453.441593389787,"d":"23,453.44"},{"v":69521.76052579744,"d":"69,521.76"},{"v":0.9406466566920676,"d":"0.94"},{"v":0.8874251497005988,"d":"0.89"},{"v":0.515750463248919,"d":"0.52"},{"v":0.9338549231285697,"d":"0.93"},{"v":0.8390899727801074,"d":"0.84"},"prawidłowo"]
[null,"POMORSKIE",{"v":26738.64273696018,"d":"26,738.64"},{"v":81376.19795666191,"d":"81,376.20"},{"v":0.9508710678829924,"d":"0.95"},{"v":0.9052132701421801,"d":"0.91"},{"v":0.5311516677155443,"d":"0.53"},{"v":0.8621798228217752,"d":"0.86"},{"v":0.8335909937944385,"d":"0.83"},"prawidłowo"]
[null,"WARMIŃSKO-MAZURSKIE",{"v":20110.01609221999,"d":"20,110.02"},{"v":67734.90233251882,"d":"67,734.90"},{"v":0.7855573074299155,"d":"0.79"},{"v":0.8953488372093024,"d":"0.90"},{"v":0.5149700598802395,"d":"0.51"},{"v":0.9846117563822888,"d":"0.98"},{"v":0.832497168961298,"d":"0.83"},"prawidłowo"]
[null,"POLSKA",{"v":27171.365162139078,"d":"27,171.37"},{"v":76006.50893280182,"d":"76,006.51"},{"v":0.8940852588385467,"d":"0.89"},{"v":0.9039145907473309,"d":"0.90"},{"v":0.5370624024464052,"d":"0.54"},{"v":0.9744911052116075,"d":"0.97"},{"v":0.8451848678079427,"d":"0.85"},"prawidłowo"]
[]
[null,"Dane","WDB_i","PP_i","PZ_i","AZ_i","NB15+_i","N15+_i","N_i"]
[null,"ŁÓDZKIE",64388,963643.5750958368,1241,1369,2496,2190899,2555898]
[null,"MAZOWIECKIE",217454,2219167.319695792,2290,2518,4412,4398417,5188488]
[null,"MAŁOPOLSKIE",79280,1156756.3494878516,1275,1395,2609,2740317,3279036]
[null,"ŚLĄSKIE",133794,1630607.3506311448,1766,1921,3827,3997797,4654115]
[null,"LUBELSKIE",41204,761876.2349703597,972,1074,1901,1819681,2166213]
[null,"PODKARPACKIE",40163,721840.3730271864,825,912,1675,1744109,2097338]
[null,"PODLASKIE",24101,400933.8942932971,454,497,915,1004784,1192660]
[null,"ŚWIĘTOKRZYSKIE",27604,463594.6720577817,580,658,1169,1082463,1275550]
[null,"LUBUSKIE",24489,320374.7851037084,437,484,907,848815,1008481]
[null,"WIELKOPOLSKIE",97115,1319845.0710321998,1312,1430,2628,2832740,3386882]
[null,"ZACHODNIOPOMORSKIE",40814,529196.4742912613,541,612,1241,1431609,1692271]
[null,"DOLNOŚLĄSKIE",85232,974756.4012872921,1140,1305,2451,2468544,2878410]
[null,"OPOLSKIE",23761,316450.1751714493,365,402,786,890641,1037088]
[null,"KUJAWSKO-POMORSKIE",48458,697019.1726088221,741,835,1619,1733674,2066136]
[null,"POMORSKIE",59117,726465.4958626062,764,844,1589,1843003,2210920]
[null,"WARMIŃSKO-MAZURSKIE",28680,423415.38870472444,539,602,1169,1187270,1426155]
[null,"POLSKA",1035654,13625859.344699452,15240,16860,31393,32214763,38115641]

{"sheet":"2006","index":10,"n_rows":59,"n_cols":10,"rows_kept":59,"hidden":true,"merged":[[0,0,0,10],[1,0,1,10],[2,1,3,1],[21,1,22,1]]}
["DEKOMPOZYCJA RÓŻNIC W POZIOMIE WDB PER CAPITA"]
[2006]
[null,"Różnice względem średniej","WDB per capita","WDB na 1 pracującego","Współczynnik dojazdów netto","Udział pracujących wśród aktwnych zawodowo","Współczynnik aktywności zawodowej","Wskaźnik różnicy w metodologii BAEL/demo","Wskaźnik struktury wiekowej","Interakcje"]
[null,null,"WDB_i/N_i","WDB_i/Pp_i","Pp_i/Pz_i","Pz_i/Az_i","Az_i/NB15+_i","NB15+_i/N15+_i","Ni15+_i/N_i"]
[null,"ŁÓDZKIE",{"$f":"(C24-C$40)/C$40","v":{"v":-0.07548488122769342,"d":"-7.5%"}},{"$f":"(D24-D$40)/D$40","v":{"v":-0.12105639460596762,"d":"-12.1%"}},{"$f":"(E24-E$40)/E$40","v":{"v":-0.08406776641440494,"d":"-8.4%"}},{"$f":"(F24-F$40)/F$40","v":{"v":0.004035467042564754,"d":"0.4%"}},{"$f":"(G24-G$40)/G$40","v":{"v":0.00779904161913504,"d":"0.8%"}},{"$f":"(H24-H$40)/H$40","v":{"v":0.11819320777210891,"d":"11.8%"}},{"$f":"(I24-I$40)/I$40","v":{"v":0.014962083898513888,"d":"1.5%"}},{"$f":"C5-SUM(D5:I5)","v":{"v":-0.015350520539643434,"d":"-1.5%"}}]
[null,"MAZOWIECKIE",{"$f":"(C25-C$40)/C$40","v":{"v":0.5413129203021438,"d":"54.1%"}},{"v":0.2881820538787056,"d":"28.8%"},{"v":0.10523382919068129,"d":"10.5%"},{"v":0.018577450633916026,"d":"1.9%"},{"v":0.05284794740690243,"d":"5.3%"},{"v":0.004898940101723776,"d":"0.5%"},{"v":4.5632922730191065E-3,"d":"0.5%"},{"$f":"C6-SUM(D6:I6)","v":{"v":0.06700940681719564,"d":"6.7%"}}]
[null,"MAŁOPOLSKIE",{"v":-0.10030254632860262,"d":"-10.0%"},{"v":-0.09266532886510126,"d":"-9.3%"},{"v":-0.04934491460030021,"d":"-4.9%"},{"v":0.015315263917606545,"d":"1.5%"},{"v":0.017544315967046524,"d":"1.8%"},{"v":0.022109325127046223,"d":"2.2%"},{"v":-0.012233232500866142,"d":"-1.2%"},{"v":-0.001027975374034304,"d":"-0.1%"}]
[null,"ŚLĄSKIE",{"v":0.062775566020693,"d":"6.3%"},{"v":0.08515359099313136,"d":"8.5%"},{"v":0.027180224045991148,"d":"2.7%"},{"v":-2.1081254624727283E-3,"d":"-0.2%"},{"v":-0.055052691715433116,"d":"-5.5%"},{"v":-0.005881839380423733,"d":"-0.6%"},{"v":0.01712566634583352,"d":"1.7%"},{"v":-3.6412588059334533E-3,"d":"-0.4%"}]
[null,"LUBELSKIE",{"v":-0.3086631693480206,"d":"-30.9%"},{"v":-0.30568490046179886,"d":"-30.6%"},{"v":-0.09498824427327002,"d":"-9.5%"},{"v":0.013391733880564968,"d":"1.3%"},{"v":0.03500673042862192,"d":"3.5%"},{"v":0.056837393024865214,"d":"5.7%"},{"v":-0.007455102280738617,"d":"-0.7%"},{"v":-0.005770779666265269,"d":"-0.6%"}]
[null,"PODKARPACKIE",{"v":-0.28537735599827874,"d":"-28.5%"},{"v":-0.2621785517000381,"d":"-26.2%"},{"v":-0.008131885536512007,"d":"-0.8%"},{"v":4.3970097247931945E-3,"d":"0.4%"},{"v":-1.8556071635300107E-4,"d":"-0.0%"},{"v":-0.00869656199462494,"d":"-0.9%"},{"v":-0.019065203864763985,"d":"-1.9%"},{"v":0.008483398089220162,"d":"0.8%"}]
[null,"PODLASKIE",{"v":-0.27150266275499496,"d":"-27.2%"},{"v":-0.2275135588574678,"d":"-22.8%"},{"v":0.025538891394460948,"d":"2.6%"},{"v":0.03091130045877732,"d":"3.1%"},{"v":-1.4435300475494086E-3,"d":"-0.1%"},{"v":-0.10188332193605161,"d":"-10.2%"},{"v":-0.005377505268475084,"d":"-0.5%"},{"v":0.008265061501310678,"d":"0.8%"}]
[null,"ŚWIĘTOKRZYSKIE",{"v":-0.21849756523075586,"d":"-21.8%"},{"v":-0.23641323791044114,"d":"-23.6%"},{"v":-0.07496762518823456,"d":"-7.5%"},{"v":-0.018571188951854656,"d":"-1.9%"},{"v":0.017115650272686515,"d":"1.7%"},{"v":0.10528754662262796,"d":"10.5%"},{"v":2.7913874987480795E-3,"d":"0.3%"},{"v":-0.013740097574288068,"d":"-1.4%"}]
[null,"LUBUSKIE",{"v":-0.10018737577106603,"d":"-10.0%"},{"v":0.017062039984332648,"d":"1.7%"},{"v":-0.18296221095170437,"d":"-18.3%"},{"v":-3.7579548913145603E-3,"d":"-0.4%"},{"v":-0.017642775613020113,"d":"-1.8%"},{"v":0.11083017924640862,"d":"11.1%"},{"v":-0.003951438227180482,"d":"-0.4%"},{"v":-0.01976521531858777,"d":"-2.0%"}]
[null,"WIELKOPOLSKIE",{"v":0.06309500959366725,"d":"6.3%"},{"v":-0.023450786272013607,"d":"-2.3%"},{"v":0.08876179761572615,"d":"8.9%"},{"v":0.012669820342568961,"d":"1.3%"},{"v":0.02361007776611971,"d":"2.4%"},{"v":-0.025580308878888815,"d":"-2.6%"},{"v":-0.010087977265785456,"d":"-1.0%"},{"v":-0.002827613714059679,"d":"-0.3%"}]
[null,"ZACHODNIOPOMORSKIE",{"v":-0.09948607074868825,"d":"-9.9%"},{"v":0.028467217063696728,"d":"2.8%"},{"v":0.04675578200060495,"d":"4.7%"},{"v":-0.039548293310135665,"d":"-4.0%"},{"v":-0.05830860852403621,"d":"-5.8%"},{"v":-0.07591563439152148,"d":"-7.6%"},{"v":8.2664268981053925E-4,"d":"0.1%"},{"v":-1.7631762771071202E-3,"d":"-0.2%"}]
[null,"DOLNOŚLĄSKIE",{"v":0.07497366292514311,"d":"7.5%"},{"v":0.14936763427838257,"d":"14.9%"},{"v":-0.061968997236674754,"d":"-6.2%"},{"v":-0.03785770045625307,"d":"-3.8%"},{"v":2.152052673824156E-3,"d":"0.2%"},{"v":0.01810056802449272,"d":"1.8%"},{"v":0.01568271059624631,"d":"1.6%"},{"v":-0.010502604954874803,"d":"-1.1%"}]
[null,"OPOLSKIE",{"v":-0.18042491868100952,"d":"-18.0%"},{"v":-0.038644295166446595,"d":"-3.9%"},{"v":-0.04225766263669866,"d":"-4.2%"},{"v":0.004990698848261699,"d":"0.5%"},{"v":-0.021625108187166536,"d":"-2.2%"},{"v":-0.10796995534260688,"d":"-10.8%"},{"v":0.014866993688701756,"d":"1.5%"},{"v":0.010214410114945699,"d":"1.0%"}]
[null,"KUJAWSKO-POMORSKIE",{"v":-0.13428534971412864,"d":"-13.4%"},{"v":-0.07978195896123273,"d":"-8.0%"},{"v":0.02349843906384594,"d":"2.3%"},{"v":-0.026731070046619006,"d":"-2.7%"},{"v":-0.022247110584148008,"d":"-2.2%"},{"v":-0.026844483140178624,"d":"-2.7%"},{"v":-7.44947720033987E-3,"d":"-0.7%"},{"v":0.005270311154543655,"d":"0.5%"}]
[null,"POMORSKIE",{"v":-0.013903987018860238,"d":"-1.4%"},{"v":0.07539686582110379,"d":"7.5%"},{"v":0.09859806379581472,"d":"9.9%"},{"v":0.005077751730028836,"d":"0.5%"},{"v":-0.02305285015112945,"d":"-2.3%"},{"v":-0.13885212464081476,"d":"-13.9%"},{"v":-0.012895474681052507,"d":"-1.3%"},{"v":-0.01817621889281086,"d":"-1.8%"}]
[null,"WARMIŃSKO-MAZURSKIE",{"v":-0.252927203135707,"d":"-25.3%"},{"v":-0.1023176743672177,"d":"-10.2%"},{"v":-0.10702334896977801,"d":"-10.7%"},{"v":-0.025094087562665658,"d":"-2.5%"},{"v":-0.047400175733289626,"d":"-4.7%"},{"v":0.020040994147809223,"d":"2.0%"},{"v":-0.016194337908753048,"d":"-1.6%"},{"v":0.025061427258187774,"d":"2.5%"}]
[]
[null,"Wartości","WDB per capita","WDB na 1 pracującego","Współczynnik dojazdów netto","Udział pracujących wśród aktwnych zawodowo","Współczynnik aktywności zawodowej","Wskaźnik różnicy w metodologii BAEL/demo","Wskaźnik struktury wiekowej","Weryfikacja"]
[null,null,"WDB_i/N_i","WDB_i/Pp_i","Pp_i/Pz_i","Pz_i/Az_i","Az_i/NB15+_i","NB15+_i/N15+_i","Ni15+_i/N_i"]
[null,"ŁÓDZKIE",{"$f":"C43/I43*1000000","v":{"v":22624.910470665163,"d":"22,624.91"}},{"$f":"C43/D43*1000000","v":{"v":62259.57273023002,"d":"62,259.57"}},{"$f":"D43/E43/1000","v":{"v":0.826726380354387,"d":"0.83"}},{"$f":"E43/F43","v":{"v":0.8650306748466258,"d":"0.87"}},{"$f":"F43/G43","v":{"v":0.5442404006677797,"d":"0.54"}},{"$f":"G43/H43*1000","v":{"v":1.0924835671503506,"d":"1.09"}},{"$f":"H43/I43","v":{"v":0.8546370934744708,"d":"0.85"}},{"$f":"IF(PRODUCT(D24:I24)-C24<0.0001,\"prawidłowo\",\"nieprawidłowo\")","v":"prawidłowo"}]
[null,"MAZOWIECKIE",{"$f":"C44/I44*1000000","v":{"v":37719.304012489505,"d":"37,719.30"}},{"$f":"C44/D44*1000000","v":{"v":91247.79312466102,"d":"91,247.79"}},{"$f":"D44/E44/1000","v":{"v":0.9975912295116774,"d":"1.00"}},{"$f":"E44/F44","v":{"v":0.8775593775593775,"d":"0.88"}},{"v":0.5685681024447031,"d":"0.57"},{"$f":"G44/H44*1000","v":{"v":0.9817941757089261,"d":"0.98"}},{"$f":"H44/I44","v":{"v":0.8458809111584542,"d":"0.85"}},{"$f":"IF(PRODUCT(D25:I25)-C25<0.0001,\"prawidłowo\",\"nieprawidłowo\")","v":"prawidłowo"}]
[null,"MAŁOPOLSKIE",{"v":22017.567832780936,"d":"22,017.57"},{"v":64270.64103032851,"d":"64,270.64"},{"v":0.8580674518258867,"d":"0.86"},{"v":0.8747488278633624,"d":"0.87"},{"v":0.5495031284504969,"d":"0.55"},{"v":0.9986088573702077,"d":"1.00"},{"v":0.8317375915793747,"d":"0.83"},"prawidłowo"]
[null,"ŚLĄSKIE",{"v":26008.446528769666,"d":"26,008.45"},{"v":76866.36378862931,"d":"76,866.36"},{"v":0.9271395387765791,"d":"0.93"},{"v":0.8597376387487387,"d":"0.86"},{"v":0.5102986611740473,"d":"0.51"},{"v":0.9712612692814367,"d":"0.97"},{"v":0.8564589130710879,"d":"0.86"},"prawidłowo"]
[null,"LUBELSKIE",{"v":16918.526891529043,"d":"16,918.53"},{"v":49181.49602785543,"d":"49,181.50"},{"v":0.8168694861421842,"d":"0.82"},{"v":0.8730916030534351,"d":"0.87"},{"v":0.5589333333333333,"d":"0.56"},{"v":1.0325384531087118,"d":"1.03"},{"v":0.8357609609134163,"d":"0.84"},"prawidłowo"]
[null,"PODKARPACKIE",{"v":17488.381760937926,"d":"17,488.38"},{"v":52263.248563895875,"d":"52,263.25"},{"v":0.8952665994178048,"d":"0.90"},{"v":0.8653421633554084,"d":"0.87"},{"v":0.5399284862932062,"d":"0.54"},{"v":0.9685112631280028,"d":"0.97"},{"v":0.825984809045159,"d":"0.83"},"prawidłowo"]
[null,"PODLASKIE",{"v":17827.92590257846,"d":"17,827.93"},{"v":54718.72765246308,"d":"54,718.73"},{"v":0.9256580612696187,"d":"0.93"},{"v":0.8881856540084389,"d":"0.89"},{"v":0.5392491467576792,"d":"0.54"},{"v":0.8774670650373797,"d":"0.88"},{"v":0.8375103774681235,"d":"0.84"},"prawidłowo"]
[null,"ŚWIĘTOKRZYSKIE",{"v":19125.07676752839,"d":"19,125.08"},{"v":54088.32291218865,"d":"54,088.32"},{"v":0.8349402269041192,"d":"0.83"},{"v":0.8455538221528861,"d":"0.85"},{"v":0.5492716366752356,"d":"0.55"},{"v":1.0798746346054016,"d":"1.08"},{"v":0.8443888992200576,"d":"0.84"},"prawidłowo"]
[null,"LUBUSKIE",{"v":22020.3863086503,"d":"22,020.39"},{"v":72043.12957163315,"d":"72,043.13"},{"v":0.7374636126827885,"d":"0.74"},{"v":0.8583162217659137,"d":"0.86"},{"v":0.5305010893246187,"d":"0.53"},{"v":1.0852898303141076,"d":"1.09"},{"v":0.8387111807400944,"d":"0.84"},"prawidłowo"]
[null,"WIELKOPOLSKIE",{"v":26016.264012867243,"d":"26,016.26"},{"v":69173.42184825378,"d":"69,173.42"},{"v":0.9827234668741119,"d":"0.98"},{"v":0.8724696356275303,"d":"0.87"},{"v":0.5527788138754196,"d":"0.55"},{"v":0.9520157095020472,"d":"0.95"},{"v":0.8335439789587219,"d":"0.83"},"prawidłowo"]
[null,"ZACHODNIOPOMORSKIE",{"v":22037.548779032608,"d":"22,037.55"},{"v":72851.01013133697,"d":"72,851.01"},{"v":0.9448085644728158,"d":"0.94"},{"v":0.8274809160305343,"d":"0.83"},{"v":0.5085403726708074,"d":"0.51"},{"v":0.9028377002032085,"d":"0.90"},{"v":0.8427345085589998,"d":"0.84"},"prawidłowo"]
[null,"DOLNOŚLĄSKIE",{"v":26306.96068475466,"d":"26,306.96"},{"v":81414.93649987619,"d":"81,414.94"},{"v":0.8466728728815381,"d":"0.85"},{"v":0.8289374529012811,"d":"0.83"},{"v":0.5411908646003263,"d":"0.54"},{"v":0.9946922701214238,"d":"0.99"},{"v":0.8552438888574713,"d":"0.86"},"prawidłowo"]
[null,"OPOLSKIE",{"v":20056.797841720403,"d":"20,056.80"},{"v":68097.19651794231,"d":"68,097.20"},{"v":0.8644644514593539,"d":"0.86"},{"v":0.8658536585365854,"d":"0.87"},{"v":0.5283505154639175,"d":"0.53"},{"v":0.8715203762811686,"d":"0.87"},{"v":0.8545570238621957,"d":"0.85"},"prawidłowo"]
[null,"KUJAWSKO-POMORSKIE",{"v":21185.93418122883,"d":"21,185.93"},{"v":65183.228710149866,"d":"65,183.23"},{"v":0.9238163357491931,"d":"0.92"},{"v":0.8385236447520185,"d":"0.84"},{"v":0.5280146163215591,"d":"0.53"},{"v":0.9507806012963506,"d":"0.95"},{"v":0.8357656974473606,"d":"0.84"},"prawidłowo"]
[null,"POMORSKIE",{"v":24131.929869145646,"d":"24,131.93"},{"v":76175.25057416501,"d":"76,175.25"},{"v":0.9916017445862446,"d":"0.99"},{"v":0.8659286592865929,"d":"0.87"},{"v":0.527579493835172,"d":"0.53"},{"v":0.8413482537519437,"d":"0.84"},{"v":0.8311799582046611,"d":"0.83"},"prawidłowo"]
[null,"WARMIŃSKO-MAZURSKIE",{"v":18282.508096319038,"d":"18,282.51"},{"v":63586.92150257005,"d":"63,586.92"},{"v":0.8060065225100606,"d":"0.81"},{"v":0.8399339933993399,"d":"0.84"},{"v":0.5144312393887945,"d":"0.51"},{"v":0.9965880817202227,"d":"1.00"},{"v":0.8284021885466433,"d":"0.83"},"prawidłowo"]
[null,"POLSKA",{"v":24472.190893654082,"d":"24,472.19"},{"v":70834.54768673005,"d":"70,834.55"},{"v":0.9026064920960425,"d":"0.90"},{"v":0.8615539024678238,"d":"0.86"},{"v":0.5400286944045911,"d":"0.54"},{"v":0.9770078726618432,"d":"0.98"},{"v":0.8420384436350294,"d":"0.84"},"prawidłowo"]
[]
[null,"Dane","WDB_i","PP_i","PZ_i","AZ_i","NB15+_i","N15+_i","N_i"]
[null,"ŁÓDZKIE",58060,932547.3570397485,1128,1304,2396,2193168,2566198]
[null,"MAZOWIECKIE",195073,2137838.0048435247,2143,2442,4295,4374644,5171702]
[null,"MAŁOPOLSKIE",72024,1120636.092084608,1306,1493,2717,2720785,3271206]
[null,"ŚLĄSKIE",121437,1579845.774075291,1704,1982,3884,3998924,4669137]
[null,"LUBELSKIE",36760,747435.5798200986,915,1048,1875,1815913,2172766]
[null,"PODKARPACKIE",36683,701889.013943559,784,906,1678,1732556,2097564]
[null,"PODLASKIE",21324,389702.04379450943,421,474,879,1001747,1196101]
[null,"ŚWIĘTOKRZYSKIE",24477,452537.6029820326,542,641,1167,1080681,1279838]
[null,"LUBUSKIE",22208,308259.7901014056,418,487,918,845857,1008520]
[null,"WIELKOPOLSKIE",87896,1270661.4426682268,1293,1482,2681,2816130,3378502]
[null,"ZACHODNIOPOMORSKIE",37306,512086.24194426613,542,655,1288,1426613,1692838]
[null,"DOLNOŚLĄSKIE",75825,931340.160169692,1100,1327,2452,2465084,2882317]
[null,"OPOLSKIE",20898,306884.8802680706,355,410,776,890398,1041941]
[null,"KUJAWSKO-POMORSKIE",43778,671614.4760896633,727,867,1642,1727002,2066371]
[null,"POMORSKIE",53177,698087.6281887162,704,813,1541,1831584,2203595]
[null,"WARMIŃSKO-MAZURSKIE",26087,410257.3199576208,509,606,1178,1182033,1426883]
[null,"POLSKA",933014,13171736.539157549,14593,16938,31365,32103119,38125479]

{"sheet":"2005","index":11,"n_rows":59,"n_cols":10,"rows_kept":59,"hidden":true,"merged":[[0,0,0,10],[1,0,1,10],[2,1,3,1],[21,1,22,1]]}
["DEKOMPOZYCJA RÓŻNIC W POZIOMIE WDB PER CAPITA"]
[2005]
[null,"Różnice względem średniej","WDB per capita","WDB na 1 pracującego","Współczynnik dojazdów netto","Udział pracujących wśród aktwnych zawodowo","Współczynnik aktywności zawodowej","Wskaźnik różnicy w metodologii BAEL/demo","Wskaźnik struktury wiekowej","Interakcje"]
[null,null,"WDB_i/N_i","WDB_i/Pp_i","Pp_i/Pz_i","Pz_i/Az_i","Az_i/NB15+_i","NB15+_i/N15+_i","Ni15+_i/N_i"]
[null,"ŁÓDZKIE",{"$f":"(C24-C$40)/C$40","v":{"v":-0.07433170418434107,"d":"-7.4%"}},{"$f":"(D24-D$40)/D$40","v":{"v":-0.11816994776270166,"d":"-11.8%"}},{"$f":"(E24-E$40)/E$40","v":{"v":-0.10150662013029825,"d":"-10.2%"}},{"$f":"(F24-F$40)/F$40","v":{"v":0.004676491436364885,"d":"0.5%"}},{"$f":"(G24-G$40)/G$40","v":{"v":0.007137298696861101,"d":"0.7%"}},{"$f":"(H24-H$40)/H$40","v":{"v":0.13651877027604845,"d":"13.7%"}},{"$f":"(I24-I$40)/I$40","v":{"v":0.015930688742745468,"d":"1.6%"}},{"$f":"C5-SUM(D5:I5)","v":{"v":-0.018918385443361073,"d":"-1.9%"}}]
[null,"MAZOWIECKIE",{"$f":"(C25-C$40)/C$40","v":{"v":0.5357611110244235,"d":"53.6%"}},{"v":0.2826249590418231,"d":"28.3%"},{"v":0.15444568880802953,"d":"15.4%"},{"v":0.03657706460985732,"d":"3.7%"},{"v":0.020698637560135406,"d":"2.1%"},{"v":-0.025948964808436063,"d":"-2.6%"},{"v":0.006397687990611606,"d":"0.6%"},{"$f":"C6-SUM(D6:I6)","v":{"v":0.06096603782240262,"d":"6.1%"}}]
[null,"MAŁOPOLSKIE",{"v":-0.11539947845091808,"d":"-11.5%"},{"v":-0.11198526914845808,"d":"-11.2%"},{"v":-0.0332025036588165,"d":"-3.3%"},{"v":0.029634197118915684,"d":"3.0%"},{"v":0.019659341109486358,"d":"2.0%"},{"v":-5.360154820313527E-3,"d":"-0.5%"},{"v":-0.013294406055529586,"d":"-1.3%"},{"v":-8.5068299620243149E-4,"d":"-0.1%"}]
[null,"ŚLĄSKIE",{"v":0.07971494740439002,"d":"8.0%"},{"v":0.10207963850171285,"d":"10.2%"},{"v":0.0193876566804252,"d":"1.9%"},{"v":-0.014894308194581143,"d":"-1.5%"},{"v":-0.048759823759377124,"d":"-4.9%"},{"v":0.007530885004748315,"d":"0.8%"},{"v":0.017947507812958664,"d":"1.8%"},{"v":-3.5766086414967535E-3,"d":"-0.4%"}]
[null,"LUBELSKIE",{"v":-0.29927919185385626,"d":"-29.9%"},{"v":-0.2982838419162336,"d":"-29.8%"},{"v":-0.13606032724234934,"d":"-13.6%"},{"v":0.04331878927925271,"d":"4.3%"},{"v":0.032983860575234114,"d":"3.3%"},{"v":0.08178189854579068,"d":"8.2%"},{"v":-0.008597876666310164,"d":"-0.9%"},{"v":-0.014421694429240628,"d":"-1.4%"}]
[null,"PODKARPACKIE",{"v":-0.27922029242321167,"d":"-27.9%"},{"v":-0.25822170794498833,"d":"-25.8%"},{"v":0.009728359028349376,"d":"1.0%"},{"v":0.011288821669135373,"d":"1.1%"},{"v":-0.011052309421541378,"d":"-1.1%"},{"v":-0.016113895141410525,"d":"-1.6%"},{"v":-0.022018762257926927,"d":"-2.2%"},{"v":0.007169201645170764,"d":"0.7%"}]
[null,"PODLASKIE",{"v":-0.2592861611671317,"d":"-25.9%"},{"v":-0.2199790878883784,"d":"-22.0%"},{"v":-0.01987552230867706,"d":"-2.0%"},{"v":0.043426041088692635,"d":"4.3%"},{"v":0.019640740551445338,"d":"2.0%"},{"v":-0.08245001943333884,"d":"-8.2%"},{"v":-0.007513985405641279,"d":"-0.8%"},{"v":0.007465672228765929,"d":"0.7%"}]
[null,"ŚWIĘTOKRZYSKIE",{"v":-0.2328228460556824,"d":"-23.3%"},{"v":-0.24941670766535318,"d":"-24.9%"},{"v":-0.043521194048021426,"d":"-4.4%"},{"v":-0.01502067851563002,"d":"-1.5%"},{"v":-0.00946295410644149,"d":"-0.9%"},{"v":0.09368866142910837,"d":"9.4%"},{"v":1.451385418726781E-3,"d":"0.1%"},{"v":-0.01054135856807148,"d":"-1.1%"}]
[null,"LUBUSKIE",{"v":-0.09385273925273088,"d":"-9.4%"},{"v":0.038082892348235024,"d":"3.8%"},{"v":-0.1811641307212877,"d":"-18.1%"},{"v":-0.01455470212190061,"d":"-1.5%"},{"v":4.0640247833159795E-4,"d":"0.0%"},{"v":0.08553805331975038,"d":"8.6%"},{"v":-3.8703824312581367E-3,"d":"-0.4%"},{"v":-0.018290872124601454,"d":"-1.8%"}]
[null,"WIELKOPOLSKIE",{"v":0.07736014943931244,"d":"7.7%"},{"v":-0.012728126517823471,"d":"-1.3%"},{"v":0.06780519539535669,"d":"6.8%"},{"v":7.824219609322865E-3,"d":"0.8%"},{"v":0.03797272130542167,"d":"3.8%"},{"v":-0.013226097552816615,"d":"-1.3%"},{"v":-0.009980549207975727,"d":"-1.0%"},{"v":-3.0721359217297795E-4,"d":"-0.0%"}]
[null,"ZACHODNIOPOMORSKIE",{"v":-0.09261573683268577,"d":"-9.3%"},{"v":0.037873185667397266,"d":"3.8%"},{"v":-0.007332706291689529,"d":"-0.7%"},{"v":-0.058803096920447155,"d":"-5.9%"},{"v":-0.014613498387448937,"d":"-1.5%"},{"v":-0.05129541570831169,"d":"-5.1%"},{"v":0.000979402174046972,"d":"0.1%"},{"v":5.7639263376729755E-4,"d":"0.1%"}]
[null,"DOLNOŚLĄSKIE",{"v":0.03474733677278227,"d":"3.5%"},{"v":0.10953452526001842,"d":"11.0%"},{"v":-0.006514711060783372,"d":"-0.7%"},{"v":-0.06275187972545043,"d":"-6.3%"},{"v":-0.00804119672383985,"d":"-0.8%"},{"v":-0.006837869256124635,"d":"-0.7%"},{"v":0.01663180028949998,"d":"1.7%"},{"v":-0.007273332010537842,"d":"-0.7%"}]
[null,"OPOLSKIE",{"v":-0.16440025867494973,"d":"-16.4%"},{"v":-0.015169108852974721,"d":"-1.5%"},{"v":-0.0633403939420357,"d":"-6.3%"},{"v":0.006403646070028982,"d":"0.6%"},{"v":-0.017402172183717816,"d":"-1.7%"},{"v":-0.0959343978998224,"d":"-9.6%"},{"v":0.013227331037795746,"d":"1.3%"},{"v":0.007814837095776156,"d":"0.8%"}]
[null,"KUJAWSKO-POMORSKIE",{"v":-0.1351734023605202,"d":"-13.5%"},{"v":-0.07914795464109887,"d":"-7.9%"},{"v":-0.028935839731976935,"d":"-2.9%"},{"v":-0.02742986681779531,"d":"-2.7%"},{"v":0.01561202860587168,"d":"1.6%"},{"v":-0.01327049140978471,"d":"-1.3%"},{"v":-0.007696839783148875,"d":"-0.8%"},{"v":0.005695561417412787,"d":"0.6%"}]
[null,"POMORSKIE",{"v":-0.011848886772585073,"d":"-1.2%"},{"v":0.07940522767535911,"d":"7.9%"},{"v":0.0715799174144791,"d":"7.2%"},{"v":-0.011789119061941186,"d":"-1.2%"},{"v":-0.024188983325979987,"d":"-2.4%"},{"v":-0.10280143664849345,"d":"-10.3%"},{"v":-0.012560801528348528,"d":"-1.3%"},{"v":-0.011493691297660124,"d":"-1.1%"}]
[null,"WARMIŃSKO-MAZURSKIE",{"v":-0.2462496418802614,"d":"-24.6%"},{"v":-0.08992182390335565,"d":"-9.0%"},{"v":-0.09186681765131798,"d":"-9.2%"},{"v":-0.034640024312556396,"d":"-3.5%"},{"v":-0.04684574486254922,"d":"-4.7%"},{"v":0.008884610703967096,"d":"0.9%"},{"v":-0.017561644353261376,"d":"-1.8%"},{"v":0.025701802498812015,"d":"2.6%"}]
[]
[null,"Wartości","WDB per capita","WDB na 1 pracującego","Współczynnik dojazdów netto","Udział pracujących wśród aktwnych zawodowo","Współczynnik aktywności zawodowej","Wskaźnik różnicy w metodologii BAEL/demo","Wskaźnik struktury wiekowej","Weryfikacja"]
[null,null,"WDB_i/N_i","WDB_i/Pp_i","Pp_i/Pz_i","Pz_i/Az_i","Az_i/NB15+_i","NB15+_i/N15+_i","Ni15+_i/N_i"]
[null,"ŁÓDZKIE",{"$f":"C43/I43*1000000","v":{"v":20979.52833501134,"d":"20,979.53"}},{"$f":"C43/D43*1000000","v":{"v":58573.52855697251,"d":"58,573.53"}},{"$f":"D43/E43/1000","v":{"v":0.8287087387241218,"d":"0.83"}},{"$f":"E43/F43","v":{"v":0.8264094955489614,"d":"0.83"}},{"$f":"F43/G43","v":{"v":0.5529122231337161,"d":"0.55"}},{"$f":"G43/H43*1000","v":{"v":1.1113167416813063,"d":"1.11"}},{"$f":"H43/I43","v":{"v":0.8511440504526735,"d":"0.85"}},{"$f":"IF(PRODUCT(D24:I24)-C24<0.0001,\"prawidłowo\",\"nieprawidłowo\")","v":"prawidłowo"}]
[null,"MAZOWIECKIE",{"$f":"C44/I44*1000000","v":{"v":34806.791903956175,"d":"34,806.79"}},{"$f":"C44/D44*1000000","v":{"v":85195.4063889231,"d":"85,195.41"}},{"$f":"D44/E44/1000","v":{"v":1.0647816134564523,"d":"1.06"}},{"$f":"E44/F44","v":{"v":0.8526497199482982,"d":"0.85"}},{"v":0.5603573153066151,"d":"0.56"},{"$f":"G44/H44*1000","v":{"v":0.9524516892910352,"d":"0.95"}},{"$f":"H44/I44","v":{"v":0.8431573275757606,"d":"0.84"}},{"$f":"IF(PRODUCT(D25:I25)-C25<0.0001,\"prawidłowo\",\"nieprawidłowo\")","v":"prawidłowo"}]
[null,"MAŁOPOLSKIE",{"v":20048.760221016128,"d":"20,048.76"},{"v":58984.331577926496,"d":"58,984.33"},{"v":0.891707776311862,"d":"0.89"},{"v":0.8469387755102041,"d":"0.85"},{"v":0.5597867479055598,"d":"0.56"},{"v":0.9725839474019491,"d":"0.97"},{"v":0.8266593431423247,"d":"0.83"},"prawidłowo"]
[null,"ŚLĄSKIE",{"v":24470.87194754336,"d":"24,470.87"},{"v":73203.09963814552,"d":"73,203.10"},{"v":0.9402133373103777,"d":"0.94"},{"v":0.8103112840466926,"d":"0.81"},{"v":0.5222250444500889,"d":"0.52"},{"v":0.98518913153964,"d":"0.99"},{"v":0.8528337361482359,"d":"0.85"},"prawidłowo"]
[null,"LUBELSKIE",{"v":15881.2742273736,"d":"15,881.27"},{"v":46609.87830946374,"d":"46,609.88"},{"v":0.7968387665232991,"d":"0.80"},{"v":0.858195211786372,"d":"0.86"},{"v":0.5671018276762402,"d":"0.57"},{"v":1.057793646830596,"d":"1.06"},{"v":0.8305940830726217,"d":"0.83"},"prawidłowo"]
[null,"PODKARPACKIE",{"v":16335.893069648562,"d":"16,335.89"},{"v":49270.9132132578,"d":"49,270.91"},{"v":0.9313042629047616,"d":"0.93"},{"v":0.8318485523385301,"d":"0.83"},{"v":0.5429262394195888,"d":"0.54"},{"v":0.9620686686691344,"d":"0.96"},{"v":0.8193501005355383,"d":"0.82"},"prawidłowo"]
[null,"PODLASKIE",{"v":16787.68414147333,"d":"16,787.68"},{"v":51811.09109934385,"d":"51,811.09"},{"v":0.9039996708912919,"d":"0.90"},{"v":0.8582834331337326,"d":"0.86"},{"v":0.5597765363128492,"d":"0.56"},{"v":0.8972035318742833,"d":"0.90"},{"v":0.8315021643109173,"d":"0.83"},"prawidłowo"]
[null,"ŚWIĘTOKRZYSKIE",{"v":17387.45392048448,"d":"17,387.45"},{"v":49855.7650608614,"d":"49,855.77"},{"v":0.8821905232198439,"d":"0.88"},{"v":0.810207336523126,"d":"0.81"},{"v":0.5437987857762359,"d":"0.54"},{"v":1.0694363801294455,"d":"1.07"},{"v":0.8390133283320635,"d":"0.84"},"prawidłowo"]
[null,"LUBUSKIE",{"v":20537.09975644026,"d":"20,537.10"},{"v":68952.2632906388,"d":"68,952.26"},{"v":0.7552381082100323,"d":"0.76"},{"v":0.8105906313645621,"d":"0.81"},{"v":0.5492170022371364,"d":"0.55"},{"v":1.0614665097817584,"d":"1.06"},{"v":0.8345547652690553,"d":"0.83"},"prawidłowo"]
[null,"WIELKOPOLSKIE",{"v":24417.502343274868,"d":"24,417.50"},{"v":65577.25848443033,"d":"65,577.26"},{"v":0.9848703579846936,"d":"0.98"},{"v":0.8289986996098829,"d":"0.83"},{"v":0.5698406817339755,"d":"0.57"},{"v":0.9648924300452988,"d":"0.96"},{"v":0.8294356836654542,"d":"0.83"},"prawidłowo"]
[null,"ZACHODNIOPOMORSKIE",{"v":20565.135422606127,"d":"20,565.14"},{"v":68938.33400774866,"d":"68,938.33"},{"v":0.9155683050897918,"d":"0.92"},{"v":0.7741935483870968,"d":"0.77"},{"v":0.5409711684370258,"d":"0.54"},{"v":0.9276672898038245,"d":"0.93"},{"v":0.8386179020150185,"d":"0.84"},"prawidłowo"]
[null,"DOLNOŚLĄSKIE",{"v":23451.71717507458,"d":"23,451.72"},{"v":73698.27330717478,"d":"73,698.27"},{"v":0.9163227678507583,"d":"0.92"},{"v":0.7709454265949269,"d":"0.77"},{"v":0.544579321892005,"d":"0.54"},{"v":0.971139000926017,"d":"0.97"},{"v":0.851731439856632,"d":"0.85"},"prawidłowo"]
[null,"OPOLSKIE",{"v":18938.196899581537,"d":"18,938.20"},{"v":65415.121859405706,"d":"65,415.12"},{"v":0.8639106510308339,"d":"0.86"},{"v":0.8278301886792453,"d":"0.83"},{"v":0.539440203562341,"d":"0.54"},{"v":0.8840181662359047,"d":"0.88"},{"v":0.84887918450039,"d":"0.85"},"prawidłowo"]
[null,"KUJAWSKO-POMORSKIE",{"v":19600.600120004663,"d":"19,600.60"},{"v":61165.47450240636,"d":"61,165.47"},{"v":0.8956430548131724,"d":"0.90"},{"v":0.8,"d":"0.80"},{"v":0.5575647980711271,"d":"0.56"},{"v":0.9648490206113618,"d":"0.96"},{"v":0.8313489693959104,"d":"0.83"},"prawidłowo"]
[null,"POMORSKIE",{"v":22395.651199180735,"d":"22,395.65"},{"v":71697.00416466923,"d":"71,697.00"},{"v":0.9883519029727654,"d":"0.99"},{"v":0.8128654970760234,"d":"0.81"},{"v":0.5357142857142857,"d":"0.54"},{"v":0.8773034024090663,"d":"0.88"},{"v":0.8272739550795505,"d":"0.83"},"prawidłowo"]
[null,"WARMIŃSKO-MAZURSKIE",{"v":17083.14637886996,"d":"17,083.15"},{"v":60449.84507097475,"d":"60,449.85"},{"v":0.837599832117669,"d":"0.84"},{"v":0.7940691927512356,"d":"0.79"},{"v":0.5232758620689655,"d":"0.52"},{"v":0.9865128386991977,"d":"0.99"},{"v":0.8230842621557733,"d":"0.82"},"prawidłowo"]
[null,"POLSKA",{"v":22664.19669966668,"d":"22,664.20"},{"v":66422.6949494011,"d":"66,422.69"},{"v":0.9223314910169955,"d":"0.92"},{"v":0.8225627877163335,"d":"0.82"},{"v":0.5489938897597492,"d":"0.55"},{"v":0.9778252420867446,"d":"0.98"},{"v":0.8377973614577959,"d":"0.84"},"prawidłowo"]
[]
[null,"Dane","WDB_i","PP_i","PZ_i","AZ_i","NB15+_i","N15+_i","N_i"]
[null,"ŁÓDZKIE",54074,923181.5349386716,1114,1348,2438,2193794,2577465]
[null,"MAZOWIECKIE",179524,2107202.8130303193,1979,2321,4142,4348777,5157729]
[null,"MAŁOPOLSKIE",65483,1110176.1815082682,1245,1470,2626,2700024,3266187]
[null,"ŚLĄSKIE",114665,1566395.4199590893,1666,2056,3937,3996187,4685775]
[null,"LUBELSKIE",34615,742653.7303997148,932,1086,1915,1810372,2179611]
[null,"PODKARPACKIE",34277,695684.284389857,747,898,1654,1719212,2098263]
[null,"PODLASKIE",20140,388719.8584832555,430,501,895,997544,1199689]
[null,"ŚWIĘTOKRZYSKIE",22343,448152.7857956807,508,627,1153,1078138,1285007]
[null,"LUBUSKIE",20726,300584.7670675929,398,491,894,842231,1009198]
[null,"WIELKOPOLSKIE",82346,1255709.7064304843,1275,1538,2699,2797203,3372417]
[null,"ZACHODNIOPOMORSKIE",34841,505393.7044095651,552,713,1318,1420768,1694178]
[null,"DOLNOŚLĄSKIE",67734,919071.7361543105,1003,1301,2389,2459998,2888232]
[null,"OPOLSKIE",19836,303232.6385118227,351,424,786,889122,1047407]
[null,"KUJAWSKO-POMORSKIE",40539,662775.8605617476,740,925,1659,1719440,2068253]
[null,"POMORSKIE",49249,686904.572566072,695,855,1596,1819211,2199043]
[null,"WARMIŃSKO-MAZURSKIE",24405,403723.11908071645,482,607,1160,1175859,1428601]
[null,"POLSKA",864799,13019631.327195909,14116,17161,31259,31967880,38157055]

{"sheet":"2004","index":12,"n_rows":59,"n_cols":10,"rows_kept":59,"hidden":true,"merged":[[0,0,0,10],[1,0,1,10],[2,1,3,1],[21,1,22,1]]}
["DEKOMPOZYCJA RÓŻNIC W POZIOMIE WDB PER CAPITA"]
[2004]
[null,"Różnice względem średniej","WDB per capita","WDB na 1 pracującego","Współczynnik dojazdów netto","Udział pracujących wśród aktwnych zawodowo","Współczynnik aktywności zawodowej","Wskaźnik różnicy w metodologii BAEL/demo","Wskaźnik struktury wiekowej","Interakcje"]
[null,null,"WDB_i/N_i","WDB_i/Pp_i","Pp_i/Pz_i","Pz_i/Az_i","Az_i/NB15+_i","NB15+_i/N15+_i","Ni15+_i/N_i"]
[null,"ŁÓDZKIE",{"$f":"(C24-C$40)/C$40","v":{"v":-0.07759143581013789,"d":"-7.8%"}},{"$f":"(D24-D$40)/D$40","v":{"v":-0.11711548916916141,"d":"-11.7%"}},{"$f":"(E24-E$40)/E$40","v":{"v":-0.11014602679323662,"d":"-11.0%"}},{"$f":"(F24-F$40)/F$40","v":{"v":2.270832296815282E-3,"d":"0.2%"}},{"$f":"(G24-G$40)/G$40","v":{"v":0.006308420423104693,"d":"0.6%"}},{"$f":"(H24-H$40)/H$40","v":{"v":0.14452090966353992,"d":"14.5%"}},{"$f":"(I24-I$40)/I$40","v":{"v":0.017093209915764622,"d":"1.7%"}},{"$f":"C5-SUM(D5:I5)","v":{"v":-0.020523292146964404,"d":"-2.1%"}}]
[null,"MAZOWIECKIE",{"$f":"(C25-C$40)/C$40","v":{"v":0.5048841262208135,"d":"50.5%"}},{"v":0.2512392915678199,"d":"25.1%"},{"v":0.13946059328860919,"d":"13.9%"},{"v":0.053757725666648694,"d":"5.4%"},{"v":0.020304863700881477,"d":"2.0%"},{"v":-0.026023766435327857,"d":"-2.6%"},{"v":0.007962300444032325,"d":"0.8%"},{"$f":"C6-SUM(D6:I6)","v":{"v":0.058183117988149735,"d":"5.8%"}}]
[null,"MAŁOPOLSKIE",{"v":-0.11636788723544148,"d":"-11.6%"},{"v":-0.1125301395792939,"d":"-11.3%"},{"v":-0.03365776562848133,"d":"-3.4%"},{"v":0.0212874996318939,"d":"2.1%"},{"v":0.039425065358316615,"d":"3.9%"},{"v":-0.015914659982616694,"d":"-1.6%"},{"v":-0.013691098013813912,"d":"-1.4%"},{"v":-0.001286789021446147,"d":"-0.1%"}]
[null,"ŚLĄSKIE",{"v":0.11876828489199673,"d":"11.9%"},{"v":0.13391316420454816,"d":"13.4%"},{"v":0.032121471194890526,"d":"3.2%"},{"v":-3.8666233967606612E-3,"d":"-0.4%"},{"v":-0.06412422969928633,"d":"-6.4%"},{"v":0.006730131233267399,"d":"0.7%"},{"v":0.01854629585734159,"d":"1.9%"},{"v":-4.551924502003965E-3,"d":"-0.5%"}]
[null,"LUBELSKIE",{"v":-0.29131666540128115,"d":"-29.1%"},{"v":-0.28631483328829416,"d":"-28.6%"},{"v":-0.12382197836745251,"d":"-12.4%"},{"v":0.026526599488456915,"d":"2.7%"},{"v":0.04625416446935982,"d":"4.6%"},{"v":0.06530358167524931,"d":"6.5%"},{"v":-0.009459127582907513,"d":"-0.9%"},{"v":-9.80507179569301E-3,"d":"-1.0%"}]
[null,"PODKARPACKIE",{"v":-0.27347847200153924,"d":"-27.3%"},{"v":-0.2578738870034244,"d":"-25.8%"},{"v":0.009883177248697292,"d":"1.0%"},{"v":0.028438194645791094,"d":"2.8%"},{"v":-0.01687777373486161,"d":"-1.7%"},{"v":-0.016948719049259948,"d":"-1.7%"},{"v":-0.024701062130309905,"d":"-2.5%"},{"v":4.601598021828246E-3,"d":"0.5%"}]
[null,"PODLASKIE",{"v":-0.26162053654804307,"d":"-26.2%"},{"v":-0.22687967373966586,"d":"-22.7%"},{"v":-0.016520169820636664,"d":"-1.7%"},{"v":0.04368958270266245,"d":"4.4%"},{"v":0.02148469589162707,"d":"2.1%"},{"v":-0.08049680308650034,"d":"-8.0%"},{"v":-9.371989982492562E-3,"d":"-0.9%"},{"v":0.00647382148696285,"d":"0.6%"}]
[null,"ŚWIĘTOKRZYSKIE",{"v":-0.2079344096735563,"d":"-20.8%"},{"v":-0.22489108948525954,"d":"-22.5%"},{"v":-0.010558313127992684,"d":"-1.1%"},{"v":-0.0204380759908406,"d":"-2.0%"},{"v":-0.03587049632891361,"d":"-3.6%"},{"v":0.09284289053591083,"d":"9.3%"},{"v":6.5233524949828627E-4,"d":"0.1%"},{"v":-0.009671660525958997,"d":"-1.0%"}]
[null,"LUBUSKIE",{"v":-0.11168147989843696,"d":"-11.2%"},{"v":0.0370964957050184,"d":"3.7%"},{"v":-0.1713730307088061,"d":"-17.1%"},{"v":-0.052412547336546114,"d":"-5.2%"},{"v":1.7428701481767566E-3,"d":"0.2%"},{"v":0.09345097388260717,"d":"9.3%"},{"v":-4.1002842635893405E-3,"d":"-0.4%"},{"v":-0.01608595732529773,"d":"-1.6%"}]
[null,"WIELKOPOLSKIE",{"v":0.07085673553170582,"d":"7.1%"},{"v":-0.015666002143357047,"d":"-1.6%"},{"v":0.05595838122702552,"d":"5.6%"},{"v":0.010692594424451881,"d":"1.1%"},{"v":0.04517280087062841,"d":"4.5%"},{"v":-0.014843468233869466,"d":"-1.5%"},{"v":-0.010012612533324439,"d":"-1.0%"},{"v":-4.4495807984902547E-4,"d":"-0.0%"}]
[null,"ZACHODNIOPOMORSKIE",{"v":-0.09730099894538466,"d":"-9.7%"},{"v":0.038402888990267586,"d":"3.8%"},{"v":-0.028329493381654743,"d":"-2.8%"},{"v":-0.059386708207131884,"d":"-5.9%"},{"v":-0.006536710250358279,"d":"-0.7%"},{"v":-0.04346992643966818,"d":"-4.3%"},{"v":9.1336722728094146E-4,"d":"0.1%"},{"v":1.1055831158798962E-3,"d":"0.1%"}]
[null,"DOLNOŚLĄSKIE",{"v":0.013576367680592371,"d":"1.4%"},{"v":0.08639426766028102,"d":"8.6%"},{"v":0.02897484336864519,"d":"2.9%"},{"v":-0.07440562481878805,"d":"-7.4%"},{"v":-0.021749770958457326,"d":"-2.2%"},{"v":-0.015605029159961304,"d":"-1.6%"},{"v":0.017241810684091,"d":"1.7%"},{"v":-0.007274129095218162,"d":"-0.7%"}]
[null,"OPOLSKIE",{"v":-0.1423753079574497,"d":"-14.2%"},{"v":0.01360927022060579,"d":"1.4%"},{"v":-0.004517443423217128,"d":"-0.5%"},{"v":0.014306982810963341,"d":"1.4%"},{"v":-0.042113473511100556,"d":"-4.2%"},{"v":-0.13559015352963188,"d":"-13.6%"},{"v":0.012021788700154142,"d":"1.2%"},{"v":-9.2279225223396155E-5,"d":"-0.0%"}]
[null,"KUJAWSKO-POMORSKIE",{"v":-0.1192057869839847,"d":"-11.9%"},{"v":-0.06248312957316792,"d":"-6.2%"},{"v":-0.0820351910123575,"d":"-8.2%"},{"v":-0.03858832720485115,"d":"-3.9%"},{"v":0.02872391020374385,"d":"2.9%"},{"v":0.04333922804461022,"d":"4.3%"},{"v":-0.00817382082023516,"d":"-0.8%"},{"v":1.1543378272957372E-5,"d":"0.0%"}]
[null,"POMORSKIE",{"v":-0.01842510362822091,"d":"-1.8%"},{"v":0.07237127414204507,"d":"7.2%"},{"v":0.06733681827896172,"d":"6.7%"},{"v":-0.013859498435998305,"d":"-1.4%"},{"v":-0.028325052040407254,"d":"-2.8%"},{"v":-0.09385451348448999,"d":"-9.4%"},{"v":-0.012313661482362341,"d":"-1.2%"},{"v":-0.009780470605969802,"d":"-1.0%"}]
[null,"WARMIŃSKO-MAZURSKIE",{"v":-0.2428215196365133,"d":"-24.3%"},{"v":-0.07373426678345694,"d":"-7.4%"},{"v":-0.09618721964706384,"d":"-9.6%"},{"v":-0.04103699787104611,"d":"-4.1%"},{"v":-0.02255813068812904,"d":"-2.3%"},{"v":-0.016389981780586888,"d":"-1.6%"},{"v":-0.019001252840559608,"d":"-1.9%"},{"v":0.026086329974329164,"d":"2.6%"}]
[]
[null,"Wartości","WDB per capita","WDB na 1 pracującego","Współczynnik dojazdów netto","Udział pracujących wśród aktwnych zawodowo","Współczynnik aktywności zawodowej","Wskaźnik różnicy w metodologii BAEL/demo","Wskaźnik struktury wiekowej","Weryfikacja"]
[null,null,"WDB_i/N_i","WDB_i/Pp_i","Pp_i/Pz_i","Pz_i/Az_i","Az_i/NB15+_i","NB15+_i/N15+_i","Ni15+_i/N_i"]
[null,"ŁÓDZKIE",{"$f":"C43/I43*1000000","v":{"v":19804.057808820337,"d":"19,804.06"}},{"$f":"C43/D43*1000000","v":{"v":56062.87814853189,"d":"56,062.88"}},{"$f":"D43/E43/1000","v":{"v":0.832512411701353,"d":"0.83"}},{"$f":"E43/F43","v":{"v":0.8121301775147929,"d":"0.81"}},{"$f":"F43/G43","v":{"v":0.5504885993485342,"d":"0.55"}},{"$f":"G43/H43*1000","v":{"v":1.1203106946336843,"d":"1.12"}},{"$f":"H43/I43","v":{"v":0.8471798530124411,"d":"0.85"}},{"$f":"IF(PRODUCT(D24:I24)-C24<0.0001,\"prawidłowo\",\"nieprawidłowo\")","v":"prawidłowo"}]
[null,"MAZOWIECKIE",{"$f":"C44/I44*1000000","v":{"v":32309.773985488137,"d":"32,309.77"}},{"$f":"C44/D44*1000000","v":{"v":79453.28644604853,"d":"79,453.29"}},{"$f":"D44/E44/1000","v":{"v":1.0660345574890608,"d":"1.07"}},{"$f":"E44/F44","v":{"v":0.8538494997825141,"d":"0.85"}},{"v":0.558145180869143,"d":"0.56"},{"$f":"G44/H44*1000","v":{"v":0.9533735745398566,"d":"0.95"}},{"$f":"H44/I44","v":{"v":0.8395743332147299,"d":"0.84"}},{"$f":"IF(PRODUCT(D25:I25)-C25<0.0001,\"prawidłowo\",\"nieprawidłowo\")","v":"prawidłowo"}]
[null,"MAŁOPOLSKIE",{"v":18971.529669489704,"d":"18,971.53"},{"v":56354.04635022936,"d":"56,354.05"},{"v":0.9040718233423881,"d":"0.90"},{"v":0.8275391956373551,"d":"0.83"},{"v":0.5686046511627907,"d":"0.57"},{"v":0.963268841613214,"d":"0.96"},{"v":0.8215383039266597,"d":"0.82"},"prawidłowo"]
[null,"ŚLĄSKIE",{"v":24019.889503232556,"d":"24,019.89"},{"v":72003.11566910699,"d":"72,003.12"},{"v":0.9656122926065237,"d":"0.97"},{"v":0.8071570576540755,"d":"0.81"},{"v":0.5119592875318066,"d":"0.51"},{"v":0.9854346243111988,"d":"0.99"},{"v":0.8483901896093216,"d":"0.85"},"prawidłowo"]
[null,"LUBELSKIE",{"v":15215.389656390666,"d":"15,215.39"},{"v":45318.77504581029,"d":"45,318.78"},{"v":0.8197177287868835,"d":"0.82"},{"v":0.8317843866171004,"d":"0.83"},{"v":0.5723404255319149,"d":"0.57"},{"v":1.0427690621512546,"d":"1.04"},{"v":0.8250632906758144,"d":"0.83"},"prawidłowo"]
[null,"PODKARPACKIE",{"v":15598.374623148511,"d":"15,598.37"},{"v":47124.76584804682,"d":"47,124.77"},{"v":0.9448070186147121,"d":"0.94"},{"v":0.8333333333333334,"d":"0.83"},{"v":0.5378048780487805,"d":"0.54"},{"v":0.962256656146385,"d":"0.96"},{"v":0.8123676402245023,"d":"0.81"},"prawidłowo"]
[null,"PODLASKIE",{"v":15852.963802316151,"d":"15,852.96"},{"v":49092.888269721785,"d":"49,092.89"},{"v":0.9201050845811247,"d":"0.92"},{"v":0.845691382765531,"d":"0.85"},{"v":0.5587905935050392,"d":"0.56"},{"v":0.9000528138493232,"d":"0.90"},{"v":0.8251358712601617,"d":"0.83"},"prawidłowo"]
[null,"ŚWIĘTOKRZYSKIE",{"v":17005.601799652824,"d":"17,005.60"},{"v":49219.16272054204,"d":"49,219.16"},{"v":0.925682763439516,"d":"0.93"},{"v":0.7937293729372937,"d":"0.79"},{"v":0.5274151436031331,"d":"0.53"},{"v":1.0697258280599606,"d":"1.07"},{"v":0.8334855547442254,"d":"0.83"},"prawidłowo"]
[null,"LUBUSKIE",{"v":19072.146560334848,"d":"19,072.15"},{"v":65855.28883303747,"d":"65,855.29"},{"v":0.7752308326718068,"d":"0.78"},{"v":0.7678207739307535,"d":"0.77"},{"v":0.5479910714285714,"d":"0.55"},{"v":1.0703210485323702,"d":"1.07"},{"v":0.8295268974045946,"d":"0.83"},"prawidłowo"]
[null,"WIELKOPOLSKIE",{"v":22991.231346665347,"d":"22,991.23"},{"v":62504.88744826065,"d":"62,504.89"},{"v":0.987913168992845,"d":"0.99"},{"v":0.818954248366013,"d":"0.82"},{"v":0.5717488789237668,"d":"0.57"},{"v":0.9643173742891943,"d":"0.96"},{"v":0.8246022697051035,"d":"0.82"},"prawidłowo"]
[null,"ZACHODNIOPOMORSKIE",{"v":19380.89464352618,"d":"19,380.89"},{"v":65938.24438007279,"d":"65,938.24"},{"v":0.9090567454891326,"d":"0.91"},{"v":0.7621696801112656,"d":"0.76"},{"v":0.5434618291761149,"d":"0.54"},{"v":0.9362964556614443,"d":"0.94"},{"v":0.833702979293336,"d":"0.83"},"prawidłowo"]
[null,"DOLNOŚLĄSKIE",{"v":21761.42520622664,"d":"21,761.43"},{"v":68985.68125494229,"d":"68,985.68"},{"v":0.9626684312548529,"d":"0.96"},0.75,{"v":0.5351397121083827,"d":"0.54"},{"v":0.9635719227706487,"d":"0.96"},{"v":0.8473036288629148,"d":"0.85"},"prawidłowo"]
[null,"OPOLSKIE",{"v":18413.151870938662,"d":"18,413.15"},{"v":64363.8576840862,"d":"64,363.86"},{"v":0.9313343637673462,"d":"0.93"},{"v":0.821882951653944,"d":"0.82"},{"v":0.524,"d":"0.52"},{"v":0.8461248609534812,"d":"0.85"},{"v":0.8429556522822437,"d":"0.84"},"prawidłowo"]
[null,"KUJAWSKO-POMORSKIE",{"v":18910.600128223847,"d":"18,910.60"},{"v":59532.015143714496,"d":"59,532.02"},{"v":0.8588118050799592,"d":"0.86"},{"v":0.7790224032586558,"d":"0.78"},{"v":0.5627507163323783,"d":"0.56"},{"v":1.021269323644638,"d":"1.02"},{"v":0.8261338769147756,"d":"0.83"},"prawidłowo"]
[null,"POMORSKIE",{"v":21074.355492901,"d":"21,074.36"},{"v":68095.22574547742,"d":"68,095.23"},{"v":0.9985583875980536,"d":"1.00"},{"v":0.799059929494712,"d":"0.80"},{"v":0.5315427857589007,"d":"0.53"},{"v":0.8869776610160852,"d":"0.89"},{"v":0.8226856289376543,"d":"0.82"},"prawidłowo"]
[null,"WARMIŃSKO-MAZURSKIE",{"v":16256.577593556163,"d":"16,256.58"},{"v":58817.571604707045,"d":"58,817.57"},{"v":0.8455717231745111,"d":"0.85"},{"v":0.7770382695507487,"d":"0.78"},{"v":0.5346975088967971,"d":"0.53"},{"v":0.9628035743654404,"d":"0.96"},{"v":0.8171152518978606,"d":"0.82"},"prawidłowo"]
[null,"POLSKA",{"v":21469.941387864226,"d":"21,469.94"},{"v":63499.673468927336,"d":"63,499.67"},{"v":0.9355607063271643,"d":"0.94"},{"v":0.8102901444849054,"d":"0.81"},{"v":0.5470376558282997,"d":"0.55"},{"v":0.9788468565096178,"d":"0.98"},{"v":0.832942197188205,"d":"0.83"},"prawidłowo"]
[]
[null,"Dane","WDB_i","PP_i","PZ_i","AZ_i","NB15+_i","N15+_i","N_i"]
[null,"ŁÓDZKIE",51247,914098.6280480856,1098,1352,2456,2192249,2587702]
[null,"MAZOWIECKIE",166266,2092625.8363510265,1963,2299,4119,4320447,5145997]
[null,"MAŁOPOLSKIE",61851,1097543.1935376592,1214,1467,2580,2678380,3260201]
[null,"ŚLĄSKIE",112912,1568154.3631929946,1624,2012,3930,3988088,4700771]
[null,"LUBELSKIE",33248,733647.3672642608,895,1076,1880,1802892,2185156]
[null,"PODKARPACKIE",32725,694433.1586818134,735,882,1640,1704327,2097975]
[null,"PODLASKIE",19062,388284.34569323465,422,499,893,992164,1202425]
[null,"ŚWIĘTOKRZYSKIE",21915,445253.4092144072,481,606,1149,1074107,1288693]
[null,"LUBUSKIE",19247,292262.0239172712,377,491,896,837132,1009168]
[null,"WIELKOPOLSKIE",77372,1237855.2007480348,1253,1530,2676,2775020,3365283]
[null,"ZACHODNIOPOMORSKIE",32848,498163.09652804467,548,719,1323,1413014,1694865]
[null,"DOLNOŚLĄSKIE",62957,912609.6728296005,948,1264,2362,2451296,2893055]
[null,"OPOLSKIE",19362,300820.9994968528,323,393,750,886394,1051531]
[null,"KUJAWSKO-POMORSKIE",39112,656991.0308861688,765,982,1745,1708658,2068258]
[null,"POMORSKIE",46238,679019.7035666765,680,851,1601,1805006,2194041]
[null,"WARMIŃSKO-MAZURSKIE",23226,394881.9947224967,467,601,1124,1167424,1428714]
[null,"POLSKA",819590,12906995.504489558,13796,17026,31124,31796598,38173835]

{"sheet":"2003","index":13,"n_rows":59,"n_cols":10,"rows_kept":59,"hidden":true,"merged":[[0,0,0,10],[1,0,1,10],[2,1,3,1],[21,1,22,1]]}
["DEKOMPOZYCJA RÓŻNIC W POZIOMIE WDB PER CAPITA"]
[2003]
[null,"Różnice względem średniej","WDB per capita","WDB na 1 pracującego","Współczynnik dojazdów netto","Udział pracujących wśród aktwnych zawodowo","Współczynnik aktywności zawodowej","Wskaźnik różnicy w metodologii BAEL/demo","Wskaźnik struktury wiekowej","Interakcje"]
[null,null,"WDB_i/N_i","WDB_i/Pp_i","Pp_i/Pz_i","Pz_i/Az_i","Az_i/NB15+_i","NB15+_i/N15+_i","Ni15+_i/N_i"]
[null,"ŁÓDZKIE",{"$f":"(C24-C$40)/C$40","v":{"v":-0.07153528436198105,"d":"-7.2%"}},{"$f":"(D24-D$40)/D$40","v":{"v":-0.10469962696061552,"d":"-10.5%"}},{"$f":"(E24-E$40)/E$40","v":{"v":-0.10924449134689802,"d":"-10.9%"}},{"$f":"(F24-F$40)/F$40","v":{"v":-3.2627959392040966E-4,"d":"-0.0%"}},{"$f":"(G24-G$40)/G$40","v":{"v":0.007528988457494767,"d":"0.8%"}},{"$f":"(H24-H$40)/H$40","v":{"v":0.1349207141003681,"d":"13.5%"}},{"$f":"(I24-I$40)/I$40","v":{"v":0.018490009089636956,"d":"1.8%"}},{"$f":"C5-SUM(D5:I5)","v":{"v":-0.01820459810804695,"d":"-1.8%"}}]
[null,"MAZOWIECKIE",{"$f":"(C25-C$40)/C$40","v":{"v":0.5130157387262512,"d":"51.3%"}},{"v":0.2586854470414444,"d":"25.9%"},{"v":0.17074876540976786,"d":"17.1%"},{"v":0.04123032302634081,"d":"4.1%"},{"v":0.04624141607021016,"d":"4.6%"},{"v":-0.06651192032412137,"d":"-6.7%"},{"v":0.009659729470286699,"d":"1.0%"},{"$f":"C6-SUM(D6:I6)","v":{"v":0.0529619780323225,"d":"5.3%"}}]
[null,"MAŁOPOLSKIE",{"v":-0.10821493032499065,"d":"-10.8%"},{"v":-0.10356243540671903,"d":"-10.4%"},{"v":-0.048848769955034364,"d":"-4.9%"},{"v":0.020668372093762325,"d":"2.1%"},{"v":0.03468569715321349,"d":"3.5%"},{"v":0.004556649816064914,"d":"0.5%"},{"v":-0.01412230674116665,"d":"-1.4%"},{"v":-1.5921372851113308E-3,"d":"-0.2%"}]
[null,"ŚLĄSKIE",{"v":0.08546781117046945,"d":"8.5%"},{"v":0.0909381233919998,"d":"9.1%"},{"v":0.09105761586682215,"d":"9.1%"},{"v":-7.385072773538252E-3,"d":"-0.7%"},{"v":-0.07587390603248462,"d":"-7.6%"},{"v":-0.02413776055311172,"d":"-2.4%"},{"v":0.018752287001960542,"d":"1.9%"},{"v":-7.883475731178452E-3,"d":"-0.8%"}]
[null,"LUBELSKIE",{"v":-0.2764363978261421,"d":"-27.6%"},{"v":-0.2715788928375784,"d":"-27.2%"},{"v":-0.1358536622645852,"d":"-13.6%"},{"v":0.04541965705893787,"d":"4.5%"},{"v":0.048122378818022435,"d":"4.8%"},{"v":0.05993870011175206,"d":"6.0%"},{"v":-0.010254600487328758,"d":"-1.0%"},{"v":-0.012229978225362148,"d":"-1.2%"}]
[null,"PODKARPACKIE",{"v":-0.2532687370807075,"d":"-25.3%"},{"v":-0.23892927705102526,"d":"-23.9%"},{"v":-0.04474161723393817,"d":"-4.5%"},{"v":0.023308011484158894,"d":"2.3%"},{"v":0.024659997855630736,"d":"2.5%"},{"v":0.00702271438794342,"d":"0.7%"},{"v":-0.027268369654090803,"d":"-2.7%"},{"v":2.6798031306137227E-3,"d":"0.3%"}]
[null,"PODLASKIE",{"v":-0.24624185956649286,"d":"-24.6%"},{"v":-0.21610941726854485,"d":"-21.6%"},{"v":-0.034716278062370376,"d":"-3.5%"},{"v":0.022346409665945675,"d":"2.2%"},{"v":0.015652813594613516,"d":"1.6%"},{"v":-0.029689678816891076,"d":"-3.0%"},{"v":-0.011293059614752732,"d":"-1.1%"},{"v":0.007567350935507033,"d":"0.8%"}]
[null,"ŚWIĘTOKRZYSKIE",{"v":-0.19950031745662988,"d":"-20.0%"},{"v":-0.21779249969011963,"d":"-21.8%"},{"v":-0.02228453656502872,"d":"-2.2%"},{"v":0.004765553187008259,"d":"0.5%"},{"v":-0.05503512485342277,"d":"-5.5%"},{"v":0.10246860359436505,"d":"10.2%"},{"v":-4.5888652392416123E-5,"d":"-0.0%"},{"v":-0.01157642447703966,"d":"-1.2%"}]
[null,"LUBUSKIE",{"v":-0.1353596599738611,"d":"-13.5%"},{"v":0.0176233181798721,"d":"1.8%"},{"v":-0.14159851050004427,"d":"-14.2%"},{"v":-0.06135789898225424,"d":"-6.1%"},{"v":-0.02359849850642624,"d":"-2.4%"},{"v":0.08471842806449155,"d":"8.5%"},{"v":-0.004336711166118259,"d":"-0.4%"},{"v":-0.006809787063381756,"d":"-0.7%"}]
[null,"WIELKOPOLSKIE",{"v":0.055054342360561184,"d":"5.5%"},{"v":-0.019457355218385194,"d":"-1.9%"},{"v":-0.010032773990619847,"d":"-1.0%"},{"v":0.03139929360074372,"d":"3.1%"},{"v":0.04730400846017485,"d":"4.7%"},{"v":0.016624197814330326,"d":"1.7%"},{"v":-0.010245493267808561,"d":"-1.0%"},{"v":-5.3753503787411228E-4,"d":"-0.1%"}]
[null,"ZACHODNIOPOMORSKIE",{"v":-0.07564602222147213,"d":"-7.6%"},{"v":0.05792952161663774,"d":"5.8%"},{"v":-0.03410089710861834,"d":"-3.4%"},{"v":-0.0725653942948992,"d":"-7.3%"},{"v":-0.03265815853599857,"d":"-3.3%"},{"v":0.00729785590957343,"d":"0.7%"},{"v":0.000987457785457224,"d":"0.1%"},{"v":-0.002536407593624418,"d":"-0.3%"}]
[null,"DOLNOŚLĄSKIE",{"v":0.022316223899349494,"d":"2.2%"},{"v":0.0957092559184726,"d":"9.6%"},{"v":0.07722182152251945,"d":"7.7%"},{"v":-0.07948748919598729,"d":"-7.9%"},{"v":-0.031885773030599134,"d":"-3.2%"},{"v":-0.045142261028519266,"d":"-4.5%"},{"v":0.017864130467224706,"d":"1.8%"},{"v":-0.01196346075376159,"d":"-1.2%"}]
[null,"OPOLSKIE",{"v":-0.20230207021543167,"d":"-20.2%"},{"v":-0.056997977261033464,"d":"-5.7%"},{"v":-0.005062549677413312,"d":"-0.5%"},{"v":0.01850989207822293,"d":"1.9%"},{"v":-0.0772523661061817,"d":"-7.7%"},{"v":-0.10461443535171464,"d":"-10.5%"},{"v":0.010349852065313869,"d":"1.0%"},{"v":0.012765514037374637,"d":"1.3%"}]
[null,"KUJAWSKO-POMORSKIE",{"v":-0.11093203861194063,"d":"-11.1%"},{"v":-0.0606333077512271,"d":"-6.1%"},{"v":-0.09952548646718826,"d":"-10.0%"},{"v":-0.027740801263219792,"d":"-2.8%"},{"v":0.01683647398214138,"d":"1.7%"},{"v":0.07200414457854397,"d":"7.2%"},{"v":-0.008257929774836017,"d":"-0.8%"},{"v":-0.003615131916154826,"d":"-0.4%"}]
[null,"POMORSKIE",{"v":-0.008041037397544557,"d":"-0.8%"},{"v":0.07940685418167213,"d":"7.9%"},{"v":0.04698491796234365,"d":"4.7%"},{"v":-0.011047719892797077,"d":"-1.1%"},{"v":-0.013444499416141413,"d":"-1.3%"},{"v":-0.08953314251461218,"d":"-9.0%"},{"v":-0.011885872114188768,"d":"-1.2%"},{"v":-0.00852157560382091,"d":"-0.9%"}]
[null,"WARMIŃSKO-MAZURSKIE",{"v":-0.2329072418419312,"d":"-23.3%"},{"v":-0.05722063056137317,"d":"-5.7%"},{"v":-0.09694256155876588,"d":"-9.7%"},{"v":-0.054268668142660355,"d":"-5.4%"},{"v":-0.015811084241955143,"d":"-1.6%"},{"v":-0.011759600438714678,"d":"-1.2%"},{"v":-0.020479370157571213,"d":"-2.0%"},{"v":0.023574673259109252,"d":"2.4%"}]
[]
[null,"Wartości","WDB per capita","WDB na 1 pracującego","Współczynnik dojazdów netto","Udział pracujących wśród aktwnych zawodowo","Współczynnik aktywności zawodowej","Wskaźnik różnicy w metodologii BAEL/demo","Wskaźnik struktury wiekowej","Weryfikacja"]
[null,null,"WDB_i/N_i","WDB_i/Pp_i","Pp_i/Pz_i","Pz_i/Az_i","Az_i/NB15+_i","NB15+_i/N15+_i","Ni15+_i/N_i"]
[null,"ŁÓDZKIE",{"$f":"C43/I43*1000000","v":{"v":18117.172501264875,"d":"18,117.17"}},{"$f":"C43/D43*1000000","v":{"v":51501.76912937341,"d":"51,501.77"}},{"$f":"D43/E43/1000","v":{"v":0.8474950686089588,"d":"0.85"}},{"$f":"E43/F43","v":{"v":0.8032786885245902,"d":"0.80"}},{"$f":"F43/G43","v":{"v":0.5515824085491163,"d":"0.55"}},{"$f":"G43/H43*1000","v":{"v":1.1112806173111303,"d":"1.11"}},{"$f":"H43/I43","v":{"v":0.8430060675508857,"d":"0.84"}},{"$f":"IF(PRODUCT(D24:I24)-C24<0.0001,\"prawidłowo\",\"nieprawidłowo\")","v":"prawidłowo"}]
[null,"MAZOWIECKIE",{"$f":"C44/I44*1000000","v":{"v":29523.54211629423,"d":"29,523.54"}},{"$f":"C44/D44*1000000","v":{"v":72405.3393164162,"d":"72,405.34"}},{"$f":"D44/E44/1000","v":{"v":1.1138901703398967,"d":"1.11"}},{"$f":"E44/F44","v":{"v":0.8366711170449488,"d":"0.84"}},{"v":0.5727759367830741,"d":"0.57"},{"$f":"G44/H44*1000","v":{"v":0.9140437711167294,"d":"0.91"}},{"$f":"H44/I44","v":{"v":0.8356972287494753,"d":"0.84"}},{"$f":"IF(PRODUCT(D25:I25)-C25<0.0001,\"prawidłowo\",\"nieprawidłowo\")","v":"prawidłowo"}]
[null,"MAŁOPOLSKIE",{"v":17401.440969409603,"d":"17,401.44"},{"v":51567.18558470876,"d":"51,567.19"},{"v":0.904957610852544,"d":"0.90"},{"v":0.8201487491548344,"d":"0.82"},{"v":0.56644963615473,"d":"0.57"},{"v":0.9836320018323961,"d":"0.98"},{"v":0.8160127933146201,"d":"0.82"},"prawidłowo"]
[null,"ŚLĄSKIE",{"v":21180.78075377594,"d":"21,180.78"},{"v":62755.74662683074,"d":"62,755.75"},{"v":1.038069301882346,"d":"1.04"},{"v":0.7976066597294484,"d":"0.80"},{"v":0.5059226112134773,"d":"0.51"},{"v":0.9555352884036398,"d":"0.96"},{"v":0.8432231554648565,"d":"0.84"},"prawidłowo"]
[null,"LUBELSKIE",{"v":14118.928135262773,"d":"14,118.93"},{"v":41902.11109003002,"d":"41,902.11"},{"v":0.8221781989253663,"d":"0.82"},{"v":0.8400374181478016,"d":"0.84"},{"v":0.5738056897477187,"d":"0.57"},{"v":1.037860458742122,"d":"1.04"},{"v":0.8192141009468905,"d":"0.82"},"prawidłowo"]
[null,"PODKARPACKIE",{"v":14570.999710096277,"d":"14,571.00"},{"v":43780.26620426656,"d":"43,780.27"},{"v":0.9088652955576503,"d":"0.91"},{"v":0.8222698072805139,"d":"0.82"},{"v":0.5609609609609609,"d":"0.56"},{"v":0.9860466989347735,"d":"0.99"},{"v":0.8051317726849662,"d":"0.81"},"prawidłowo"]
[null,"PODLASKIE",{"v":14708.115477584333,"d":"14,708.12"},{"v":45092.968829523124,"d":"45,092.97"},{"v":0.9184037440168501,"d":"0.92"},{"v":0.8214971209213052,"d":"0.82"},{"v":0.5560298826040555,"d":"0.56"},{"v":0.9500990151214799,"d":"0.95"},{"v":0.8183545664030961,"d":"0.82"},"prawidłowo"]
[null,"ŚWIĘTOKRZYSKIE",{"v":15620.18522791147,"d":"15,620.19"},{"v":44996.15023666654,"d":"44,996.15"},{"v":0.9302317254448286,"d":"0.93"},{"v":0.8073701842546064,"d":"0.81"},{"v":0.5173310225303293,"d":"0.52"},{"v":1.079504475640523,"d":"1.08"},{"v":0.8276638706470589,"d":"0.83"},"prawidłowo"]
[null,"LUBUSKIE",{"v":16871.764675560524,"d":"16,871.76"},{"v":58538.34397013165,"d":"58,538.34"},{"v":0.8167123550409761,"d":"0.82"},{"v":0.7542372881355932,"d":"0.75"},{"v":0.5345413363533409,"d":"0.53"},{"v":1.0621240315485718,"d":"1.06"},{"v":0.8241123489025423,"d":"0.82"},"prawidłowo"]
[null,"WIELKOPOLSKIE",{"v":20587.321410076154,"d":"20,587.32"},{"v":56405.29417139697,"d":"56,405.29"},{"v":0.941888468807864,"d":"0.94"},{"v":0.8287714831317632,"d":"0.83"},{"v":0.5733576642335766,"d":"0.57"},{"v":0.9954481860136623,"d":"1.00"},{"v":0.819221639009361,"d":"0.82"},"prawidłowo"]
[null,"ZACHODNIOPOMORSKIE",{"v":18036.95949407838,"d":"18,036.96"},{"v":60856.940997892016,"d":"60,856.94"},{"v":0.9189892383736679,"d":"0.92"},{"v":0.7452316076294278,"d":"0.75"},{"v":0.5295815295815296,"d":"0.53"},{"v":0.9863161093316463,"d":"0.99"},{"v":0.82851917340822,"d":"0.83"},"prawidłowo"]
[null,"DOLNOŚLĄSKIE",{"v":19948.501076315773,"d":"19,948.50"},{"v":63030.203974625496,"d":"63,030.20"},{"v":1.024905456850599,"d":"1.02"},{"v":0.7396694214876033,"d":"0.74"},{"v":0.5300043802014893,"d":"0.53"},{"v":0.9349683060897029,"d":"0.93"},{"v":0.8424880266555062,"d":"0.84"},"prawidłowo"]
[null,"OPOLSKIE",{"v":15565.514504100252,"d":"15,565.51"},{"v":54245.78602459484,"d":"54,245.79"},{"v":0.9466173091623763,"d":"0.95"},{"v":0.8184143222506394,"d":"0.82"},{"v":0.5051679586563308,"d":"0.51"},{"v":0.8767349213487219,"d":"0.88"},{"v":0.8362684445000175,"d":"0.84"},"prawidłowo"]
[null,"KUJAWSKO-POMORSKIE",{"v":17348.421916870313,"d":"17,348.42"},{"v":54036.66520073175,"d":"54,036.67"},{"v":0.856742060210274,"d":"0.86"},{"v":0.78125,"d":"0.78"},{"v":0.5566778900112234,"d":"0.56"},{"v":1.0496745832079162,"d":"1.05"},{"v":0.8208667489949917,"d":"0.82"},"prawidłowo"]
[null,"POMORSKIE",{"v":19356.138512269532,"d":"19,356.14"},{"v":62092.415322027606,"d":"62,092.42"},{"v":0.9961370390206585,"d":"1.00"},{"v":0.7946635730858469,"d":"0.79"},{"v":0.5401002506265664,"d":"0.54"},{"v":0.891502074864948,"d":"0.89"},{"v":0.8178638943989679,"d":"0.82"},"prawidłowo"]
[null,"WARMIŃSKO-MAZURSKIE",{"v":14968.314454977131,"d":"14,968.31"},{"v":54232.97798919655,"d":"54,232.98"},{"v":0.8591995427643647,"d":"0.86"},{"v":0.7599337748344371,"d":"0.76"},{"v":0.5388046387154326,"d":"0.54"},{"v":0.9676556147332257,"d":"0.97"},{"v":0.8107510401466878,"d":"0.81"},"prawidłowo"]
[null,"POLSKA",{"v":19513.043625804545,"d":"19,513.04"},{"v":57524.57016691965,"d":"57,524.57"},{"v":0.951433991006627,"d":"0.95"},{"v":0.8035408675125406,"d":"0.80"},{"v":0.5474605841302662,"d":"0.55"},{"v":0.9791702658207477,"d":"0.98"},{"v":0.8277018527696652,"d":"0.83"},"prawidłowo"]
[]
[null,"Dane","WDB_i","PP_i","PZ_i","AZ_i","NB15+_i","N15+_i","N_i"]
[null,"ŁÓDZKIE",47052,913599.6839604576,1078,1342,2433,2189366,2597094]
[null,"MAZOWIECKIE",151625,2094113.5202390058,1880,2247,3923,4291917,5135732]
[null,"MAŁOPOLSKIE",56606,1097713.5819641359,1213,1479,2611,2654448,3252949]
[null,"ŚLĄSKIE",99867,1591360.2397856363,1533,1922,3799,3975782,4714982]
[null,"LUBELSKIE",30937,738316.0226349789,898,1069,1863,1795039,2191172]
[null,"PODKARPACKIE",30559,698008.5469882754,768,934,1665,1688561,2097248]
[null,"PODLASKIE",17725,393076.8024392118,428,521,937,986213,1205117]
[null,"ŚWIĘTOKRZYSKIE",20175,448371.6916644074,482,597,1154,1069009,1291598]
[null,"LUBUSKIE",17020,290749.59839458746,356,472,883,831353,1008786]
[null,"WIELKOPOLSKIE",69172,1226338.786387839,1302,1571,2740,2752529,3359932]
[null,"ZACHODNIOPOMORSKIE",30592,502687.1133903963,547,734,1386,1405229,1696073]
[null,"DOLNOŚLĄSKIE",57817,917290.3838812863,895,1210,2283,2441794,2898313]
[null,"OPOLSKIE",16432,302917.5389319604,320,391,774,882821,1055667]
[null,"KUJAWSKO-POMORSKIE",35879,663975.0966629623,775,992,1782,1697669,2068142]
[null,"POMORSKIE",42369,682353.8717291511,685,862,1596,1790237,2188918]
[null,"WARMIŃSKO-MAZURSKIE",21388,394372.59012884344,459,604,1121,1158470,1428885]
[null,"POLSKA",745215,12954725.221546233,13616,16945,30952,31610437,38190608]

{"sheet":"2002","index":14,"n_rows":59,"n_cols":10,"rows_kept":59,"hidden":true,"merged":[[0,0,0,10],[1,0,1,10],[2,1,3,1],[21,1,22,1]]}
["DEKOMPOZYCJA RÓŻNIC W POZIOMIE WDB PER CAPITA"]
[2002]
[null,"Różnice względem średniej","WDB per capita","WDB na 1 pracującego","Współczynnik dojazdów netto","Udział pracujących wśród aktwnych zawodowo","Współczynnik aktywności zawodowej","Wskaźnik różnicy w metodologii BAEL/demo","Wskaźnik struktury wiekowej","Interakcje"]
[null,null,"WDB_i/N_i","WDB_i/Pp_i","Pp_i/Pz_i","Pz_i/Az_i","Az_i/NB15+_i","NB15+_i/N15+_i","Ni15+_i/N_i"]
[null,"ŁÓDZKIE",{"$f":"(C24-C$40)/C$40","v":{"v":-0.08781168170772338,"d":"-8.8%"}},{"$f":"(D24-D$40)/D$40","v":{"v":-0.11879832849201695,"d":"-11.9%"}},{"$f":"(E24-E$40)/E$40","v":{"v":-0.098785804548399,"d":"-9.9%"}},{"$f":"(F24-F$40)/F$40","v":{"v":-0.005262732074541203,"d":"-0.5%"}},{"$f":"(G24-G$40)/G$40","v":{"v":0.01160425894010383,"d":"1.2%"}},{"$f":"(H24-H$40)/H$40","v":{"v":0.11905585029371696,"d":"11.9%"}},{"$f":"(I24-I$40)/I$40","v":{"v":0.02002395192347285,"d":"2.0%"}},{"$f":"C5-SUM(D5:I5)","v":{"v":-0.015648877750059867,"d":"-1.6%"}}]
[null,"MAZOWIECKIE",{"$f":"(C25-C$40)/C$40","v":{"v":0.5129604865486753,"d":"51.3%"}},{"v":0.26209120004995423,"d":"26.2%"},{"v":0.1457633047056652,"d":"14.6%"},{"v":0.03588263713026231,"d":"3.6%"},{"v":0.05360078896069134,"d":"5.4%"},{"v":-0.05196105068118789,"d":"-5.2%"},{"v":0.01118150376543355,"d":"1.1%"},{"$f":"C6-SUM(D6:I6)","v":{"v":0.05640210261785661,"d":"5.6%"}}]
[null,"MAŁOPOLSKIE",{"v":-0.11475928445004555,"d":"-11.5%"},{"v":-0.10819955712998637,"d":"-10.8%"},{"v":-0.05942581076981378,"d":"-5.9%"},{"v":0.04673729018526585,"d":"4.7%"},{"v":0.02266687945999821,"d":"2.3%"},{"v":5.432422452510618E-5,"d":"0.0%"},{"v":-0.014162893620944708,"d":"-1.4%"},{"v":-2.4295167990898425E-3,"d":"-0.2%"}]
[null,"ŚLĄSKIE",{"v":0.08774251782070196,"d":"8.8%"},{"v":0.08765121906054338,"d":"8.8%"},{"v":0.11165033380104056,"d":"11.2%"},{"v":-2.0119566891639387E-3,"d":"-0.2%"},{"v":-0.08723446681600205,"d":"-8.7%"},{"v":-0.030739032775788298,"d":"-3.1%"},{"v":0.0189267328630621,"d":"1.9%"},{"v":-0.010500311622989797,"d":"-1.1%"}]
[null,"LUBELSKIE",{"v":-0.27802798006243806,"d":"-27.8%"},{"v":-0.2699693494735681,"d":"-27.0%"},{"v":-0.1556975936450137,"d":"-15.6%"},{"v":0.04322561119847291,"d":"4.3%"},{"v":0.058014628754391555,"d":"5.8%"},{"v":0.07271146177912555,"d":"7.3%"},{"v":-0.01069908393946706,"d":"-1.1%"},{"v":-0.015613654736379268,"d":"-1.6%"}]
[null,"PODKARPACKIE",{"v":-0.25863266059645784,"d":"-25.9%"},{"v":-0.24056515075024903,"d":"-24.1%"},{"v":-0.01848566513337966,"d":"-1.8%"},{"v":0.022728488949873647,"d":"2.3%"},{"v":0.037321513505494425,"d":"3.7%"},{"v":-0.033715581229695014,"d":"-3.4%"},{"v":-0.029785937893888833,"d":"-3.0%"},{"v":0.003869671955386622,"d":"0.4%"}]
[null,"PODLASKIE",{"v":-0.2384795718995158,"d":"-23.8%"},{"v":-0.20472076927554922,"d":"-20.5%"},{"v":-0.06914365488741192,"d":"-6.9%"},{"v":0.03616418624400049,"d":"3.6%"},{"v":0.02795061430608463,"d":"2.8%"},{"v":-0.021209720007922164,"d":"-2.1%"},{"v":-0.013291707335660067,"d":"-1.3%"},{"v":0.005771479056942447,"d":"0.6%"}]
[null,"ŚWIĘTOKRZYSKIE",{"v":-0.20833552344013678,"d":"-20.8%"},{"v":-0.2233698735821511,"d":"-22.3%"},{"v":-0.0258568440127634,"d":"-2.6%"},{"v":0.01282839900049887,"d":"1.3%"},{"v":-0.0643262938053129,"d":"-6.4%"},{"v":0.10454594634486704,"d":"10.5%"},{"v":-3.2217382541417308E-4,"d":"-0.0%"},{"v":-0.011834683559861114,"d":"-1.2%"}]
[null,"LUBUSKIE",{"v":-0.12018066585750058,"d":"-12.0%"},{"v":0.020355163549966915,"d":"2.0%"},{"v":-0.11940672927959504,"d":"-11.9%"},{"v":-0.07754055292518769,"d":"-7.8%"},{"v":-0.01935854962928494,"d":"-1.9%"},{"v":0.08832532709066422,"d":"8.8%"},{"v":-5.3952998856258445E-3,"d":"-0.5%"},{"v":-0.00716002477843819,"d":"-0.7%"}]
[null,"WIELKOPOLSKIE",{"v":0.04112850924151648,"d":"4.1%"},{"v":-0.02378124907183786,"d":"-2.4%"},{"v":0.02331420155548216,"d":"2.3%"},{"v":0.022013825931951884,"d":"2.2%"},{"v":0.025793514775264734,"d":"2.6%"},{"v":0.004550562542185605,"d":"0.5%"},{"v":-0.010400035281943032,"d":"-1.0%"},{"v":-3.6231120958700458E-4,"d":"-0.0%"}]
[null,"ZACHODNIOPOMORSKIE",{"v":-0.044327374873628984,"d":"-4.4%"},{"v":0.07196800300667865,"d":"7.2%"},{"v":-0.01658200886841009,"d":"-1.7%"},{"v":-0.07823658750081054,"d":"-7.8%"},{"v":-0.034795478193521856,"d":"-3.5%"},{"v":0.017862785357328045,"d":"1.8%"},{"v":1.062342716520726E-3,"d":"0.1%"},{"v":-0.005606431391413917,"d":"-0.6%"}]
[null,"DOLNOŚLĄSKIE",{"v":0.02732522086204635,"d":"2.7%"},{"v":0.10048973147285825,"d":"10.0%"},{"v":0.06400847530584437,"d":"6.4%"},{"v":-0.0758589992641339,"d":"-7.6%"},{"v":-0.01652324728697383,"d":"-1.7%"},{"v":-0.05191285127791835,"d":"-5.2%"},{"v":0.018184007220658743,"d":"1.8%"},{"v":-0.011061895308288935,"d":"-1.1%"}]
[null,"OPOLSKIE",{"v":-0.18563863870327538,"d":"-18.6%"},{"v":-0.043732320523708686,"d":"-4.4%"},{"v":-0.04727206493685706,"d":"-4.7%"},{"v":2.6764855567887797E-3,"d":"0.3%"},{"v":-0.03542032695226633,"d":"-3.5%"},{"v":-0.08381417719949481,"d":"-8.4%"},{"v":8.756346067997231E-3,"d":"0.9%"},{"v":0.013167419284265486,"d":"1.3%"}]
[null,"KUJAWSKO-POMORSKIE",{"v":-0.10177683312967142,"d":"-10.2%"},{"v":-0.05376736149231662,"d":"-5.4%"},{"v":-0.10792901370313983,"d":"-10.8%"},{"v":-0.018153826701782002,"d":"-1.8%"},{"v":3.6808776048894104E-4,"d":"0.0%"},{"v":0.09209766561364381,"d":"9.2%"},{"v":-0.007976058100700956,"d":"-0.8%"},{"v":-0.006416326505864781,"d":"-0.6%"}]
[null,"POMORSKIE",{"v":3.0336503651890194E-3,"d":"0.3%"},{"v":0.0849269819630417,"d":"8.5%"},{"v":0.023914971858538896,"d":"2.4%"},{"v":-0.020946020863222708,"d":"-2.1%"},{"v":0.003552631199317091,"d":"0.4%"},{"v":-0.06994474492053739,"d":"-7.0%"},{"v":-0.011912152544517126,"d":"-1.2%"},{"v":-6.558016327431449E-3,"d":"-0.7%"}]
[null,"WARMIŃSKO-MAZURSKIE",{"v":-0.246515573776584,"d":"-24.7%"},{"v":-0.07465875930529499,"d":"-7.5%"},{"v":-0.04887681716805751,"d":"-4.9%"},{"v":-0.0774103429642772,"d":"-7.7%"},{"v":-0.03202086807391698,"d":"-3.2%"},{"v":-0.0196285409238923,"d":"-2.0%"},{"v":-0.02215423542630265,"d":"-2.2%"},{"v":0.028233990085157645,"d":"2.8%"}]
[]
[null,"Wartości","WDB per capita","WDB na 1 pracującego","Współczynnik dojazdów netto","Udział pracujących wśród aktwnych zawodowo","Współczynnik aktywności zawodowej","Wskaźnik różnicy w metodologii BAEL/demo","Wskaźnik struktury wiekowej","Weryfikacja"]
[null,null,"WDB_i/N_i","WDB_i/Pp_i","Pp_i/Pz_i","Pz_i/Az_i","Az_i/NB15+_i","NB15+_i/N15+_i","Ni15+_i/N_i"]
[null,"ŁÓDZKIE",{"$f":"C43/I43*1000000","v":{"v":17064.639599904887,"d":"17,064.64"}},{"$f":"C43/D43*1000000","v":{"v":48385.81293794369,"d":"48,385.81"}},{"$f":"D43/E43/1000","v":{"v":0.8514509862836459,"d":"0.85"}},{"$f":"E43/F43","v":{"v":0.7964601769911505,"d":"0.80"}},{"$f":"F43/G43","v":{"v":0.5605622157916494,"d":"0.56"}},{"$f":"G43/H43*1000","v":{"v":1.1065428290169472,"d":"1.11"}},{"$f":"H43/I43","v":{"v":0.838423244789789,"d":"0.84"}},{"$f":"IF(PRODUCT(D24:I24)-C24<0.0001,\"prawidłowo\",\"nieprawidłowo\")","v":"prawidłowo"}]
[null,"MAZOWIECKIE",{"$f":"C44/I44*1000000","v":{"v":28303.5036890019,"d":"28,303.50"}},{"$f":"C44/D44*1000000","v":{"v":69300.03731352287,"d":"69,300.04"}},{"$f":"D44/E44/1000","v":{"v":1.0824965926667318,"d":"1.08"}},{"$f":"E44/F44","v":{"v":0.8294042006000857,"d":"0.83"}},{"v":0.5838338338338338,"d":"0.58"},{"$f":"G44/H44*1000","v":{"v":0.937438199105211,"d":"0.94"}},{"$f":"H44/I44","v":{"v":0.8311550683292572,"d":"0.83"}},{"$f":"IF(PRODUCT(D25:I25)-C25<0.0001,\"prawidłowo\",\"nieprawidłowo\")","v":"prawidłowo"}]
[null,"MAŁOPOLSKIE",{"v":16560.52096600259,"d":"16,560.52"},{"v":48967.77979646956,"d":"48,967.78"},{"v":0.8886376015101194,"d":"0.89"},{"v":0.8380952380952381,"d":"0.84"},{"v":0.566692367000771,"d":"0.57"},{"v":0.9888719502316072,"d":"0.99"},{"v":0.8103228791891307,"d":"0.81"},"prawidłowo"]
[null,"ŚLĄSKIE",{"v":20348.796045594525,"d":"20,348.80"},{"v":59721.73014280659,"d":"59,721.73"},{"v":1.0502672704163725,"d":"1.05"},{"v":0.7990629880270692,"d":"0.80"},{"v":0.5057925223802001,"d":"0.51"},{"v":0.9584229173606275,"d":"0.96"},{"v":0.8375213699238704,"d":"0.84"},"prawidłowo"]
[null,"LUBELSKIE",{"v":13506.193923327897,"d":"13,506.19"},{"v":40085.17872519409,"d":"40,085.18"},{"v":0.7976817500665031,"d":"0.80"},{"v":0.8352835283528353,"d":"0.84"},{"v":0.5862796833773087,"d":"0.59"},{"v":1.0607166526357268,"d":"1.06"},{"v":0.8131700069913773,"d":"0.81"},"prawidłowo"]
[null,"PODKARPACKIE",{"v":13869.029239210471,"d":"13,869.03"},{"v":41699.73088166234,"d":"41,699.73"},{"v":0.9273171158327608,"d":"0.93"},{"v":0.8188720173535792,"d":"0.82"},{"v":0.5748129675810474,"d":"0.57"},{"v":0.9554796519766634,"d":"0.96"},{"v":0.7974812949811169,"d":"0.80"},"prawidłowo"]
[null,"PODLASKIE",{"v":14246.040420500387,"d":"14,246.04"},{"v":43667.90637767921,"d":"43,667.91"},{"v":0.8794563569178353,"d":"0.88"},{"v":0.8296296296296296,"d":"0.83"},{"v":0.569620253164557,"d":"0.57"},{"v":0.9678456755777212,"d":"0.97"},{"v":0.8110389631896557,"d":"0.81"},"prawidłowo"]
[null,"ŚWIĘTOKRZYSKIE",{"v":14809.956130366507,"d":"14,809.96"},{"v":42643.904606444186,"d":"42,643.90"},{"v":0.9203529584120275,"d":"0.92"},{"v":0.8109452736318408,"d":"0.81"},{"v":0.5184866723989682,"d":"0.52"},{"v":1.092195171426747,"d":"1.09"},{"v":0.821699456356081,"d":"0.82"},"prawidłowo"]
[null,"LUBUSKIE",{"v":16459.101206511434,"d":"16,459.10"},{"v":56026.57787666983,"d":"56,026.58"},{"v":0.8319687069442049,"d":"0.83"},{"v":0.7385892116182573,"d":"0.74"},{"v":0.5434047350620068,"d":"0.54"},{"v":1.0761559273503756,"d":"1.08"},{"v":0.8175295279886053,"d":"0.82"},"prawidłowo"]
[null,"WIELKOPOLSKIE",{"v":19476.77078418814,"d":"19,476.77"},{"v":53603.09608592836,"d":"53,603.10"},{"v":0.9668088791653632,"d":"0.97"},{"v":0.81829980532122,"d":"0.82"},{"v":0.5684249354481741,"d":"0.57"},{"v":0.993317912662037,"d":"0.99"},{"v":0.8134158143033708,"d":"0.81"},"prawidłowo"]
[null,"ZACHODNIOPOMORSKIE",{"v":17878.11638917653,"d":"17,878.12"},{"v":58860.582027927216,"d":"58,860.58"},{"v":0.929115656082719,"d":"0.93"},{"v":0.738031914893617,"d":"0.74"},{"v":0.534850640113798,"d":"0.53"},{"v":1.0064812813093706,"d":"1.01"},{"v":0.8228374794871705,"d":"0.82"},"prawidłowo"]
[null,"DOLNOŚLĄSKIE",{"v":19218.547633588943,"d":"19,218.55"},{"v":60426.67871481813,"d":"60,426.68"},{"v":1.0052560981458407,"d":"1.01"},{"v":0.7399355877616747,"d":"0.74"},{"v":0.5449758666081614,"d":"0.54"},{"v":0.9374858595540052,"d":"0.94"},{"v":0.8369108759821172,"d":"0.84"},"prawidłowo"]
[null,"OPOLSKIE",{"v":15234.55503204968,"d":"15,234.56"},{"v":52507.60473316028,"d":"52,507.60"},{"v":0.9001202422948955,"d":"0.90"},{"v":0.8028169014084507,"d":"0.80"},{"v":0.534504391468005,"d":"0.53"},{"v":0.9059412468115869,"d":"0.91"},{"v":0.8291616753486539,"d":"0.83"},"prawidłowo"]
[null,"KUJAWSKO-POMORSKIE",{"v":16803.38841832893,"d":"16,803.39"},{"v":51956.59168945969,"d":"51,956.59"},{"v":0.8428126464839708,"d":"0.84"},{"v":0.7861386138613862,"d":"0.79"},{"v":0.5543358946212953,"d":"0.55"},{"v":1.0798860844646356,"d":"1.08"},{"v":0.8154082369418403,"d":"0.82"},"prawidłowo"]
[null,"POMORSKIE",{"v":18764.116363716297,"d":"18,764.12"},{"v":59572.14528515108,"d":"59,572.15"},{"v":0.9673764761580085,"d":"0.97"},{"v":0.7839029768467475,"d":"0.78"},{"v":0.5561005518087063,"d":"0.56"},{"v":0.9196555943365906,"d":"0.92"},{"v":0.812172907938869,"d":"0.81"},"prawidłowo"]
[null,"WARMIŃSKO-MAZURSKIE",{"v":14095.708002175787,"d":"14,095.71"},{"v":50809.46805218708,"d":"50,809.47"},{"v":0.8986041012078015,"d":"0.90"},{"v":0.7386934673366834,"d":"0.74"},{"v":0.5363881401617251,"d":"0.54"},{"v":0.9694091742863563,"d":"0.97"},{"v":0.8037542817419453,"d":"0.80"},"prawidłowo"]
[null,"POLSKA",{"v":18707.364759781063,"d":"18,707.36"},{"v":54908.898271994876,"d":"54,908.90"},{"v":0.9447820402529072,"d":"0.94"},{"v":0.8006739092546331,"d":"0.80"},{"v":0.554131925441844,"d":"0.55"},{"v":0.9888182334478789,"d":"0.99"},{"v":0.821964271729858,"d":"0.82"},"prawidłowo"]
[]
[null,"Dane","WDB_i","PP_i","PZ_i","AZ_i","NB15+_i","N15+_i","N_i"]
[null,"ŁÓDZKIE",44494,919567.0651863376,1080,1356,2419,2186088,2607380]
[null,"MAZOWIECKIE",145158,2094630.9068101263,1935,2333,3996,4262681,5128623]
[null,"MAŁOPOLSKIE",53610,1094801.525060467,1232,1470,2594,2623191,3237217]
[null,"ŚLĄSKIE",96281,1612160.2600891315,1535,1921,3798,3962760,4731533]
[null,"LUBELSKIE",29673,740248.6640617149,928,1111,1895,1786528,2196992]
[null,"PODKARPACKIE",29195,700124.4224537344,755,922,1604,1678738,2105050]
[null,"PODLASKIE",17205,393996.4478991902,448,540,948,979495,1207704]
[null,"ŚWIĘTOKRZYSKIE",19192,450052.5966634814,489,603,1163,1064828,1295885]
[null,"LUBUSKIE",16594,296180.85967213695,356,482,887,824230,1008196]
[null,"WIELKOPOLSKIE",65350,1219145.9966275229,1261,1541,2711,2729237,3355279]
[null,"ZACHODNIOPOMORSKIE",30352,515659.189125909,555,752,1406,1396946,1697718]
[null,"DOLNOŚLĄSKIE",55824,923830.3541960276,919,1242,2279,2430970,2904694]
[null,"OPOLSKIE",16164,307841.1228648543,342,426,797,879748,1061009]
[null,"KUJAWSKO-POMORSKIE",34769,669193.2413082728,794,1010,1822,1687215,2069166]
[null,"POMORSKIE",40974,687804.674548344,711,907,1631,1773490,2183636]
[null,"WARMIŃSKO-MAZURSKIE",20135,396284.4086326405,441,597,1113,1148122,1428449]
[null,"POLSKA",714968,13020986.078765567,13782,17213,31063,31414267,38218531]

{"sheet":"Łódzkie","index":15,"n_rows":46,"n_cols":9,"rows_kept":46,"hidden":true,"merged":[[0,0,0,9],[1,0,1,9],[2,1,3,1],[17,1,18,1],[32,1,33,1]]}
["DEKOMPOZYCJA RÓŻNIC W POZIOMIE WDB PER CAPITA"]
["ŁÓDZKIE"]
[null,"Różnice względem średniej","WDB per capita","WDB na 1 pracującego","Współczynnik dojazdów netto","Udział pracujących wśród aktwnych zawodowo","Współczynnik aktywności zawodowej","Wskaźnik różnicy w metodologii BAEL/demo","Wskaźnik struktury wiekowej"]
[null,null,"WDB_i/N_i","WDB_i/Pp_i","Pp_i/Pz_i","Pz_i/Az_i","Az_i/NB15+_i","NB15+_i/N15+_i*(N15+/NB15+)","Ni15+_i/N_i"]
[null,2013]
[null,2012,{"$f":"(C21-C36)/C36","v":{"v":-0.0666148363049872,"d":"-6.7%"}},{"$f":"(D21-D36)/D36","v":{"v":-0.09353578148531595,"d":"-9.4%"}},{"v":-0.11832421251503372,"d":"-11.8%"},{"v":-0.00977061010131173,"d":"-1.0%"},{"v":0.011497582992462275,"d":"1.1%"},{"v":0.15153749079938164,"d":"15.2%"},{"v":0.0125642039419553,"d":"1.3%"}]
[null,2011,{"$f":"(C22-C37)/C37","v":{"v":-0.07121471062562443,"d":"-7.1%"}},{"v":-0.10537681850674786,"d":"-10.5%"},{"v":-0.13573597911143628,"d":"-13.6%"},{"v":0.003587174928425899,"d":"0.4%"},{"v":0.024286261602824995,"d":"2.4%"},{"v":0.15352010994878645,"d":"15.4%"},{"v":0.0130412419538555,"d":"1.3%"}]
[null,2010,{"v":-0.07004665326469413,"d":"-7.0%"},{"v":-0.10776614662237229,"d":"-10.8%"},{"v":-0.12630020791536756,"d":"-12.6%"},{"v":4.208764018819186E-3,"d":"0.4%"},{"v":0.017891227733174326,"d":"1.8%"},{"v":0.15160028280150753,"d":"15.2%"},{"v":0.013428445814362186,"d":"1.3%"}]
[null,2009,{"v":-0.08089345497876795,"d":"-8.1%"},{"v":-0.1146872427218173,"d":"-11.5%"},{"v":-0.140930826644839,"d":"-14.1%"},{"v":0.007038640852703634,"d":"0.7%"},{"v":-3.9308132685352367E-4,"d":"-0.0%"},{"v":0.184765532933258,"d":"18.5%"},{"v":0.013288704477366828,"d":"1.3%"}]
[null,2008,{"v":-0.06769722942629194,"d":"-6.8%"},{"v":-0.11617825947517879,"d":"-11.6%"},{"v":-0.1642831788306352,"d":"-16.4%"},{"v":0.005660628311293075,"d":"0.6%"},{"v":0.020201224105332552,"d":"2.0%"},{"v":0.21352963420136495,"d":"21.4%"},{"v":0.013784102494603653,"d":"1.4%"}]
[null,2007,{"v":-0.07285009497820537,"d":"-7.3%"},{"v":-0.12089575395725677,"d":"-12.1%"},{"v":-0.13151353144892144,"d":"-13.2%"},{"v":0.002742484983387334,"d":"0.3%"},{"v":0.021408509160985762,"d":"2.1%"},{"v":0.16904306678592326,"d":"16.9%"},{"v":0.014208220090370836,"d":"1.4%"}]
[null,2006,{"v":-0.07548488122769342,"d":"-7.5%"},{"v":-0.121063943795299,"d":"-12.1%"},{"v":-0.0840598994645885,"d":"-8.4%"},{"v":0.003976189945679418,"d":"0.4%"},{"v":0.007922810872424014,"d":"0.8%"},{"v":0.11812191034438091,"d":"11.8%"},{"v":0.014962083898513888,"d":"1.5%"}]
[null,2005,{"v":-0.07433170418434107,"d":"-7.4%"},{"v":-0.11817459503766711,"d":"-11.8%"},{"v":-0.1015018850140638,"d":"-10.2%"},{"v":0.004676491436364885,"d":"0.5%"},{"v":0.007201736925767814,"d":"0.7%"},{"v":0.1364460586692365,"d":"13.6%"},{"v":0.015930688742745468,"d":"1.6%"}]
[null,2004,{"v":-0.07759143581013789,"d":"-7.8%"},{"v":-0.11713953164138746,"d":"-11.7%"},{"v":-0.1101217938705915,"d":"-11.0%"},{"v":2.153098145247443E-3,"d":"0.2%"},{"v":0.006426642746932595,"d":"0.6%"},{"v":0.14452090966353992,"d":"14.5%"},{"v":0.017093209915764622,"d":"1.7%"}]
[null,2003,{"v":-0.07153528436198105,"d":"-7.2%"},{"v":-0.10466370031799802,"d":"-10.5%"},{"v":-0.10928023417875951,"d":"-10.9%"},{"v":-2.0828918726279729E-4,"d":"-0.0%"},{"v":0.00734498994483678,"d":"0.7%"},{"v":0.13499405308027757,"d":"13.5%"},{"v":0.018490009089636956,"d":"1.8%"}]
[null,2002,{"v":-0.08781168170772338,"d":"-8.8%"},{"v":-0.11876207767795234,"d":"-11.9%"},{"v":-0.0988228771112157,"d":"-9.9%"},{"v":-0.005262732074541203,"d":"-0.5%"},{"v":0.01160425894010383,"d":"1.2%"},{"v":0.11905585029371696,"d":"11.9%"},{"v":0.02002395192347285,"d":"2.0%"}]
[]
[null,"Wskaźniki","WDB per capita","WDB na 1 pracującego","Współczynnik dojazdów netto","Udział pracujących wśród aktwnych zawodowo","Współczynnik aktywności zawodowej","Wskaźnik różnicy w metodologii BAEL/demo","Wskaźnik struktury wiekowej"]
[null,null,"WDB_i/N_i","WDB_i/Pp_i","Pp_i/Pz_i","Pz_i/Az_i","Az_i/NB15+_i","NB15+_i/N15+_i","Ni15+_i/N_i"]
[null,2013]
[null,2012,{"v":34684.001867980965,"d":"34,684.00"},{"v":93385.61557083689,"d":"93,385.62"},{"v":0.7859775157423793,"d":"0.79"},{"v":0.8902985074626866,"d":"0.89"},{"v":0.5651623787431463,"d":"0.57"},{"v":1.0917146181554305,"d":"1.09"},{"v":0.8602428612905308,"d":"0.86"}]
[null,2011,{"v":32911.79907810021,"d":"32,911.80"},{"v":87608.57619419375,"d":"87,608.58"},{"v":0.7744708079033285,"d":"0.77"},{"v":0.9070110701107011,"d":"0.91"},{"v":0.5688497061293031,"d":"0.57"},{"v":1.093076721871171,"d":"1.09"},{"v":0.8600806494582388,"d":"0.86"}]
[null,2010,{"v":30553.768118450178,"d":"30,553.77"},{"v":81650.0171461907,"d":"81,650.02"},{"v":0.7811082757141318,"d":"0.78"},{"v":0.9076005961251863,"d":"0.91"},{"v":0.5629194630872483,"d":"0.56"},{"v":1.0910810077304736,"d":"1.09"},{"v":0.8594076704389019,"d":"0.86"}]
[null,2009,{"v":29131.744348170927,"d":"29,131.74"},{"v":76169.44064151522,"d":"76,169.44"},{"v":0.7612751777512992,"d":"0.76"},{"v":0.9246922519913107,"d":"0.92"},{"v":0.5491053677932406,"d":"0.55"},{"v":1.1508317104242016,"d":"1.15"},{"v":0.8597641386212779,"d":"0.86"}]
[null,2008,{"v":27260.019279199612,"d":"27,260.02"},{"v":69538.0128800036,"d":"69,538.01"},{"v":0.7495832707030397,"d":"0.75"},{"v":0.9341275402943238,"d":"0.93"},{"v":0.5531007751937984,"d":"0.55"},{"v":1.1786171440370652,"d":"1.18"},{"v":0.8588173305645149,"d":"0.86"}]
[null,2007,{"v":25191.928629389746,"d":"25,191.93"},{"v":66817.23581625754,"d":"66,817.24"},{"v":0.7765057011247677,"d":"0.78"},{"v":0.9065010956902849,"d":"0.91"},{"v":0.5484775641025641,"d":"0.55"},{"v":1.1392583592397458,"d":"1.14"},{"v":0.8571934404268089,"d":"0.86"}]
[null,2006,{"v":22624.910470665163,"d":"22,624.91"},{"v":62259.57273023002,"d":"62,259.57"},{"v":0.826726380354387,"d":"0.83"},{"v":0.8650306748466258,"d":"0.87"},{"v":0.5442404006677797,"d":"0.54"},{"v":1.0924835671503506,"d":"1.09"},{"v":0.8546370934744708,"d":"0.85"}]
[null,2005,{"v":20979.52833501134,"d":"20,979.53"},{"v":58573.52855697251,"d":"58,573.53"},{"v":0.8287087387241218,"d":"0.83"},{"v":0.8264094955489614,"d":"0.83"},{"v":0.5529122231337161,"d":"0.55"},{"v":1.1113167416813063,"d":"1.11"},{"v":0.8511440504526735,"d":"0.85"}]
[null,2004,{"v":19804.057808820337,"d":"19,804.06"},{"v":56062.87814853189,"d":"56,062.88"},{"v":0.832512411701353,"d":"0.83"},{"v":0.8121301775147929,"d":"0.81"},{"v":0.5504885993485342,"d":"0.55"},{"v":1.1203106946336843,"d":"1.12"},{"v":0.8471798530124411,"d":"0.85"}]
[null,2003,{"v":18117.172501264875,"d":"18,117.17"},{"v":51501.76912937341,"d":"51,501.77"},{"v":0.8474950686089588,"d":"0.85"},{"v":0.8032786885245902,"d":"0.80"},{"v":0.5515824085491163,"d":"0.55"},{"v":1.1112806173111303,"d":"1.11"},{"v":0.8430060675508857,"d":"0.84"}]
[null,2002,{"v":17064.639599904887,"d":"17,064.64"},{"v":48385.81293794369,"d":"48,385.81"},{"v":0.8514509862836459,"d":"0.85"},{"v":0.7964601769911505,"d":"0.80"},{"v":0.5605622157916494,"d":"0.56"},{"v":1.1065428290169472,"d":"1.11"},{"v":0.838423244789789,"d":"0.84"}]
[]
[null,"Wskaźniki dla Polski","WDB per capita","WDB na 1 pracującego","Współczynnik dojazdów netto","Udział pracujących wśród aktwnych zawodowo","Współczynnik aktywności zawodowej","Wskaźnik różnicy w metodologii BAEL/demo","Wskaźnik struktury wiekowej"]
[null,null,"WDB/N","WDB/Pp","Pp/Pz","Pz/Az","Az/NB15+","NB15+/N15+","Ni15+/N"]
[null,2013]
[null,2012,{"v":37159.367019159195,"d":"37,159.37"},{"v":103021.84428620567,"d":"103,021.84"},{"v":0.8914586596331832,"d":"0.89"},{"v":0.8990830978605616,"d":"0.90"},{"v":0.5587382394638485,"d":"0.56"},{"v":0.948049565800569,"d":"0.95"},{"v":0.8495687067956471,"d":"0.85"}]
[null,2011,{"v":35435.31476501895,"d":"35,435.31"},{"v":97927.9075330495,"d":"97,927.91"},{"v":0.8961044185399302,"d":"0.90"},{"v":0.9037690922817817,"d":"0.90"},{"v":0.5553620383809063,"d":"0.56"},{"v":0.9476009238535954,"d":"0.95"},{"v":0.8490085238774671,"d":"0.85"}]
[null,2010,{"v":32855.1622785296,"d":"32,855.16"},{"v":91511.90221834507,"d":"91,511.90"},{"v":0.894023648386617,"d":"0.89"},{"v":0.9037967289719626,"d":"0.90"},{"v":0.553025163937074,"d":"0.55"},{"v":0.947447672621434,"d":"0.95"},{"v":0.8480200787617584,"d":"0.85"}]
[null,2009,{"v":31695.720703955994,"d":"31,695.72"},{"v":86036.75934332129,"d":"86,036.76"},{"v":0.8861628392252514,"d":"0.89"},{"v":0.9182291666666667,"d":"0.92"},{"v":0.5493212957370378,"d":"0.55"},{"v":0.9713581957224544,"d":"0.97"},{"v":0.8484888214210641,"d":"0.85"}]
[null,2008,{"v":29239.448964014882,"d":"29,239.45"},{"v":78678.77615084611,"d":"78,678.78"},{"v":0.8969345258052793,"d":"0.90"},{"v":0.9288695549938275,"d":"0.93"},{"v":0.5421487076521019,"d":"0.54"},{"v":0.971230624139413,"d":"0.97"},{"v":0.8471402623608278,"d":"0.85"}]
[null,2007,{"v":27171.365162139078,"d":"27,171.37"},{"v":76006.04378494697,"d":"76,006.04"},{"v":0.8940907305328947,"d":"0.89"},{"v":0.9040218293985052,"d":"0.90"},{"v":0.5369815888386316,"d":"0.54"},{"v":0.9745221468802983,"d":"0.97"},{"v":0.8451848678079427,"d":"0.85"}]
[null,2006,{"v":24472.190893654082,"d":"24,472.19"},{"v":70835.15608526816,"d":"70,835.16"},{"v":0.9025987396677198,"d":"0.90"},{"v":0.861604770620535,"d":"0.86"},{"v":0.5399623808461121,"d":"0.54"},{"v":0.9770701719044806,"d":"0.98"},{"v":0.8420384436350294,"d":"0.84"}]
[null,2005,{"v":22664.19669966668,"d":"22,664.20"},{"v":66423.04500115244,"d":"66,423.05"},{"v":0.9223266302980426,"d":"0.92"},{"v":0.8225627877163335,"d":"0.82"},{"v":0.548958766514187,"d":"0.55"},{"v":0.9778878048841524,"d":"0.98"},{"v":0.8377973614577959,"d":"0.84"}]
[null,2004,{"v":21469.941387864226,"d":"21,469.94"},{"v":63501.40272195254,"d":"63,501.40"},{"v":0.9355352293910284,"d":"0.94"},{"v":0.8103853383458647,"d":"0.81"},{"v":0.546973396735638,"d":"0.55"},{"v":0.9788468565096178,"d":"0.98"},{"v":0.832942197188205,"d":"0.83"}]
[null,2003,{"v":19513.043625804545,"d":"19,513.04"},{"v":57522.261911714486,"d":"57,522.26"},{"v":0.9514721701809001,"d":"0.95"},{"v":0.8034460376467811,"d":"0.80"},{"v":0.5475605815831988,"d":"0.55"},{"v":0.9791069955787072,"d":"0.98"},{"v":0.8277018527696652,"d":"0.83"}]
[null,2002,{"v":18707.364759781063,"d":"18,707.36"},{"v":54906.63952641513,"d":"54,906.64"},{"v":0.9448209066318307,"d":"0.94"},{"v":0.8006739092546331,"d":"0.80"},{"v":0.554131925441844,"d":"0.55"},{"v":0.9888182334478789,"d":"0.99"},{"v":0.821964271729858,"d":"0.82"}]

{"sheet":"Mazowieckie","index":16,"n_rows":46,"n_cols":9,"rows_kept":46,"hidden":true,"merged":[[0,0,0,9],[1,0,1,9],[2,1,3,1],[17,1,18,1],[32,1,33,1]]}
["DEKOMPOZYCJA RÓŻNIC W POZIOMIE WDB PER CAPITA"]
["MAZOWIECKIE"]
[null,"Różnice względem średniej","WDB per capita","WDB na 1 pracującego","Współczynnik dojazdów netto","Udział pracujących wśród aktwnych zawodowo","Współczynnik aktywności zawodowej","Wskaźnik różnicy w metodologii BAEL/demo","Wskaźnik struktury wiekowej"]
[null,null,"WDB_i/N_i","WDB_i/Pp_i","Pp_i/Pz_i","Pz_i/Az_i","Az_i/NB15+_i","NB15+_i/N15+_i*(N15+/NB15+)","Ni15+_i/N_i"]
[null,2013]
[null,2012,{"$f":"(C21-C36)/C36","v":{"v":0.5892996669655118,"d":"58.9%"}},{"$f":"(D21-D36)/D36","v":{"v":0.3081546965032704,"d":"30.8%"}},{"v":0.06374724085309806,"d":"6.4%"},{"v":0.023281410631170785,"d":"2.3%"},{"v":0.07830222674742787,"d":"7.8%"},{"v":0.04016705664316869,"d":"4.0%"},{"v":-0.004893508504465788,"d":"-0.5%"}]
[null,2011,{"$f":"(C22-C37)/C37","v":{"v":0.5786367883340305,"d":"57.9%"}},{"v":0.3103497242339877,"d":"31.0%"},{"v":0.06872310447465181,"d":"6.9%"},{"v":0.019994032029095422,"d":"2.0%"},{"v":0.07175302824708445,"d":"7.2%"},{"v":0.034727087260235504,"d":"3.5%"},{"v":-0.003421230454877728,"d":"-0.3%"}]
[null,2010,{"v":0.5842080295362513,"d":"58.4%"},{"v":0.31073693352570536,"d":"31.1%"},{"v":0.09814573511497944,"d":"9.8%"},{"v":0.024990221468154872,"d":"2.5%"},{"v":0.049202729399223585,"d":"4.9%"},{"v":0.025499287853657907,"d":"2.5%"},{"v":-2.0191749851921612E-3,"d":"-0.2%"}]
[null,2009,{"v":0.5533135661188224,"d":"55.3%"},{"v":0.2814638922505642,"d":"28.1%"},{"v":0.06152455378669844,"d":"6.2%"},{"v":0.023412346364943257,"d":"2.3%"},{"v":0.07122232859113861,"d":"7.1%"},{"v":0.041317130606505104,"d":"4.1%"},{"v":2.5201747358932563E-4,"d":"0.0%"}]
[null,2008,{"v":0.5234605839216154,"d":"52.3%"},{"v":0.2845727173046334,"d":"28.5%"},{"v":0.0316335169165558,"d":"3.2%"},{"v":0.012456545315748567,"d":"1.2%"},{"v":0.08529790597680492,"d":"8.5%"},{"v":0.0445107441885652,"d":"4.5%"},{"v":1.6334413079814871E-3,"d":"0.2%"}]
[null,2007,{"v":0.542464313871681,"d":"54.2%"},{"v":0.28922650368790875,"d":"28.9%"},{"v":0.0838594624278584,"d":"8.4%"},{"v":0.006006621094523565,"d":"0.6%"},{"v":0.06282271185897408,"d":"6.3%"},{"v":0.029312837784320006,"d":"2.9%"},{"v":0.003006786634500953,"d":"0.3%"}]
[null,2006,{"v":0.5413129203021438,"d":"54.1%"},{"v":0.28817098976701705,"d":"28.8%"},{"v":0.10524332205352732,"d":"10.5%"},{"v":0.018517314995078197,"d":"1.9%"},{"v":0.052977249181260164,"d":"5.3%"},{"v":4.834866461267134E-3,"d":"0.5%"},{"v":4.5632922730191065E-3,"d":"0.5%"}]
[null,2005,{"v":0.5357611110244235,"d":"53.6%"},{"v":0.28261819956379547,"d":"28.3%"},{"v":0.15445177280891959,"d":"15.4%"},{"v":0.03657706460985732,"d":"3.7%"},{"v":0.020763943464838737,"d":"2.1%"},{"v":-0.026011282138987867,"d":"-2.6%"},{"v":0.006397687990611606,"d":"0.6%"}]
[null,2004,{"v":0.5048841262208135,"d":"50.5%"},{"v":0.25120521815782504,"d":"25.1%"},{"v":0.1394916236163323,"d":"13.9%"},{"v":0.05363394348343868,"d":"5.4%"},{"v":0.020424730343703477,"d":"2.0%"},{"v":-0.026023766435327857,"d":"-2.6%"},{"v":0.007962300444032325,"d":"0.8%"}]
[null,2003,{"v":0.5130157387262512,"d":"51.3%"},{"v":0.25873595561218277,"d":"25.9%"},{"v":0.1707017874501958,"d":"17.1%"},{"v":0.04135321831380341,"d":"4.1%"},{"v":0.04605034775689758,"d":"4.6%"},{"v":-0.06645159799263997,"d":"-6.6%"},{"v":0.009659729470286699,"d":"1.0%"}]
[null,2002,{"v":0.5129604865486753,"d":"51.3%"},{"v":0.26214311987138095,"d":"26.2%"},{"v":0.14571617231216638,"d":"14.6%"},{"v":0.03588263713026231,"d":"3.6%"},{"v":0.05360078896069134,"d":"5.4%"},{"v":-0.05196105068118789,"d":"-5.2%"},{"v":0.01118150376543355,"d":"1.1%"}]
[]
[null,"Wskaźniki","WDB per capita","WDB na 1 pracującego","Współczynnik dojazdów netto","Udział pracujących wśród aktwnych zawodowo","Współczynnik aktywności zawodowej","Wskaźnik różnicy w metodologii BAEL/demo","Wskaźnik struktury wiekowej"]
[null,null,"WDB_i/N_i","WDB_i/Pp_i","Pp_i/Pz_i","Pz_i/Az_i","Az_i/NB15+_i","NB15+_i/N15+_i","Ni15+_i/N_i"]
[null,2013]
[null,2012,{"v":59057.36962819893,"d":"59,057.37"},{"v":134768.50944542856,"d":"134,768.51"},{"v":0.9482866895193997,"d":"0.95"},{"v":0.9200150206533985,"d":"0.92"},{"v":0.6024886877828054,"d":"0.60"},{"v":0.9861299264106119,"d":"0.99"},{"v":0.8454113351038146,"d":"0.85"}]
[null,2011,{"v":55939.491494254966,"d":"55,939.49"},{"v":128319.80663074285,"d":"128,319.81"},{"v":0.9576874961154469,"d":"0.96"},{"v":0.9218390804597701,"d":"0.92"},{"v":0.5952109464082098,"d":"0.60"},{"v":0.980508343824139,"d":"0.98"},{"v":0.8461038700591267,"d":"0.85"}]
[null,2010,{"v":52049.41189336315,"d":"52,049.41"},{"v":119948.03009477782,"d":"119,948.03"},{"v":0.9817682565676974,"d":"0.98"},{"v":0.9263828093911659,"d":"0.93"},{"v":0.5802355114292311,"d":"0.58"},{"v":0.9716069135518862,"d":"0.97"},{"v":0.846307777831782,"d":"0.85"}]
[null,2009,{"v":49233.39295736808,"d":"49,233.39"},{"v":110253.0005047176,"d":"110,253.00"},{"v":0.9406836124909388,"d":"0.94"},{"v":0.9397270659590599,"d":"0.94"},{"v":0.5884452375641311,"d":"0.59"},{"v":1.0114919291608182,"d":"1.01"},{"v":0.8487026554302074,"d":"0.85"}]
[null,2008,{"v":44545.147992264385,"d":"44,545.15"},{"v":101068.60927429538,"d":"101,068.61"},{"v":0.9253077193003836,"d":"0.93"},{"v":0.9404400606980273,"d":"0.94"},{"v":0.5883928571428572,"d":"0.59"},{"v":1.014460821998583,"d":"1.01"},{"v":0.8485240162590223,"d":"0.85"}]
[null,2007,{"v":41910.86112177575,"d":"41,910.86"},{"v":97989.0060880173,"d":"97,989.01"},{"v":0.9690686985571144,"d":"0.97"},{"v":0.90945194598888,"d":"0.91"},{"v":0.570716228467815,"d":"0.57"},{"v":1.0030881564890277,"d":"1.00"},{"v":0.84772615837215,"d":"0.85"}]
[null,2006,{"v":37719.304012489505,"d":"37,719.30"},{"v":91247.79312466102,"d":"91,247.79"},{"v":0.9975912295116774,"d":"1.00"},{"v":0.8775593775593775,"d":"0.88"},{"v":0.5685681024447031,"d":"0.57"},{"v":0.9817941757089261,"d":"0.98"},{"v":0.8458809111584542,"d":"0.85"}]
[null,2005,{"v":34806.791903956175,"d":"34,806.79"},{"v":85195.4063889231,"d":"85,195.41"},{"v":1.0647816134564523,"d":"1.06"},{"v":0.8526497199482982,"d":"0.85"},{"v":0.5603573153066151,"d":"0.56"},{"v":0.9524516892910352,"d":"0.95"},{"v":0.8431573275757606,"d":"0.84"}]
[null,2004,{"v":32309.773985488137,"d":"32,309.77"},{"v":79453.28644604853,"d":"79,453.29"},{"v":1.0660345574890608,"d":"1.07"},{"v":0.8538494997825141,"d":"0.85"},{"v":0.558145180869143,"d":"0.56"},{"v":0.9533735745398566,"d":"0.95"},{"v":0.8395743332147299,"d":"0.84"}]
[null,2003,{"v":29523.54211629423,"d":"29,523.54"},{"v":72405.3393164162,"d":"72,405.34"},{"v":1.1138901703398967,"d":"1.11"},{"v":0.8366711170449488,"d":"0.84"},{"v":0.5727759367830741,"d":"0.57"},{"v":0.9140437711167294,"d":"0.91"},{"v":0.8356972287494753,"d":"0.84"}]
[null,2002,{"v":28303.5036890019,"d":"28,303.50"},{"v":69300.03731352287,"d":"69,300.04"},{"v":1.0824965926667318,"d":"1.08"},{"v":0.8294042006000857,"d":"0.83"},{"v":0.5838338338338338,"d":"0.58"},{"v":0.937438199105211,"d":"0.94"},{"v":0.8311550683292572,"d":"0.83"}]
[]
[null,"Wskaźniki dla Polski","WDB per capita","WDB na 1 pracującego","Współczynnik dojazdów netto","Udział pracujących wśród aktwnych zawodowo","Współczynnik aktywności zawodowej","Wskaźnik różnicy w metodologii BAEL/demo","Wskaźnik struktury wiekowej"]
[null,null,"WDB/N","WDB/Pp","Pp/Pz","Pz/Az","Az/NB15+","NB15+/N15+","Ni15+/N"]
[null,2013]
[null,2012,{"v":37159.367019159195,"d":"37,159.37"},{"v":103021.84428620567,"d":"103,021.84"},{"v":0.8914586596331832,"d":"0.89"},{"v":0.8990830978605616,"d":"0.90"},{"v":0.5587382394638485,"d":"0.56"},{"v":0.948049565800569,"d":"0.95"},{"v":0.8495687067956471,"d":"0.85"}]
[null,2011,{"v":35435.31476501895,"d":"35,435.31"},{"v":97927.9075330495,"d":"97,927.91"},{"v":0.8961044185399302,"d":"0.90"},{"v":0.9037690922817817,"d":"0.90"},{"v":0.5553620383809063,"d":"0.56"},{"v":0.9476009238535954,"d":"0.95"},{"v":0.8490085238774671,"d":"0.85"}]
[null,2010,{"v":32855.1622785296,"d":"32,855.16"},{"v":91511.90221834507,"d":"91,511.90"},{"v":0.894023648386617,"d":"0.89"},{"v":0.9037967289719626,"d":"0.90"},{"v":0.553025163937074,"d":"0.55"},{"v":0.947447672621434,"d":"0.95"},{"v":0.8480200787617584,"d":"0.85"}]
[null,2009,{"v":31695.720703955994,"d":"31,695.72"},{"v":86036.75934332129,"d":"86,036.76"},{"v":0.8861628392252514,"d":"0.89"},{"v":0.9182291666666667,"d":"0.92"},{"v":0.5493212957370378,"d":"0.55"},{"v":0.9713581957224544,"d":"0.97"},{"v":0.8484888214210641,"d":"0.85"}]
[null,2008,{"v":29239.448964014882,"d":"29,239.45"},{"v":78678.77615084611,"d":"78,678.78"},{"v":0.8969345258052793,"d":"0.90"},{"v":0.9288695549938275,"d":"0.93"},{"v":0.5421487076521019,"d":"0.54"},{"v":0.971230624139413,"d":"0.97"},{"v":0.8471402623608278,"d":"0.85"}]
[null,2007,{"v":27171.365162139078,"d":"27,171.37"},{"v":76006.04378494697,"d":"76,006.04"},{"v":0.8940907305328947,"d":"0.89"},{"v":0.9040218293985052,"d":"0.90"},{"v":0.5369815888386316,"d":"0.54"},{"v":0.9745221468802983,"d":"0.97"},{"v":0.8451848678079427,"d":"0.85"}]
[null,2006,{"v":24472.190893654082,"d":"24,472.19"},{"v":70835.15608526816,"d":"70,835.16"},{"v":0.9025987396677198,"d":"0.90"},{"v":0.861604770620535,"d":"0.86"},{"v":0.5399623808461121,"d":"0.54"},{"v":0.9770701719044806,"d":"0.98"},{"v":0.8420384436350294,"d":"0.84"}]
[null,2005,{"v":22664.19669966668,"d":"22,664.20"},{"v":66423.04500115244,"d":"66,423.05"},{"v":0.9223266302980426,"d":"0.92"},{"v":0.8225627877163335,"d":"0.82"},{"v":0.548958766514187,"d":"0.55"},{"v":0.9778878048841524,"d":"0.98"},{"v":0.8377973614577959,"d":"0.84"}]
[null,2004,{"v":21469.941387864226,"d":"21,469.94"},{"v":63501.40272195254,"d":"63,501.40"},{"v":0.9355352293910284,"d":"0.94"},{"v":0.8103853383458647,"d":"0.81"},{"v":0.546973396735638,"d":"0.55"},{"v":0.9788468565096178,"d":"0.98"},{"v":0.832942197188205,"d":"0.83"}]
[null,2003,{"v":19513.043625804545,"d":"19,513.04"},{"v":57522.261911714486,"d":"57,522.26"},{"v":0.9514721701809001,"d":"0.95"},{"v":0.8034460376467811,"d":"0.80"},{"v":0.5475605815831988,"d":"0.55"},{"v":0.9791069955787072,"d":"0.98"},{"v":0.8277018527696652,"d":"0.83"}]
[null,2002,{"v":18707.364759781063,"d":"18,707.36"},{"v":54906.63952641513,"d":"54,906.64"},{"v":0.9448209066318307,"d":"0.94"},{"v":0.8006739092546331,"d":"0.80"},{"v":0.554131925441844,"d":"0.55"},{"v":0.9888182334478789,"d":"0.99"},{"v":0.821964271729858,"d":"0.82"}]

{"sheet":"Małopolskie","index":17,"n_rows":46,"n_cols":9,"rows_kept":46,"hidden":true,"merged":[[0,0,0,9],[1,0,1,9],[2,1,3,1],[17,1,18,1],[32,1,33,1]]}
["DEKOMPOZYCJA RÓŻNIC W POZIOMIE WDB PER CAPITA"]
["MAŁOPOLSKIE"]
[null,"Różnice względem średniej","WDB per capita","WDB na 1 pracującego","Współczynnik dojazdów netto","Udział pracujących wśród aktwnych zawodowo","Współczynnik aktywności zawodowej","Wskaźnik różnicy w metodologii BAEL/demo","Wskaźnik struktury wiekowej"]
[null,null,"WDB_i/N_i","WDB_i/Pp_i","Pp_i/Pz_i","Pz_i/Az_i","Az_i/NB15+_i","NB15+_i/N15+_i*(N15+/NB15+)","Ni15+_i/N_i"]
[null,2013]
[null,2012,{"$f":"(C21-C36)/C36","v":{"v":-0.1195998958112792,"d":"-12.0%"}},{"$f":"(D21-D36)/D36","v":{"v":-0.12923239670208872,"d":"-12.9%"}},{"v":0.0570948028427497,"d":"5.7%"},{"v":-3.6625065362379614E-3,"d":"-0.4%"},{"v":-0.010174360635849278,"d":"-1.0%"},{"v":-0.020243917902041417,"d":"-2.0%"},{"v":-0.01012411596716719,"d":"-1.0%"}]
[null,2011,{"$f":"(C22-C37)/C37","v":{"v":-0.11398284888001829,"d":"-11.4%"}},{"v":-0.11929667026357017,"d":"-11.9%"},{"v":0.05395780115540657,"d":"5.4%"},{"v":3.7663420091243274E-3,"d":"0.4%"},{"v":-0.004861290911685598,"d":"-0.5%"},{"v":-0.03434737389814998,"d":"-3.4%"},{"v":-0.010417302745214104,"d":"-1.0%"}]
[null,2010,{"v":-0.12355249955770466,"d":"-12.4%"},{"v":-0.12860942858280877,"d":"-12.9%"},{"v":0.07048695246715624,"d":"7.0%"},{"v":0.005059411315470273,"d":"0.5%"},{"v":-0.0101836216060592,"d":"-1.0%"},{"v":-0.04534191777583316,"d":"-4.5%"},{"v":-0.010678498589507458,"d":"-1.1%"}]
[null,2009,{"v":-0.11318085405805604,"d":"-11.3%"},{"v":-0.11128077114446924,"d":"-11.1%"},{"v":0.055734563513889744,"d":"5.6%"},{"v":2.423554890940002E-3,"d":"0.2%"},{"v":-0.011506763222921953,"d":"-1.2%"},{"v":-0.036357248201028806,"d":"-3.6%"},{"v":-0.010137847612651832,"d":"-1.0%"}]
[null,2008,{"v":-0.10424121966237708,"d":"-10.4%"},{"v":-0.09242459596714124,"d":"-9.2%"},{"v":0.017592875211733708,"d":"1.8%"},{"v":0.01005595697337917,"d":"1.0%"},{"v":-0.011015451988124989,"d":"-1.1%"},{"v":-0.018589029374666804,"d":"-1.9%"},{"v":-0.010653436142425747,"d":"-1.1%"}]
[null,2007,{"v":-0.11017214304501045,"d":"-11.0%"},{"v":-0.09827601444101852,"d":"-9.8%"},{"v":0.014729099596539206,"d":"1.5%"},{"v":0.011013744249710671,"d":"1.1%"},{"v":-0.004271969670133865,"d":"-0.4%"},{"v":-0.023029251094077805,"d":"-2.3%"},{"v":-0.011212637039662498,"d":"-1.1%"}]
[null,2006,{"v":-0.10030254632860262,"d":"-10.0%"},{"v":-0.09267312190344555,"d":"-9.3%"},{"v":-0.04933674941561147,"d":"-4.9%"},{"v":0.015255320874512975,"d":"1.5%"},{"v":0.017669282051528352,"d":"1.8%"},{"v":0.022044154130449353,"d":"2.2%"},{"v":-0.012233232500866142,"d":"-1.2%"}]
[null,2005,{"v":-0.11539947845091808,"d":"-11.5%"},{"v":-0.11198994901689437,"d":"-11.2%"},{"v":-0.033197408575621784,"d":"-3.3%"},{"v":0.029634197118915684,"d":"3.0%"},{"v":0.019724580518367646,"d":"2.0%"},{"v":-0.005423789371043065,"d":"-0.5%"},{"v":-0.013294406055529586,"d":"-1.3%"}]
[null,2004,{"v":-0.11636788723544148,"d":"-11.6%"},{"v":-0.1125543069185199,"d":"-11.3%"},{"v":-0.0336314497414714,"d":"-3.4%"},{"v":0.021167531641804377,"d":"2.1%"},{"v":0.039547178265431075,"d":"4.0%"},{"v":-0.015914659982616694,"d":"-1.6%"},{"v":-0.013691098013813912,"d":"-1.4%"}]
[null,2003,{"v":-0.10821493032499065,"d":"-10.8%"},{"v":-0.10352646313084168,"d":"-10.4%"},{"v":-0.048886936251128055,"d":"-4.9%"},{"v":0.020788840476423206,"d":"2.1%"},{"v":0.034496739186221245,"d":"3.4%"},{"v":0.0046215646238074,"d":"0.5%"},{"v":-0.01412230674116665,"d":"-1.4%"}]
[null,2002,{"v":-0.11475928445004555,"d":"-11.5%"},{"v":-0.10816287030439072,"d":"-10.8%"},{"v":-0.059464502454753924,"d":"-5.9%"},{"v":0.04673729018526585,"d":"4.7%"},{"v":0.02266687945999821,"d":"2.3%"},{"v":5.432422452510618E-5,"d":"0.0%"},{"v":-0.014162893620944708,"d":"-1.4%"}]
[]
[null,"Wskaźniki","WDB per capita","WDB na 1 pracującego","Współczynnik dojazdów netto","Udział pracujących wśród aktwnych zawodowo","Współczynnik aktywności zawodowej","Wskaźnik różnicy w metodologii BAEL/demo","Wskaźnik struktury wiekowej"]
[null,null,"WDB_i/N_i","WDB_i/Pp_i","Pp_i/Pz_i","Pz_i/Az_i","Az_i/NB15+_i","NB15+_i/N15+_i","Ni15+_i/N_i"]
[null,2013]
[null,2012,{"v":32715.11059525467,"d":"32,715.11"},{"v":89708.08443642993,"d":"89,708.08"},{"v":0.9423563160474017,"d":"0.94"},{"v":0.8957902001380262,"d":"0.90"},{"v":0.5530534351145038,"d":"0.55"},{"v":0.9288573282234363,"d":"0.93"},{"v":0.8409675746859717,"d":"0.84"}]
[null,2011,{"v":31396.296637141913,"d":"31,396.30"},{"v":86245.4342384779,"d":"86,245.43"},{"v":0.944456242569989,"d":"0.94"},{"v":0.9071729957805907,"d":"0.91"},{"v":0.55266226195103,"d":"0.55"},{"v":0.9150533206157636,"d":"0.92"},{"v":0.8401641450509681,"d":"0.84"}]
[null,2010,{"v":28795.824855643255,"d":"28,795.82"},{"v":79742.60876551784,"d":"79,742.61"},{"v":0.957040650794958,"d":"0.96"},{"v":0.9083694083694084,"d":"0.91"},{"v":0.54739336492891,"d":"0.55"},{"v":0.9044885781525285,"d":"0.90"},{"v":0.838964497546827,"d":"0.84"}]
[null,2009,{"v":28108.371964696646,"d":"28,108.37"},{"v":76462.52241682538,"d":"76,462.52"},{"v":0.9355527382717,"d":"0.94"},{"v":0.9204545454545454,"d":"0.92"},{"v":0.543000385653683,"d":"0.54"},{"v":0.9360422847084696,"d":"0.94"},{"v":0.8398869710484588,"d":"0.84"}]
[null,2008,{"v":26191.493141750143,"d":"26,191.49"},{"v":71406.92205391501,"d":"71,406.92"},{"v":0.9127141829908672,"d":"0.91"},{"v":0.9382102272727273,"d":"0.94"},{"v":0.5361766945925361,"d":"0.54"},{"v":0.9531763895377094,"d":"0.95"},{"v":0.838115307672089,"d":"0.84"}]
[null,2007,{"v":24177.837632767678,"d":"24,177.84"},{"v":68536.47272833284,"d":"68,536.47"},{"v":0.9072598819512562,"d":"0.91"},{"v":0.9139784946236559,"d":"0.91"},{"v":0.5346876197776926,"d":"0.53"},{"v":0.9520796316630521,"d":"0.95"},{"v":0.8357081166537971,"d":"0.84"}]
[null,2006,{"v":22017.567832780936,"d":"22,017.57"},{"v":64270.64103032851,"d":"64,270.64"},{"v":0.8580674518258867,"d":"0.86"},{"v":0.8747488278633624,"d":"0.87"},{"v":0.5495031284504969,"d":"0.55"},{"v":0.9986088573702077,"d":"1.00"},{"v":0.8317375915793747,"d":"0.83"}]
[null,2005,{"v":20048.760221016128,"d":"20,048.76"},{"v":58984.331577926496,"d":"58,984.33"},{"v":0.891707776311862,"d":"0.89"},{"v":0.8469387755102041,"d":"0.85"},{"v":0.5597867479055598,"d":"0.56"},{"v":0.9725839474019491,"d":"0.97"},{"v":0.8266593431423247,"d":"0.83"}]
[null,2004,{"v":18971.529669489704,"d":"18,971.53"},{"v":56354.04635022936,"d":"56,354.05"},{"v":0.9040718233423881,"d":"0.90"},{"v":0.8275391956373551,"d":"0.83"},{"v":0.5686046511627907,"d":"0.57"},{"v":0.963268841613214,"d":"0.96"},{"v":0.8215383039266597,"d":"0.82"}]
[null,2003,{"v":17401.440969409603,"d":"17,401.44"},{"v":51567.18558470876,"d":"51,567.19"},{"v":0.904957610852544,"d":"0.90"},{"v":0.8201487491548344,"d":"0.82"},{"v":0.56644963615473,"d":"0.57"},{"v":0.9836320018323961,"d":"0.98"},{"v":0.8160127933146201,"d":"0.82"}]
[null,2002,{"v":16560.52096600259,"d":"16,560.52"},{"v":48967.77979646956,"d":"48,967.78"},{"v":0.8886376015101194,"d":"0.89"},{"v":0.8380952380952381,"d":"0.84"},{"v":0.566692367000771,"d":"0.57"},{"v":0.9888719502316072,"d":"0.99"},{"v":0.8103228791891307,"d":"0.81"}]
[]
[null,"Wskaźniki dla Polski","WDB per capita","WDB na 1 pracującego","Współczynnik dojazdów netto","Udział pracujących wśród aktwnych zawodowo","Współczynnik aktywności zawodowej","Wskaźnik różnicy w metodologii BAEL/demo","Wskaźnik struktury wiekowej"]
[null,null,"WDB/N","WDB/Pp","Pp/Pz","Pz/Az","Az/NB15+","NB15+/N15+","Ni15+/N"]
[null,2013]
[null,2012,{"v":37159.367019159195,"d":"37,159.37"},{"v":103021.84428620567,"d":"103,021.84"},{"v":0.8914586596331832,"d":"0.89"},{"v":0.8990830978605616,"d":"0.90"},{"v":0.5587382394638485,"d":"0.56"},{"v":0.948049565800569,"d":"0.95"},{"v":0.8495687067956471,"d":"0.85"}]
[null,2011,{"v":35435.31476501895,"d":"35,435.31"},{"v":97927.9075330495,"d":"97,927.91"},{"v":0.8961044185399302,"d":"0.90"},{"v":0.9037690922817817,"d":"0.90"},{"v":0.5553620383809063,"d":"0.56"},{"v":0.9476009238535954,"d":"0.95"},{"v":0.8490085238774671,"d":"0.85"}]
[null,2010,{"v":32855.1622785296,"d":"32,855.16"},{"v":91511.90221834507,"d":"91,511.90"},{"v":0.894023648386617,"d":"0.89"},{"v":0.9037967289719626,"d":"0.90"},{"v":0.553025163937074,"d":"0.55"},{"v":0.947447672621434,"d":"0.95"},{"v":0.8480200787617584,"d":"0.85"}]
[null,2009,{"v":31695.720703955994,"d":"31,695.72"},{"v":86036.75934332129,"d":"86,036.76"},{"v":0.8861628392252514,"d":"0.89"},{"v":0.9182291666666667,"d":"0.92"},{"v":0.5493212957370378,"d":"0.55"},{"v":0.9713581957224544,"d":"0.97"},{"v":0.8484888214210641,"d":"0.85"}]
[null,2008,{"v":29239.448964014882,"d":"29,239.45"},{"v":78678.77615084611,"d":"78,678.78"},{"v":0.8969345258052793,"d":"0.90"},{"v":0.9288695549938275,"d":"0.93"},{"v":0.5421487076521019,"d":"0.54"},{"v":0.971230624139413,"d":"0.97"},{"v":0.8471402623608278,"d":"0.85"}]
[null,2007,{"v":27171.365162139078,"d":"27,171.37"},{"v":76006.04378494697,"d":"76,006.04"},{"v":0.8940907305328947,"d":"0.89"},{"v":0.9040218293985052,"d":"0.90"},{"v":0.5369815888386316,"d":"0.54"},{"v":0.9745221468802983,"d":"0.97"},{"v":0.8451848678079427,"d":"0.85"}]
[null,2006,{"v":24472.190893654082,"d":"24,472.19"},{"v":70835.15608526816,"d":"70,835.16"},{"v":0.9025987396677198,"d":"0.90"},{"v":0.861604770620535,"d":"0.86"},{"v":0.5399623808461121,"d":"0.54"},{"v":0.9770701719044806,"d":"0.98"},{"v":0.8420384436350294,"d":"0.84"}]
[null,2005,{"v":22664.19669966668,"d":"22,664.20"},{"v":66423.04500115244,"d":"66,423.05"},{"v":0.9223266302980426,"d":"0.92"},{"v":0.8225627877163335,"d":"0.82"},{"v":0.548958766514187,"d":"0.55"},{"v":0.9778878048841524,"d":"0.98"},{"v":0.8377973614577959,"d":"0.84"}]
[null,2004,{"v":21469.941387864226,"d":"21,469.94"},{"v":63501.40272195254,"d":"63,501.40"},{"v":0.9355352293910284,"d":"0.94"},{"v":0.8103853383458647,"d":"0.81"},{"v":0.546973396735638,"d":"0.55"},{"v":0.9788468565096178,"d":"0.98"},{"v":0.832942197188205,"d":"0.83"}]
[null,2003,{"v":19513.043625804545,"d":"19,513.04"},{"v":57522.261911714486,"d":"57,522.26"},{"v":0.9514721701809001,"d":"0.95"},{"v":0.8034460376467811,"d":"0.80"},{"v":0.5475605815831988,"d":"0.55"},{"v":0.9791069955787072,"d":"0.98"},{"v":0.8277018527696652,"d":"0.83"}]
[null,2002,{"v":18707.364759781063,"d":"18,707.36"},{"v":54906.63952641513,"d":"54,906.64"},{"v":0.9448209066318307,"d":"0.94"},{"v":0.8006739092546331,"d":"0.80"},{"v":0.554131925441844,"d":"0.55"},{"v":0.9888182334478789,"d":"0.99"},{"v":0.821964271729858,"d":"0.82"}]

{"sheet":"Śląskie","index":18,"n_rows":46,"n_cols":9,"rows_kept":46,"hidden":true,"merged":[[0,0,0,9],[1,0,1,9],[2,1,3,1],[17,1,18,1],[32,1,33,1]]}
["DEKOMPOZYCJA RÓŻNIC W POZIOMIE WDB PER CAPITA"]
["ŚLĄSKIE"]
[null,"Różnice względem średniej","WDB per capita","WDB na 1 pracującego","Współczynnik dojazdów netto","Udział pracujących wśród aktwnych zawodowo","Współczynnik aktywności zawodowej","Wskaźnik różnicy w metodologii BAEL/demo","Wskaźnik struktury wiekowej"]
[null,null,"WDB_i/N_i","WDB_i/Pp_i","Pp_i/Pz_i","Pz_i/Az_i","Az_i/NB15+_i","NB15+_i/N15+_i*(N15+/NB15+)","Ni15+_i/N_i"]
[null,2013]
[null,2012,{"$f":"(C21-C36)/C36","v":{"v":0.059194416816340564,"d":"5.9%"}},{"$f":"(D21-D36)/D36","v":{"v":0.06480624607117523,"d":"6.5%"}},{"v":-0.025805332724528753,"d":"-2.6%"},{"v":0.007624594919018952,"d":"0.8%"},{"v":-0.04380276548902487,"d":"-4.4%"},{"v":0.04631985568879382,"d":"4.6%"},{"v":0.012858169066290706,"d":"1.3%"}]
[null,2011,{"$f":"(C22-C37)/C37","v":{"v":0.07489235004033536,"d":"7.5%"}},{"v":0.08154942474611214,"d":"8.2%"},{"v":-0.023845787511400374,"d":"-2.4%"},{"v":0.004064816822343802,"d":"0.4%"},{"v":-0.04064193167164109,"d":"-4.1%"},{"v":0.04264096046838953,"d":"4.3%"},{"v":0.013731413400345125,"d":"1.4%"}]
[null,2010,{"v":0.06972912353466874,"d":"7.0%"},{"v":0.07587409427486667,"d":"7.6%"},{"v":0.028159610056664477,"d":"2.8%"},{"v":0.005857711086173538,"d":"0.6%"},{"v":-0.05407998864183514,"d":"-5.4%"},{"v":1.7647314240937847E-3,"d":"0.2%"},{"v":0.01460063458953056,"d":"1.5%"}]
[null,2009,{"v":0.06436062430687349,"d":"6.4%"},{"v":0.08784447180774439,"d":"8.8%"},{"v":0.017027990331421595,"d":"1.7%"},{"v":0.015209395199555102,"d":"1.5%"},{"v":-0.04392703051574377,"d":"-4.4%"},{"v":-0.02335281664199115,"d":"-2.3%"},{"v":0.014856680565524936,"d":"1.5%"}]
[null,2008,{"v":0.0737673725829587,"d":"7.4%"},{"v":0.09448796642453607,"d":"9.4%"},{"v":0.03645291078205029,"d":"3.6%"},{"v":0.005909785002247463,"d":"0.6%"},{"v":-0.04644773860691345,"d":"-4.6%"},{"v":-0.028249374332959383,"d":"-2.8%"},{"v":0.015526532671695346,"d":"1.6%"}]
[null,2007,{"v":0.05800584898234423,"d":"5.8%"},{"v":0.07954093421690543,"d":"8.0%"},{"v":0.03270696037622866,"d":"3.3%"},{"v":0.016914446079456042,"d":"1.7%"},{"v":-0.0652197951731525,"d":"-6.5%"},{"v":-0.01769577685468975,"d":"-1.8%"},{"v":0.016323376002811096,"d":"1.6%"}]
[null,2006,{"v":0.062775566020693,"d":"6.3%"},{"v":0.08514427067967581,"d":"8.5%"},{"v":0.027189046505752594,"d":"2.7%"},{"v":-2.1670398487366772E-3,"d":"-0.2%"},{"v":-0.05493664137413104,"d":"-5.5%"},{"v":-0.005945225624605172,"d":"-0.6%"},{"v":0.01712566634583352,"d":"1.7%"}]
[null,2005,{"v":0.07971494740439002,"d":"8.0%"},{"v":0.10207383050378747,"d":"10.2%"},{"v":0.019393028917049842,"d":"1.9%"},{"v":-0.014894308194581143,"d":"-1.5%"},{"v":-0.04869896191630849,"d":"-4.9%"},{"v":0.007466425717777132,"d":"0.7%"},{"v":0.017947507812958664,"d":"1.8%"}]
[null,2004,{"v":0.11876828489199673,"d":"11.9%"},{"v":0.1338822857879232,"d":"13.4%"},{"v":0.03214957841306894,"d":"3.2%"},{"v":-0.003983636597348402,"d":"-0.4%"},{"v":-0.06401428188792581,"d":"-6.4%"},{"v":0.006730131233267399,"d":"0.7%"},{"v":0.01854629585734159,"d":"1.9%"}]
[null,2003,{"v":0.08546781117046945,"d":"8.5%"},{"v":0.09098190059265468,"d":"9.1%"},{"v":0.09101383562798412,"d":"9.1%"},{"v":-0.007267915508595555,"d":"-0.7%"},{"v":-0.076042673213128,"d":"-7.6%"},{"v":-0.024074699988365623,"d":"-2.4%"},{"v":0.018752287001960542,"d":"1.9%"}]
[null,2002,{"v":0.08774251782070196,"d":"8.8%"},{"v":0.0876959627819685,"d":"8.8%"},{"v":0.11160460468687654,"d":"11.2%"},{"v":-2.0119566891639387E-3,"d":"-0.2%"},{"v":-0.08723446681600205,"d":"-8.7%"},{"v":-0.030739032775788298,"d":"-3.1%"},{"v":0.0189267328630621,"d":"1.9%"}]
[]
[null,"Wskaźniki","WDB per capita","WDB na 1 pracującego","Współczynnik dojazdów netto","Udział pracujących wśród aktwnych zawodowo","Współczynnik aktywności zawodowej","Wskaźnik różnicy w metodologii BAEL/demo","Wskaźnik struktury wiekowej"]
[null,null,"WDB_i/N_i","WDB_i/Pp_i","Pp_i/Pz_i","Pz_i/Az_i","Az_i/NB15+_i","NB15+_i/N15+_i","Ni15+_i/N_i"]
[null,2013]
[null,2012,{"v":39358.99407912268,"d":"39,358.99"},{"v":109698.30327772381,"d":"109,698.30"},{"v":0.8684542723111864,"d":"0.87"},{"v":0.9059382422802851,"d":"0.91"},{"v":0.5342639593908629,"d":"0.53"},{"v":0.991963084874275,"d":"0.99"},{"v":0.8604926048610555,"d":"0.86"}]
[null,2011,{"v":38089.14876219021,"d":"38,089.15"},{"v":105913.87205896014,"d":"105,913.87"},{"v":0.8747361029874,"d":"0.87"},{"v":0.9074427480916031,"d":"0.91"},{"v":0.5327910523640061,"d":"0.53"},{"v":0.988007537387446,"d":"0.99"},{"v":0.8606666108992453,"d":"0.86"}]
[null,2010,{"v":35146.12394780078,"d":"35,146.12"},{"v":98455.28491453217,"d":"98,455.28"},{"v":0.9191990057066206,"d":"0.92"},{"v":0.9090909090909091,"d":"0.91"},{"v":0.523117569352708,"d":"0.52"},{"v":0.9491196633019936,"d":"0.95"},{"v":0.8604017100563438,"d":"0.86"}]
[null,2009,{"v":33735.6770763189,"d":"33,735.68"},{"v":93594.61302388537,"d":"93,594.61"},{"v":0.9012524114836441,"d":"0.90"},{"v":0.9321948769462581,"d":"0.93"},{"v":0.525191242416249,"d":"0.53"},{"v":0.9486742458840526,"d":"0.95"},{"v":0.8610945488043356,"d":"0.86"}]
[null,2008,{"v":31396.366289863774,"d":"31,396.37"},{"v":86112.97371011085,"d":"86,112.97"},{"v":0.9296304000517998,"d":"0.93"},{"v":0.9343589743589743,"d":"0.93"},{"v":0.5169671261930011,"d":"0.52"},{"v":0.9437939666744649,"d":"0.94"},{"v":0.8602934133218818,"d":"0.86"}]
[null,2007,{"v":28747.463266378247,"d":"28,747.46"},{"v":82051.63551373268,"d":"82,051.64"},{"v":0.9233337206291874,"d":"0.92"},{"v":0.9193128578865174,"d":"0.92"},{"v":0.501959759602822,"d":"0.50"},{"v":0.9572772204291513,"d":"0.96"},{"v":0.8589811381970579,"d":"0.86"}]
[null,2006,{"v":26008.446528769666,"d":"26,008.45"},{"v":76866.36378862931,"d":"76,866.36"},{"v":0.9271395387765791,"d":"0.93"},{"v":0.8597376387487387,"d":"0.86"},{"v":0.5102986611740473,"d":"0.51"},{"v":0.9712612692814367,"d":"0.97"},{"v":0.8564589130710879,"d":"0.86"}]
[null,2005,{"v":24470.87194754336,"d":"24,470.87"},{"v":73203.09963814552,"d":"73,203.10"},{"v":0.9402133373103777,"d":"0.94"},{"v":0.8103112840466926,"d":"0.81"},{"v":0.5222250444500889,"d":"0.52"},{"v":0.98518913153964,"d":"0.99"},{"v":0.8528337361482359,"d":"0.85"}]
[null,2004,{"v":24019.889503232556,"d":"24,019.89"},{"v":72003.11566910699,"d":"72,003.12"},{"v":0.9656122926065237,"d":"0.97"},{"v":0.8071570576540755,"d":"0.81"},{"v":0.5119592875318066,"d":"0.51"},{"v":0.9854346243111988,"d":"0.99"},{"v":0.8483901896093216,"d":"0.85"}]
[null,2003,{"v":21180.78075377594,"d":"21,180.78"},{"v":62755.74662683074,"d":"62,755.75"},{"v":1.038069301882346,"d":"1.04"},{"v":0.7976066597294484,"d":"0.80"},{"v":0.5059226112134773,"d":"0.51"},{"v":0.9555352884036398,"d":"0.96"},{"v":0.8432231554648565,"d":"0.84"}]
[null,2002,{"v":20348.796045594525,"d":"20,348.80"},{"v":59721.73014280659,"d":"59,721.73"},{"v":1.0502672704163725,"d":"1.05"},{"v":0.7990629880270692,"d":"0.80"},{"v":0.5057925223802001,"d":"0.51"},{"v":0.9584229173606275,"d":"0.96"},{"v":0.8375213699238704,"d":"0.84"}]
[]
[null,"Wskaźniki dla Polski","WDB per capita","WDB na 1 pracującego","Współczynnik dojazdów netto","Udział pracujących wśród aktwnych zawodowo","Współczynnik aktywności zawodowej","Wskaźnik różnicy w metodologii BAEL/demo","Wskaźnik struktury wiekowej"]
[null,null,"WDB/N","WDB/Pp","Pp/Pz","Pz/Az","Az/NB15+","NB15+/N15+","Ni15+/N"]
[null,2013]
[null,2012,{"v":37159.367019159195,"d":"37,159.37"},{"v":103021.84428620567,"d":"103,021.84"},{"v":0.8914586596331832,"d":"0.89"},{"v":0.8990830978605616,"d":"0.90"},{"v":0.5587382394638485,"d":"0.56"},{"v":0.948049565800569,"d":"0.95"},{"v":0.8495687067956471,"d":"0.85"}]
[null,2011,{"v":35435.31476501895,"d":"35,435.31"},{"v":97927.9075330495,"d":"97,927.91"},{"v":0.8961044185399302,"d":"0.90"},{"v":0.9037690922817817,"d":"0.90"},{"v":0.5553620383809063,"d":"0.56"},{"v":0.9476009238535954,"d":"0.95"},{"v":0.8490085238774671,"d":"0.85"}]
[null,2010,{"v":32855.1622785296,"d":"32,855.16"},{"v":91511.90221834507,"d":"91,511.90"},{"v":0.894023648386617,"d":"0.89"},{"v":0.9037967289719626,"d":"0.90"},{"v":0.553025163937074,"d":"0.55"},{"v":0.947447672621434,"d":"0.95"},{"v":0.8480200787617584,"d":"0.85"}]
[null,2009,{"v":31695.720703955994,"d":"31,695.72"},{"v":86036.75934332129,"d":"86,036.76"},{"v":0.8861628392252514,"d":"0.89"},{"v":0.9182291666666667,"d":"0.92"},{"v":0.5493212957370378,"d":"0.55"},{"v":0.9713581957224544,"d":"0.97"},{"v":0.8484888214210641,"d":"0.85"}]
[null,2008,{"v":29239.448964014882,"d":"29,239.45"},{"v":78678.77615084611,"d":"78,678.78"},{"v":0.8969345258052793,"d":"0.90"},{"v":0.9288695549938275,"d":"0.93"},{"v":0.5421487076521019,"d":"0.54"},{"v":0.971230624139413,"d":"0.97"},{"v":0.8471402623608278,"d":"0.85"}]
[null,2007,{"v":27171.365162139078,"d":"27,171.37"},{"v":76006.04378494697,"d":"76,006.04"},{"v":0.8940907305328947,"d":"0.89"},{"v":0.9040218293985052,"d":"0.90"},{"v":0.5369815888386316,"d":"0.54"},{"v":0.9745221468802983,"d":"0.97"},{"v":0.8451848678079427,"d":"0.85"}]
[null,2006,{"v":24472.190893654082,"d":"24,472.19"},{"v":70835.15608526816,"d":"70,835.16"},{"v":0.9025987396677198,"d":"0.90"},{"v":0.861604770620535,"d":"0.86"},{"v":0.5399623808461121,"d":"0.54"},{"v":0.9770701719044806,"d":"0.98"},{"v":0.8420384436350294,"d":"0.84"}]
[null,2005,{"v":22664.19669966668,"d":"22,664.20"},{"v":66423.04500115244,"d":"66,423.05"},{"v":0.9223266302980426,"d":"0.92"},{"v":0.8225627877163335,"d":"0.82"},{"v":0.548958766514187,"d":"0.55"},{"v":0.9778878048841524,"d":"0.98"},{"v":0.8377973614577959,"d":"0.84"}]
[null,2004,{"v":21469.941387864226,"d":"21,469.94"},{"v":63501.40272195254,"d":"63,501.40"},{"v":0.9355352293910284,"d":"0.94"},{"v":0.8103853383458647,"d":"0.81"},{"v":0.546973396735638,"d":"0.55"},{"v":0.9788468565096178,"d":"0.98"},{"v":0.832942197188205,"d":"0.83"}]
[null,2003,{"v":19513.043625804545,"d":"19,513.04"},{"v":57522.261911714486,"d":"57,522.26"},{"v":0.9514721701809001,"d":"0.95"},{"v":0.8034460376467811,"d":"0.80"},{"v":0.5475605815831988,"d":"0.55"},{"v":0.9791069955787072,"d":"0.98"},{"v":0.8277018527696652,"d":"0.83"}]
[null,2002,{"v":18707.364759781063,"d":"18,707.36"},{"v":54906.63952641513,"d":"54,906.64"},{"v":0.9448209066318307,"d":"0.94"},{"v":0.8006739092546331,"d":"0.80"},{"v":0.554131925441844,"d":"0.55"},{"v":0.9888182334478789,"d":"0.99"},{"v":0.821964271729858,"d":"0.82"}]

{"sheet":"Lubelskie","index":19,"n_rows":46,"n_cols":9,"rows_kept":46,"hidden":true,"merged":[[0,0,0,9],[1,0,1,9],[2,1,3,1],[17,1,18,1],[32,1,33,1]]}
["DEKOMPOZYCJA RÓŻNIC W POZIOMIE WDB PER CAPITA"]
["LUBELSKIE"]
[null,"Różnice względem średniej","WDB per capita","WDB na 1 pracującego","Współczynnik dojazdów netto","Udział pracujących wśród aktwnych zawodowo","Współczynnik aktywności zawodowej","Wskaźnik różnicy w metodologii BAEL/demo","Wskaźnik struktury wiekowej"]
[null,null,"WDB_i/N_i","WDB_i/Pp_i","Pp_i/Pz_i","Pz_i/Az_i","Az_i/NB15+_i","NB15+_i/N15+_i*(N15+/NB15+)","Ni15+_i/N_i"]
[null,2013]
[null,2012,{"$f":"(C21-C36)/C36","v":{"v":-0.29607270803543034,"d":"-29.6%"}},{"$f":"(D21-D36)/D36","v":{"v":-0.27482332361876444,"d":"-27.5%"}},{"v":-0.10182648125214076,"d":"-10.2%"},{"v":-0.004446787741315972,"d":"-0.4%"},{"v":0.012053532667934602,"d":"1.2%"},{"v":0.07285566567122628,"d":"7.3%"},{"v":-1.9692672564920608E-4,"d":"-0.0%"}]
[null,2011,{"$f":"(C22-C37)/C37","v":{"v":-0.30194002919776575,"d":"-30.2%"}},{"v":-0.2827038448404538,"d":"-28.3%"},{"v":-0.1201170023507611,"d":"-12.0%"},{"v":-0.007138763141459906,"d":"-0.7%"},{"v":0.02016667634589701,"d":"2.0%"},{"v":0.09344091914688842,"d":"9.3%"},{"v":-1.3477259110680376E-3,"d":"-0.1%"}]
[null,2010,{"v":-0.3063710724771434,"d":"-30.6%"},{"v":-0.2837132281143942,"d":"-28.4%"},{"v":-0.14074895269279478,"d":"-14.1%"},{"v":-2.7849420072542336E-3,"d":"-0.3%"},{"v":0.011354889341207531,"d":"1.1%"},{"v":0.12010462800333484,"d":"12.0%"},{"v":-2.3706943929436407E-3,"d":"-0.2%"}]
[null,2009,{"v":-0.3081149249827883,"d":"-30.8%"},{"v":-0.29216293016169964,"d":"-29.2%"},{"v":-0.10643629683540114,"d":"-10.6%"},{"v":-0.017147425277123925,"d":"-1.7%"},{"v":0.014772050094966774,"d":"1.5%"},{"v":0.10097279213522987,"d":"10.1%"},{"v":-3.8111495845671198E-3,"d":"-0.4%"}]
[null,2008,{"v":-0.2880169721081719,"d":"-28.8%"},{"v":-0.2702630319145771,"d":"-27.0%"},{"v":-0.11366241551319946,"d":"-11.4%"},{"v":-0.01712467799740754,"d":"-1.7%"},{"v":0.018963357694983165,"d":"1.9%"},{"v":0.10462292385951508,"d":"10.5%"},{"v":-0.00497709536281538,"d":"-0.5%"}]
[null,2007,{"v":-0.29995370474752847,"d":"-30.0%"},{"v":-0.28844770450094404,"d":"-28.8%"},{"v":-0.12332914296139758,"d":"-12.3%"},{"v":1.1129195442748793E-3,"d":"0.1%"},{"v":0.05211392571511564,"d":"5.2%"},{"v":0.07200088305589876,"d":"7.2%"},{"v":-0.006100688377223933,"d":"-0.6%"}]
[null,2006,{"v":-0.3086631693480206,"d":"-30.9%"},{"v":-0.30569086388892874,"d":"-30.6%"},{"v":-0.09498047111953163,"d":"-9.5%"},{"v":0.013331904400468036,"d":"1.3%"},{"v":0.035133841097400094,"d":"3.5%"},{"v":0.056770007722284486,"d":"5.7%"},{"v":-0.007455102280738617,"d":"-0.7%"}]
[null,2005,{"v":-0.29927919185385626,"d":"-29.9%"},{"v":-0.2982875399847288,"d":"-29.8%"},{"v":-0.1360557742263097,"d":"-13.6%"},{"v":0.04331878927925271,"d":"4.3%"},{"v":0.03304995250783438,"d":"3.3%"},{"v":0.08171268886609112,"d":"8.2%"},{"v":-0.008597876666310164,"d":"-0.9%"}]
[null,2004,{"v":-0.29131666540128115,"d":"-29.1%"},{"v":-0.2863342681697405,"d":"-28.6%"},{"v":-0.12379811787476394,"d":"-12.4%"},{"v":0.026406016074914256,"d":"2.6%"},{"v":0.04637707966725331,"d":"4.6%"},{"v":0.06530358167524931,"d":"6.5%"},{"v":-0.009459127582907513,"d":"-0.9%"}]
[null,2003,{"v":-0.2764363978261421,"d":"-27.6%"},{"v":-0.2715496627315937,"d":"-27.2%"},{"v":-0.13588833736561276,"d":"-13.6%"},{"v":0.045543046808959646,"d":"4.6%"},{"v":0.047930966996630256,"d":"4.8%"},{"v":0.060007193727268086,"d":"6.0%"},{"v":-0.010254600487328758,"d":"-1.0%"}]
[null,2002,{"v":-0.27802798006243806,"d":"-27.8%"},{"v":-0.26993931752262046,"d":"-27.0%"},{"v":-0.15573232507085438,"d":"-15.6%"},{"v":0.04322561119847291,"d":"4.3%"},{"v":0.058014628754391555,"d":"5.8%"},{"v":0.07271146177912555,"d":"7.3%"},{"v":-0.01069908393946706,"d":"-1.1%"}]
[]
[null,"Wskaźniki","WDB per capita","WDB na 1 pracującego","Współczynnik dojazdów netto","Udział pracujących wśród aktwnych zawodowo","Współczynnik aktywności zawodowej","Wskaźnik różnicy w metodologii BAEL/demo","Wskaźnik struktury wiekowej"]
[null,null,"WDB_i/N_i","WDB_i/Pp_i","Pp_i/Pz_i","Pz_i/Az_i","Az_i/NB15+_i","NB15+_i/N15+_i","Ni15+_i/N_i"]
[null,2013]
[null,2012,{"v":26157.492596914275,"d":"26,157.49"},{"v":74709.03863413581,"d":"74,709.04"},{"v":0.8006845611409863,"d":"0.80"},{"v":0.8950850661625709,"d":"0.90"},{"v":0.5654730090860502,"d":"0.57"},{"v":1.0171203480062865,"d":"1.02"},{"v":0.8494014040120038,"d":"0.85"}]
[null,2011,{"v":24735.97479023711,"d":"24,735.97"},{"v":70243.31155627596,"d":"70,243.31"},{"v":0.788467041991642,"d":"0.79"},{"v":0.8973172987974098,"d":"0.90"},{"v":0.5665618448637316,"d":"0.57"},{"v":1.036145625162916,"d":"1.04"},{"v":0.8478642930911198,"d":"0.85"}]
[null,2010,{"v":22789.2909748459,"d":"22,789.29"},{"v":65548.7650290896,"d":"65,548.77"},{"v":0.7681907561936092,"d":"0.77"},{"v":0.9012797074954296,"d":"0.90"},{"v":0.5593047034764826,"d":"0.56"},{"v":1.0612405228942567,"d":"1.06"},{"v":0.8460096823159343,"d":"0.85"}]
[null,2009,{"v":21929.796096981183,"d":"21,929.80"},{"v":60900.007631959554,"d":"60,900.01"},{"v":0.7918429482249707,"d":"0.79"},{"v":0.9024839006439742,"d":"0.90"},{"v":0.5574358974358974,"d":"0.56"},{"v":1.0694389449079897,"d":"1.07"},{"v":0.8452551036017953,"d":"0.85"}]
[null,2008,{"v":20817.991407287893,"d":"20,817.99"},{"v":57414.81156099012,"d":"57,414.81"},{"v":0.7949867810450651,"d":"0.79"},{"v":0.912962962962963,"d":"0.91"},{"v":0.5524296675191815,"d":"0.55"},{"v":1.07284361177878,"d":"1.07"},{"v":0.8429239644893776,"d":"0.84"}]
[null,2007,{"v":19021.213518707533,"d":"19,021.21"},{"v":54082.274926980775,"d":"54,082.27"},{"v":0.7838232870065429,"d":"0.78"},{"v":0.9050279329608939,"d":"0.91"},{"v":0.5649658074697528,"d":"0.56"},{"v":1.04468860201321,"d":"1.04"},{"v":0.8400286583083012,"d":"0.84"}]
[null,2006,{"v":16918.526891529043,"d":"16,918.53"},{"v":49181.49602785543,"d":"49,181.50"},{"v":0.8168694861421842,"d":"0.82"},{"v":0.8730916030534351,"d":"0.87"},{"v":0.5589333333333333,"d":"0.56"},{"v":1.0325384531087118,"d":"1.03"},{"v":0.8357609609134163,"d":"0.84"}]
[null,2005,{"v":15881.2742273736,"d":"15,881.27"},{"v":46609.87830946374,"d":"46,609.88"},{"v":0.7968387665232991,"d":"0.80"},{"v":0.858195211786372,"d":"0.86"},{"v":0.5671018276762402,"d":"0.57"},{"v":1.057793646830596,"d":"1.06"},{"v":0.8305940830726217,"d":"0.83"}]
[null,2004,{"v":15215.389656390666,"d":"15,215.39"},{"v":45318.77504581029,"d":"45,318.78"},{"v":0.8197177287868835,"d":"0.82"},{"v":0.8317843866171004,"d":"0.83"},{"v":0.5723404255319149,"d":"0.57"},{"v":1.0427690621512546,"d":"1.04"},{"v":0.8250632906758144,"d":"0.83"}]
[null,2003,{"v":14118.928135262773,"d":"14,118.93"},{"v":41902.11109003002,"d":"41,902.11"},{"v":0.8221781989253663,"d":"0.82"},{"v":0.8400374181478016,"d":"0.84"},{"v":0.5738056897477187,"d":"0.57"},{"v":1.037860458742122,"d":"1.04"},{"v":0.8192141009468905,"d":"0.82"}]
[null,2002,{"v":13506.193923327897,"d":"13,506.19"},{"v":40085.17872519409,"d":"40,085.18"},{"v":0.7976817500665031,"d":"0.80"},{"v":0.8352835283528353,"d":"0.84"},{"v":0.5862796833773087,"d":"0.59"},{"v":1.0607166526357268,"d":"1.06"},{"v":0.8131700069913773,"d":"0.81"}]
[]
[null,"Wskaźniki dla Polski","WDB per capita","WDB na 1 pracującego","Współczynnik dojazdów netto","Udział pracujących wśród aktwnych zawodowo","Współczynnik aktywności zawodowej","Wskaźnik różnicy w metodologii BAEL/demo","Wskaźnik struktury wiekowej"]
[null,null,"WDB/N","WDB/Pp","Pp/Pz","Pz/Az","Az/NB15+","NB15+/N15+","Ni15+/N"]
[null,2013]
[null,2012,{"v":37159.367019159195,"d":"37,159.37"},{"v":103021.84428620567,"d":"103,021.84"},{"v":0.8914586596331832,"d":"0.89"},{"v":0.8990830978605616,"d":"0.90"},{"v":0.5587382394638485,"d":"0.56"},{"v":0.948049565800569,"d":"0.95"},{"v":0.8495687067956471,"d":"0.85"}]
[null,2011,{"v":35435.31476501895,"d":"35,435.31"},{"v":97927.9075330495,"d":"97,927.91"},{"v":0.8961044185399302,"d":"0.90"},{"v":0.9037690922817817,"d":"0.90"},{"v":0.5553620383809063,"d":"0.56"},{"v":0.9476009238535954,"d":"0.95"},{"v":0.8490085238774671,"d":"0.85"}]
[null,2010,{"v":32855.1622785296,"d":"32,855.16"},{"v":91511.90221834507,"d":"91,511.90"},{"v":0.894023648386617,"d":"0.89"},{"v":0.9037967289719626,"d":"0.90"},{"v":0.553025163937074,"d":"0.55"},{"v":0.947447672621434,"d":"0.95"},{"v":0.8480200787617584,"d":"0.85"}]
[null,2009,{"v":31695.720703955994,"d":"31,695.72"},{"v":86036.75934332129,"d":"86,036.76"},{"v":0.8861628392252514,"d":"0.89"},{"v":0.9182291666666667,"d":"0.92"},{"v":0.5493212957370378,"d":"0.55"},{"v":0.9713581957224544,"d":"0.97"},{"v":0.8484888214210641,"d":"0.85"}]
[null,2008,{"v":29239.448964014882,"d":"29,239.45"},{"v":78678.77615084611,"d":"78,678.78"},{"v":0.8969345258052793,"d":"0.90"},{"v":0.9288695549938275,"d":"0.93"},{"v":0.5421487076521019,"d":"0.54"},{"v":0.971230624139413,"d":"0.97"},{"v":0.8471402623608278,"d":"0.85"}]
[null,2007,{"v":27171.365162139078,"d":"27,171.37"},{"v":76006.04378494697,"d":"76,006.04"},{"v":0.8940907305328947,"d":"0.89"},{"v":0.9040218293985052,"d":"0.90"},{"v":0.5369815888386316,"d":"0.54"},{"v":0.9745221468802983,"d":"0.97"},{"v":0.8451848678079427,"d":"0.85"}]
[null,2006,{"v":24472.190893654082,"d":"24,472.19"},{"v":70835.15608526816,"d":"70,835.16"},{"v":0.9025987396677198,"d":"0.90"},{"v":0.861604770620535,"d":"0.86"},{"v":0.5399623808461121,"d":"0.54"},{"v":0.9770701719044806,"d":"0.98"},{"v":0.8420384436350294,"d":"0.84"}]
[null,2005,{"v":22664.19669966668,"d":"22,664.20"},{"v":66423.04500115244,"d":"66,423.05"},{"v":0.9223266302980426,"d":"0.92"},{"v":0.8225627877163335,"d":"0.82"},{"v":0.548958766514187,"d":"0.55"},{"v":0.9778878048841524,"d":"0.98"},{"v":0.8377973614577959,"d":"0.84"}]
[null,2004,{"v":21469.941387864226,"d":"21,469.94"},{"v":63501.40272195254,"d":"63,501.40"},{"v":0.9355352293910284,"d":"0.94"},{"v":0.8103853383458647,"d":"0.81"},{"v":0.546973396735638,"d":"0.55"},{"v":0.9788468565096178,"d":"0.98"},{"v":0.832942197188205,"d":"0.83"}]
[null,2003,{"v":19513.043625804545,"d":"19,513.04"},{"v":57522.261911714486,"d":"57,522.26"},{"v":0.9514721701809001,"d":"0.95"},{"v":0.8034460376467811,"d":"0.80"},{"v":0.5475605815831988,"d":"0.55"},{"v":0.9791069955787072,"d":"0.98"},{"v":0.8277018527696652,"d":"0.83"}]
[null,2002,{"v":18707.364759781063,"d":"18,707.36"},{"v":54906.63952641513,"d":"54,906.64"},{"v":0.9448209066318307,"d":"0.94"},{"v":0.8006739092546331,"d":"0.80"},{"v":0.554131925441844,"d":"0.55"},{"v":0.9888182334478789,"d":"0.99"},{"v":0.821964271729858,"d":"0.82"}]

{"sheet":"Podlaskie","index":20,"n_rows":46,"n_cols":9,"rows_kept":46,"hidden":true,"merged":[[0,0,0,9],[1,0,1,9],[2,1,3,1],[17,1,18,1],[32,1,33,1]]}
["DEKOMPOZYCJA RÓŻNIC W POZIOMIE WDB PER CAPITA"]
["PODLASKIE"]
[null,"Różnice względem średniej","WDB per capita","WDB na 1 pracującego","Współczynnik dojazdów netto","Udział pracujących wśród aktwnych zawodowo","Współczynnik aktywności zawodowej","Wskaźnik różnicy w metodologii BAEL/demo","Wskaźnik struktury wiekowej"]
[null,null,"WDB_i/N_i","WDB_i/Pp_i","Pp_i/Pz_i","Pz_i/Az_i","Az_i/NB15+_i","NB15+_i/N15+_i*(N15+/NB15+)","Ni15+_i/N_i"]
[null,2013]
[null,2012,{"$f":"(C21-C36)/C36","v":{"v":-0.28266361846243804,"d":"-28.3%"}},{"$f":"(D21-D36)/D36","v":{"v":-0.21528147411326198,"d":"-21.5%"}},{"v":-0.03408051286875748,"d":"-3.4%"},{"v":0.010930906444502541,"d":"1.1%"},{"v":-0.003503687337343247,"d":"-0.4%"},{"v":-0.06456514194143813,"d":"-6.5%"},{"v":0.004285759534994769,"d":"0.4%"}]
[null,2011,{"$f":"(C22-C37)/C37","v":{"v":-0.2687954532728381,"d":"-26.9%"}},{"v":-0.20256106841329624,"d":"-20.3%"},{"v":-0.06382823467904182,"d":"-6.4%"},{"v":4.9268171255028945E-3,"d":"0.5%"},{"v":-0.00870733369808747,"d":"-0.9%"},{"v":-0.019405150560175752,"d":"-1.9%"},{"v":2.674507079806366E-3,"d":"0.3%"}]
[null,2010,{"v":-0.2680227335396461,"d":"-26.8%"},{"v":-0.19868574191789187,"d":"-19.9%"},{"v":-0.06863323285933202,"d":"-6.9%"},{"v":-0.004830719999372123,"d":"-0.5%"},{"v":-0.017587255515945754,"d":"-1.8%"},{"v":2.1841272160173287E-3,"d":"0.2%"},{"v":0.001003316048190765,"d":"0.1%"}]
[null,2009,{"v":-0.26246469971319547,"d":"-26.2%"},{"v":-0.21518257291797765,"d":"-21.5%"},{"v":-0.06290347361551883,"d":"-6.3%"},{"v":0.01155461515419969,"d":"1.2%"},{"v":1.118112711477848E-4,"d":"0.0%"},{"v":-0.009829141335867164,"d":"-1.0%"},{"v":1.110030182030057E-3,"d":"0.1%"}]
[null,2008,{"v":-0.2703928525372604,"d":"-27.0%"},{"v":-0.22712461374428666,"d":"-22.7%"},{"v":-0.06231455992093537,"d":"-6.2%"},{"v":0.007644036927744583,"d":"0.8%"},{"v":0.007650278577913567,"d":"0.8%"},{"v":-0.007775690927390609,"d":"-0.8%"},{"v":-0.00070066265848537,"d":"-0.1%"}]
[null,2007,{"v":-0.25628429986717133,"d":"-25.6%"},{"v":-0.2091134992353707,"d":"-20.9%"},{"v":-0.01227663540988281,"d":"-1.2%"},{"v":0.010463304762960942,"d":"1.0%"},{"v":0.011523318856899847,"d":"1.2%"},{"v":-0.06554870558938973,"d":"-6.6%"},{"v":-0.003208458428374646,"d":"-0.3%"}]
[null,2006,{"v":-0.27150266275499496,"d":"-27.2%"},{"v":-0.227520193693155,"d":"-22.8%"},{"v":0.025547699756802163,"d":"2.6%"},{"v":0.030850436643659832,"d":"3.1%"},{"v":-1.3208958878122372E-3,"d":"-0.1%"},{"v":-0.10194058700303692,"d":"-10.2%"},{"v":-0.005377505268475084,"d":"-0.5%"}]
[null,2005,{"v":-0.2592861611671317,"d":"-25.9%"},{"v":-0.2199831986256437,"d":"-22.0%"},{"v":-0.01987035699145818,"d":"-2.0%"},{"v":0.043426041088692635,"d":"4.3%"},{"v":0.01970597877023366,"d":"2.0%"},{"v":-0.08250872196880252,"d":"-8.3%"},{"v":-0.007513985405641279,"d":"-0.8%"}]
[null,2004,{"v":-0.26162053654804307,"d":"-26.2%"},{"v":-0.22690072714330303,"d":"-22.7%"},{"v":-0.016493387234543463,"d":"-1.6%"},{"v":0.04356698319805739,"d":"4.4%"},{"v":0.021604701142554188,"d":"2.2%"},{"v":-0.08049680308650034,"d":"-8.0%"},{"v":-9.371989982492562E-3,"d":"-0.9%"}]
[null,2003,{"v":-0.24624185956649286,"d":"-24.6%"},{"v":-0.21607796128163242,"d":"-21.6%"},{"v":-0.03475501144480437,"d":"-3.5%"},{"v":0.02246707610556403,"d":"2.2%"},{"v":0.015467331480233448,"d":"1.5%"},{"v":-0.029626977019076406,"d":"-3.0%"},{"v":-0.011293059614752732,"d":"-1.1%"}]
[null,2002,{"v":-0.2384795718995158,"d":"-23.8%"},{"v":-0.20468805313297417,"d":"-20.5%"},{"v":-0.06918194681679084,"d":"-6.9%"},{"v":0.03616418624400049,"d":"3.6%"},{"v":0.02795061430608463,"d":"2.8%"},{"v":-0.021209720007922164,"d":"-2.1%"},{"v":-0.013291707335660067,"d":"-1.3%"}]
[]
[null,"Wskaźniki","WDB per capita","WDB na 1 pracującego","Współczynnik dojazdów netto","Udział pracujących wśród aktwnych zawodowo","Współczynnik aktywności zawodowej","Wskaźnik różnicy w metodologii BAEL/demo","Wskaźnik struktury wiekowej"]
[null,null,"WDB_i/N_i","WDB_i/Pp_i","Pp_i/Pz_i","Pz_i/Az_i","Az_i/NB15+_i","NB15+_i/N15+_i","Ni15+_i/N_i"]
[null,2013]
[null,2012,{"v":26655.765877749876,"d":"26,655.77"},{"v":80843.14978240438,"d":"80,843.15"},{"v":0.8610772913115892,"d":"0.86"},{"v":0.9089108910891089,"d":"0.91"},{"v":0.5567805953693495,"d":"0.56"},{"v":0.8868386110171365,"d":"0.89"},{"v":0.8532097539814297,"d":"0.85"}]
[null,2011,{"v":25910.463270889988,"d":"25,910.46"},{"v":78091.52595567651,"d":"78,091.53"},{"v":0.8389076554164372,"d":"0.84"},{"v":0.9082217973231358,"d":"0.91"},{"v":0.5505263157894736,"d":"0.55"},{"v":0.9292125852552547,"d":"0.93"},{"v":0.8512792031853933,"d":"0.85"}]
[null,2010,{"v":24049.231873749428,"d":"24,049.23"},{"v":73329.7920317756,"d":"73,329.79"},{"v":0.8326639151451487,"d":"0.83"},{"v":0.8994307400379506,"d":"0.90"},{"v":0.5432989690721649,"d":"0.54"},{"v":0.9495170188689588,"d":"0.95"},{"v":0.8488709109159681,"d":"0.85"}]
[null,2009,{"v":23376.71288719887,"d":"23,376.71"},{"v":67523.14810230056,"d":"67,523.15"},{"v":0.8304201184489926,"d":"0.83"},{"v":0.9288389513108615,"d":"0.93"},{"v":0.5493827160493827,"d":"0.55"},{"v":0.9618105787289455,"d":"0.96"},{"v":0.8494306696219566,"d":"0.85"}]
[null,2008,{"v":21333.310952017255,"d":"21,333.31"},{"v":60808.889507711996,"d":"60,808.89"},{"v":0.8410424455518305,"d":"0.84"},{"v":0.935969868173258,"d":"0.94"},{"v":0.5462962962962963,"d":"0.55"},{"v":0.9636786349868882,"d":"0.96"},{"v":0.8465467028124921,"d":"0.85"}]
[null,2007,{"v":20207.770865125014,"d":"20,207.77"},{"v":60112.15400603991,"d":"60,112.15"},{"v":0.8831143046107865,"d":"0.88"},{"v":0.9134808853118712,"d":"0.91"},{"v":0.5431693989071038,"d":"0.54"},{"v":0.9106434815841016,"d":"0.91"},{"v":0.8424731272952896,"d":"0.84"}]
[null,2006,{"v":17827.92590257846,"d":"17,827.93"},{"v":54718.72765246308,"d":"54,718.73"},{"v":0.9256580612696187,"d":"0.93"},{"v":0.8881856540084389,"d":"0.89"},{"v":0.5392491467576792,"d":"0.54"},{"v":0.8774670650373797,"d":"0.88"},{"v":0.8375103774681235,"d":"0.84"}]
[null,2005,{"v":16787.68414147333,"d":"16,787.68"},{"v":51811.09109934385,"d":"51,811.09"},{"v":0.9039996708912919,"d":"0.90"},{"v":0.8582834331337326,"d":"0.86"},{"v":0.5597765363128492,"d":"0.56"},{"v":0.8972035318742833,"d":"0.90"},{"v":0.8315021643109173,"d":"0.83"}]
[null,2004,{"v":15852.963802316151,"d":"15,852.96"},{"v":49092.888269721785,"d":"49,092.89"},{"v":0.9201050845811247,"d":"0.92"},{"v":0.845691382765531,"d":"0.85"},{"v":0.5587905935050392,"d":"0.56"},{"v":0.9000528138493232,"d":"0.90"},{"v":0.8251358712601617,"d":"0.83"}]
[null,2003,{"v":14708.115477584333,"d":"14,708.12"},{"v":45092.968829523124,"d":"45,092.97"},{"v":0.9184037440168501,"d":"0.92"},{"v":0.8214971209213052,"d":"0.82"},{"v":0.5560298826040555,"d":"0.56"},{"v":0.9500990151214799,"d":"0.95"},{"v":0.8183545664030961,"d":"0.82"}]
[null,2002,{"v":14246.040420500387,"d":"14,246.04"},{"v":43667.90637767921,"d":"43,667.91"},{"v":0.8794563569178353,"d":"0.88"},{"v":0.8296296296296296,"d":"0.83"},{"v":0.569620253164557,"d":"0.57"},{"v":0.9678456755777212,"d":"0.97"},{"v":0.8110389631896557,"d":"0.81"}]
[]
[null,"Wskaźniki dla Polski","WDB per capita","WDB na 1 pracującego","Współczynnik dojazdów netto","Udział pracujących wśród aktwnych zawodowo","Współczynnik aktywności zawodowej","Wskaźnik różnicy w metodologii BAEL/demo","Wskaźnik struktury wiekowej"]
[null,null,"WDB/N","WDB/Pp","Pp/Pz","Pz/Az","Az/NB15+","NB15+/N15+","Ni15+/N"]
[null,2013]
[null,2012,{"v":37159.367019159195,"d":"37,159.37"},{"v":103021.84428620567,"d":"103,021.84"},{"v":0.8914586596331832,"d":"0.89"},{"v":0.8990830978605616,"d":"0.90"},{"v":0.5587382394638485,"d":"0.56"},{"v":0.948049565800569,"d":"0.95"},{"v":0.8495687067956471,"d":"0.85"}]
[null,2011,{"v":35435.31476501895,"d":"35,435.31"},{"v":97927.9075330495,"d":"97,927.91"},{"v":0.8961044185399302,"d":"0.90"},{"v":0.9037690922817817,"d":"0.90"},{"v":0.5553620383809063,"d":"0.56"},{"v":0.9476009238535954,"d":"0.95"},{"v":0.8490085238774671,"d":"0.85"}]
[null,2010,{"v":32855.1622785296,"d":"32,855.16"},{"v":91511.90221834507,"d":"91,511.90"},{"v":0.894023648386617,"d":"0.89"},{"v":0.9037967289719626,"d":"0.90"},{"v":0.553025163937074,"d":"0.55"},{"v":0.947447672621434,"d":"0.95"},{"v":0.8480200787617584,"d":"0.85"}]
[null,2009,{"v":31695.720703955994,"d":"31,695.72"},{"v":86036.75934332129,"d":"86,036.76"},{"v":0.8861628392252514,"d":"0.89"},{"v":0.9182291666666667,"d":"0.92"},{"v":0.5493212957370378,"d":"0.55"},{"v":0.9713581957224544,"d":"0.97"},{"v":0.8484888214210641,"d":"0.85"}]
[null,2008,{"v":29239.448964014882,"d":"29,239.45"},{"v":78678.77615084611,"d":"78,678.78"},{"v":0.8969345258052793,"d":"0.90"},{"v":0.9288695549938275,"d":"0.93"},{"v":0.5421487076521019,"d":"0.54"},{"v":0.971230624139413,"d":"0.97"},{"v":0.8471402623608278,"d":"0.85"}]
[null,2007,{"v":27171.365162139078,"d":"27,171.37"},{"v":76006.04378494697,"d":"76,006.04"},{"v":0.8940907305328947,"d":"0.89"},{"v":0.9040218293985052,"d":"0.90"},{"v":0.5369815888386316,"d":"0.54"},{"v":0.9745221468802983,"d":"0.97"},{"v":0.8451848678079427,"d":"0.85"}]
[null,2006,{"v":24472.190893654082,"d":"24,472.19"},{"v":70835.15608526816,"d":"70,835.16"},{"v":0.9025987396677198,"d":"0.90"},{"v":0.861604770620535,"d":"0.86"},{"v":0.5399623808461121,"d":"0.54"},{"v":0.9770701719044806,"d":"0.98"},{"v":0.8420384436350294,"d":"0.84"}]
[null,2005,{"v":22664.19669966668,"d":"22,664.20"},{"v":66423.04500115244,"d":"66,423.05"},{"v":0.9223266302980426,"d":"0.92"},{"v":0.8225627877163335,"d":"0.82"},{"v":0.548958766514187,"d":"0.55"},{"v":0.9778878048841524,"d":"0.98"},{"v":0.8377973614577959,"d":"0.84"}]
[null,2004,{"v":21469.941387864226,"d":"21,469.94"},{"v":63501.40272195254,"d":"63,501.40"},{"v":0.9355352293910284,"d":"0.94"},{"v":0.8103853383458647,"d":"0.81"},{"v":0.546973396735638,"d":"0.55"},{"v":0.9788468565096178,"d":"0.98"},{"v":0.832942197188205,"d":"0.83"}]
[null,2003,{"v":19513.043625804545,"d":"19,513.04"},{"v":57522.261911714486,"d":"57,522.26"},{"v":0.9514721701809001,"d":"0.95"},{"v":0.8034460376467811,"d":"0.80"},{"v":0.5475605815831988,"d":"0.55"},{"v":0.9791069955787072,"d":"0.98"},{"v":0.8277018527696652,"d":"0.83"}]
[null,2002,{"v":18707.364759781063,"d":"18,707.36"},{"v":54906.63952641513,"d":"54,906.64"},{"v":0.9448209066318307,"d":"0.94"},{"v":0.8006739092546331,"d":"0.80"},{"v":0.554131925441844,"d":"0.55"},{"v":0.9888182334478789,"d":"0.99"},{"v":0.821964271729858,"d":"0.82"}]

{"sheet":"Świętokrzyskie","index":21,"n_rows":46,"n_cols":9,"rows_kept":46,"hidden":true,"merged":[[0,0,0,9],[1,0,1,9],[2,1,3,1],[17,1,18,1],[32,1,33,1]]}
["DEKOMPOZYCJA RÓŻNIC W POZIOMIE WDB PER CAPITA"]
["ŚWIĘTOKRZYSKIE"]
[null,"Różnice względem średniej","WDB per capita","WDB na 1 pracującego","Współczynnik dojazdów netto","Udział pracujących wśród aktwnych zawodowo","Współczynnik aktywności zawodowej","Wskaźnik różnicy w metodologii BAEL/demo","Wskaźnik struktury wiekowej"]
[null,null,"WDB_i/N_i","WDB_i/Pp_i","Pp_i/Pz_i","Pz_i/Az_i","Az_i/NB15+_i","NB15+_i/N15+_i*(N15+/NB15+)","Ni15+_i/N_i"]
[null,2013]
[null,2012,{"$f":"(C21-C36)/C36","v":{"v":-0.24893613732800415,"d":"-24.9%"}},{"$f":"(D21-D36)/D36","v":{"v":-0.23384967300125148,"d":"-23.4%"}},{"v":-0.1347222610179104,"d":"-13.5%"},{"v":-0.03484303389494998,"d":"-3.5%"},{"v":0.02423437514097954,"d":"2.4%"},{"v":0.13439069063279263,"d":"13.4%"},{"v":0.01029311556222646,"d":"1.0%"}]
[null,2011,{"$f":"(C22-C37)/C37","v":{"v":-0.23619647132681063,"d":"-23.6%"}},{"v":-0.22611956466791133,"d":"-22.6%"},{"v":-0.15243152687736222,"d":"-15.2%"},{"v":-0.0362422213902687,"d":"-3.6%"},{"v":0.026803948550011378,"d":"2.7%"},{"v":0.16597559379046872,"d":"16.6%"},{"v":0.009225262207076475,"d":"0.9%"}]
[null,2010,{"v":-0.22483741956257677,"d":"-22.5%"},{"v":-0.21080842569123992,"d":"-21.1%"},{"v":-0.16930222986651772,"d":"-16.9%"},{"v":-0.024856612653216068,"d":"-2.5%"},{"v":0.023334204000091764,"d":"2.3%"},{"v":0.17548087382573946,"d":"17.5%"},{"v":0.008012175141119312,"d":"0.8%"}]
[null,2009,{"v":-0.206480677508491,"d":"-20.6%"},{"v":-0.21293550351515572,"d":"-21.3%"},{"v":-0.08688298121257317,"d":"-8.7%"},{"v":-0.02917774643929503,"d":"-2.9%"},{"v":0.019315127949010687,"d":"1.9%"},{"v":0.10850531246500596,"d":"10.9%"},{"v":0.006548660981909356,"d":"0.7%"}]
[null,2008,{"v":-0.17494061126665067,"d":"-17.5%"},{"v":-0.19091106275912892,"d":"-19.1%"},{"v":-0.09007201875527382,"d":"-9.0%"},{"v":-0.016603922413299842,"d":"-1.7%"},{"v":0.04318138654009549,"d":"4.3%"},{"v":0.0865525548066027,"d":"8.7%"},{"v":0.005409278962770847,"d":"0.5%"}]
[null,2007,{"v":-0.2035416448159355,"d":"-20.4%"},{"v":-0.21659659453544947,"d":"-21.7%"},{"v":-0.10601784424728916,"d":"-10.6%"},{"v":-0.024958316380665244,"d":"-2.5%"},{"v":0.04821890209378376,"d":"4.8%"},{"v":0.10817854407733497,"d":"10.8%"},{"v":0.00406969793024458,"d":"0.4%"}]
[null,2006,{"v":-0.21849756523075586,"d":"-21.8%"},{"v":-0.2364197963073651,"d":"-23.6%"},{"v":-0.074959680077227,"d":"-7.5%"},{"v":-0.018629131377822856,"d":"-1.9%"},{"v":0.017240563712116394,"d":"1.7%"},{"v":0.10521707207634538,"d":"10.5%"},{"v":2.7913874987480795E-3,"d":"0.3%"}]
[null,2005,{"v":-0.2328228460556824,"d":"-23.3%"},{"v":-0.24942066326534107,"d":"-24.9%"},{"v":-0.043516153344969596,"d":"-4.4%"},{"v":-0.01502067851563002,"d":"-1.5%"},{"v":-0.009399577987826424,"d":"-0.9%"},{"v":0.09361868998472543,"d":"9.4%"},{"v":1.451385418726781E-3,"d":"0.1%"}]
[null,2004,{"v":-0.2079344096735563,"d":"-20.8%"},{"v":-0.2249121970414853,"d":"-22.5%"},{"v":-0.010531368185809154,"d":"-1.1%"},{"v":-0.020553142585931564,"d":"-2.1%"},{"v":-0.0357572292349673,"d":"-3.6%"},{"v":0.09284289053591083,"d":"9.3%"},{"v":6.5233524949828627E-4,"d":"0.1%"}]
[null,2003,{"v":-0.19950031745662988,"d":"-20.0%"},{"v":-0.21776111124199357,"d":"-21.8%"},{"v":-0.022323768788774127,"d":"-2.2%"},{"v":0.004884144577174981,"d":"0.5%"},{"v":-0.055207697686098484,"d":"-5.5%"},{"v":0.10253984550735977,"d":"10.3%"},{"v":-4.5888652392416123E-5,"d":"-0.0%"}]
[null,2002,{"v":-0.20833552344013678,"d":"-20.8%"},{"v":-0.2233379246251529,"d":"-22.3%"},{"v":-0.025896916598753563,"d":"-2.6%"},{"v":0.01282839900049887,"d":"1.3%"},{"v":-0.0643262938053129,"d":"-6.4%"},{"v":0.10454594634486704,"d":"10.5%"},{"v":-3.2217382541417308E-4,"d":"-0.0%"}]
[]
[null,"Wskaźniki","WDB per capita","WDB na 1 pracującego","Współczynnik dojazdów netto","Udział pracujących wśród aktwnych zawodowo","Współczynnik aktywności zawodowej","Wskaźnik różnicy w metodologii BAEL/demo","Wskaźnik struktury wiekowej"]
[null,null,"WDB_i/N_i","WDB_i/Pp_i","Pp_i/Pz_i","Pz_i/Az_i","Az_i/NB15+_i","NB15+_i/N15+_i","Ni15+_i/N_i"]
[null,2013]
[null,2012,{"v":27909.057727856074,"d":"27,909.06"},{"v":78930.21968789063,"d":"78,930.22"},{"v":0.7713593334034049,"d":"0.77"},{"v":0.8677563150074294,"d":"0.87"},{"v":0.5722789115646258,"d":"0.57"},{"v":1.0754586017026266,"d":"1.08"},{"v":0.858313415672746,"d":"0.86"}]
[null,2011,{"v":27065.61845716664,"d":"27,065.62"},{"v":75784.49171283687,"d":"75,784.49"},{"v":0.7595098537803378,"d":"0.76"},{"v":0.8710144927536232,"d":"0.87"},{"v":0.5702479338842975,"d":"0.57"},{"v":1.1048795498665926,"d":"1.10"},{"v":0.8568408501262796,"d":"0.86"}]
[null,2010,{"v":25468.092372515293,"d":"25,468.09"},{"v":72220.42217968506,"d":"72,220.42"},{"v":0.7426634511613631,"d":"0.74"},{"v":0.8813314037626628,"d":"0.88"},{"v":0.5659295659295659,"d":"0.57"},{"v":1.1137066181172064,"d":"1.11"},{"v":0.8548145641559834,"d":"0.85"}]
[null,2009,{"v":25151.166818883255,"d":"25,151.17"},{"v":67716.47867173889,"d":"67,716.48"},{"v":0.8091703699135634,"d":"0.81"},{"v":0.8914373088685015,"d":"0.89"},{"v":0.559931506849315,"d":"0.56"},{"v":1.0767557202647637,"d":"1.08"},{"v":0.8540452870594905,"d":"0.85"}]
[null,2008,{"v":24124.281889150083,"d":"24,124.28"},{"v":63658.12737930047,"d":"63,658.13"},{"v":0.8161458223746936,"d":"0.82"},{"v":0.9134466769706336,"d":"0.91"},{"v":0.5655594405594405,"d":"0.57"},{"v":1.0552931159650905,"d":"1.06"},{"v":0.8517226803605324,"d":"0.85"}]
[null,2007,{"v":21640.860805142882,"d":"21,640.86"},{"v":59543.393537015196,"d":"59,543.39"},{"v":0.7993011587203133,"d":"0.80"},{"v":0.8814589665653495,"d":"0.88"},{"v":0.562874251497006,"d":"0.56"},{"v":1.0799445339009277,"d":"1.08"},{"v":0.8486245149151347,"d":"0.85"}]
[null,2006,{"v":19125.07676752839,"d":"19,125.08"},{"v":54088.32291218865,"d":"54,088.32"},{"v":0.8349402269041192,"d":"0.83"},{"v":0.8455538221528861,"d":"0.85"},{"v":0.5492716366752356,"d":"0.55"},{"v":1.0798746346054016,"d":"1.08"},{"v":0.8443888992200576,"d":"0.84"}]
[null,2005,{"v":17387.45392048448,"d":"17,387.45"},{"v":49855.7650608614,"d":"49,855.77"},{"v":0.8821905232198439,"d":"0.88"},{"v":0.810207336523126,"d":"0.81"},{"v":0.5437987857762359,"d":"0.54"},{"v":1.0694363801294455,"d":"1.07"},{"v":0.8390133283320635,"d":"0.84"}]
[null,2004,{"v":17005.601799652824,"d":"17,005.60"},{"v":49219.16272054204,"d":"49,219.16"},{"v":0.925682763439516,"d":"0.93"},{"v":0.7937293729372937,"d":"0.79"},{"v":0.5274151436031331,"d":"0.53"},{"v":1.0697258280599606,"d":"1.07"},{"v":0.8334855547442254,"d":"0.83"}]
[null,2003,{"v":15620.18522791147,"d":"15,620.19"},{"v":44996.15023666654,"d":"44,996.15"},{"v":0.9302317254448286,"d":"0.93"},{"v":0.8073701842546064,"d":"0.81"},{"v":0.5173310225303293,"d":"0.52"},{"v":1.079504475640523,"d":"1.08"},{"v":0.8276638706470589,"d":"0.83"}]
[null,2002,{"v":14809.956130366507,"d":"14,809.96"},{"v":42643.904606444186,"d":"42,643.90"},{"v":0.9203529584120275,"d":"0.92"},{"v":0.8109452736318408,"d":"0.81"},{"v":0.5184866723989682,"d":"0.52"},{"v":1.092195171426747,"d":"1.09"},{"v":0.821699456356081,"d":"0.82"}]
[]
[null,"Wskaźniki dla Polski","WDB per capita","WDB na 1 pracującego","Współczynnik dojazdów netto","Udział pracujących wśród aktwnych zawodowo","Współczynnik aktywności zawodowej","Wskaźnik różnicy w metodologii BAEL/demo","Wskaźnik struktury wiekowej"]
[null,null,"WDB/N","WDB/Pp","Pp/Pz","Pz/Az","Az/NB15+","NB15+/N15+","Ni15+/N"]
[null,2013]
[null,2012,{"v":37159.367019159195,"d":"37,159.37"},{"v":103021.84428620567,"d":"103,021.84"},{"v":0.8914586596331832,"d":"0.89"},{"v":0.8990830978605616,"d":"0.90"},{"v":0.5587382394638485,"d":"0.56"},{"v":0.948049565800569,"d":"0.95"},{"v":0.8495687067956471,"d":"0.85"}]
[null,2011,{"v":35435.31476501895,"d":"35,435.31"},{"v":97927.9075330495,"d":"97,927.91"},{"v":0.8961044185399302,"d":"0.90"},{"v":0.9037690922817817,"d":"0.90"},{"v":0.5553620383809063,"d":"0.56"},{"v":0.9476009238535954,"d":"0.95"},{"v":0.8490085238774671,"d":"0.85"}]
[null,2010,{"v":32855.1622785296,"d":"32,855.16"},{"v":91511.90221834507,"d":"91,511.90"},{"v":0.894023648386617,"d":"0.89"},{"v":0.9037967289719626,"d":"0.90"},{"v":0.553025163937074,"d":"0.55"},{"v":0.947447672621434,"d":"0.95"},{"v":0.8480200787617584,"d":"0.85"}]
[null,2009,{"v":31695.720703955994,"d":"31,695.72"},{"v":86036.75934332129,"d":"86,036.76"},{"v":0.8861628392252514,"d":"0.89"},{"v":0.9182291666666667,"d":"0.92"},{"v":0.5493212957370378,"d":"0.55"},{"v":0.9713581957224544,"d":"0.97"},{"v":0.8484888214210641,"d":"0.85"}]
[null,2008,{"v":29239.448964014882,"d":"29,239.45"},{"v":78678.77615084611,"d":"78,678.78"},{"v":0.8969345258052793,"d":"0.90"},{"v":0.9288695549938275,"d":"0.93"},{"v":0.5421487076521019,"d":"0.54"},{"v":0.971230624139413,"d":"0.97"},{"v":0.8471402623608278,"d":"0.85"}]
[null,2007,{"v":27171.365162139078,"d":"27,171.37"},{"v":76006.04378494697,"d":"76,006.04"},{"v":0.8940907305328947,"d":"0.89"},{"v":0.9040218293985052,"d":"0.90"},{"v":0.5369815888386316,"d":"0.54"},{"v":0.9745221468802983,"d":"0.97"},{"v":0.8451848678079427,"d":"0.85"}]
[null,2006,{"v":24472.190893654082,"d":"24,472.19"},{"v":70835.15608526816,"d":"70,835.16"},{"v":0.9025987396677198,"d":"0.90"},{"v":0.861604770620535,"d":"0.86"},{"v":0.5399623808461121,"d":"0.54"},{"v":0.9770701719044806,"d":"0.98"},{"v":0.8420384436350294,"d":"0.84"}]
[null,2005,{"v":22664.19669966668,"d":"22,664.20"},{"v":66423.04500115244,"d":"66,423.05"},{"v":0.9223266302980426,"d":"0.92"},{"v":0.8225627877163335,"d":"0.82"},{"v":0.548958766514187,"d":"0.55"},{"v":0.9778878048841524,"d":"0.98"},{"v":0.8377973614577959,"d":"0.84"}]
[null,2004,{"v":21469.941387864226,"d":"21,469.94"},{"v":63501.40272195254,"d":"63,501.40"},{"v":0.9355352293910284,"d":"0.94"},{"v":0.8103853383458647,"d":"0.81"},{"v":0.546973396735638,"d":"0.55"},{"v":0.9788468565096178,"d":"0.98"},{"v":0.832942197188205,"d":"0.83"}]
[null,2003,{"v":19513.043625804545,"d":"19,513.04"},{"v":57522.261911714486,"d":"57,522.26"},{"v":0.9514721701809001,"d":"0.95"},{"v":0.8034460376467811,"d":"0.80"},{"v":0.5475605815831988,"d":"0.55"},{"v":0.9791069955787072,"d":"0.98"},{"v":0.8277018527696652,"d":"0.83"}]
[null,2002,{"v":18707.364759781063,"d":"18,707.36"},{"v":54906.63952641513,"d":"54,906.64"},{"v":0.9448209066318307,"d":"0.94"},{"v":0.8006739092546331,"d":"0.80"},{"v":0.554131925441844,"d":"0.55"},{"v":0.9888182334478789,"d":"0.99"},{"v":0.821964271729858,"d":"0.82"}]

{"sheet":"Lubuskie","index":22,"n_rows":46,"n_cols":9,"rows_kept":46,"hidden":true,"merged":[[0,0,0,9],[1,0,1,9],[2,1,3,1],[17,1,18,1],[32,1,33,1]]}
["DEKOMPOZYCJA RÓŻNIC W POZIOMIE WDB PER CAPITA"]
["LUBUSKIE"]
[null,"Różnice względem średniej","WDB per capita","WDB na 1 pracującego","Współczynnik dojazdów netto","Udział pracujących wśród aktwnych zawodowo","Współczynnik aktywności zawodowej","Wskaźnik różnicy w metodologii BAEL/demo","Wskaźnik struktury wiekowej"]
[null,null,"WDB_i/N_i","WDB_i/Pp_i","Pp_i/Pz_i","Pz_i/Az_i","Az_i/NB15+_i","NB15+_i/N15+_i*(N15+/NB15+)","Ni15+_i/N_i"]
[null,2013]
[null,2012,{"$f":"(C21-C36)/C36","v":{"v":-0.16885404007497087,"d":"-16.9%"}},{"$f":"(D21-D36)/D36","v":{"v":-0.05431411777226118,"d":"-5.4%"}},{"v":-0.10148912604319736,"d":"-10.1%"},{"v":0.009997575351768151,"d":"1.0%"},{"v":-0.03828061221299477,"d":"-3.8%"},{"v":0.009783923571504989,"d":"1.0%"},{"v":-2.736554246182079E-3,"d":"-0.3%"}]
[null,2011,{"$f":"(C22-C37)/C37","v":{"v":-0.16755676907773187,"d":"-16.8%"}},{"v":-0.06194201257957762,"d":"-6.2%"},{"v":-0.12496621181758817,"d":"-12.5%"},{"v":-8.3190596900485994E-4,"d":"-0.1%"},{"v":-0.014751146988791378,"d":"-1.5%"},{"v":0.03312459051498239,"d":"3.3%"},{"v":-2.844421543658081E-3,"d":"-0.3%"}]
[null,2010,{"v":-0.15304036408569155,"d":"-15.3%"},{"v":-0.044738680530160925,"d":"-4.5%"},{"v":-0.14878223892710407,"d":"-14.9%"},{"v":-0.007216330441571259,"d":"-0.7%"},{"v":-0.002857152503916604,"d":"-0.3%"},{"v":0.055258649214054836,"d":"5.5%"},{"v":-2.9224902934628315E-3,"d":"-0.3%"}]
[null,2009,{"v":-0.14378532860712823,"d":"-14.4%"},{"v":-0.020815915606410572,"d":"-2.1%"},{"v":-0.09787120248523139,"d":"-9.8%"},{"v":-0.015012289657780228,"d":"-1.5%"},{"v":-0.02477058531746025,"d":"-2.5%"},{"v":0.013272775752027142,"d":"1.3%"},{"v":-4.16864873248561E-3,"d":"-0.4%"}]
[null,2008,{"v":-0.13126430306485654,"d":"-13.1%"},{"v":-0.016038437708478386,"d":"-1.6%"},{"v":-0.11275847515994022,"d":"-11.3%"},{"v":0.0064184531060117,"d":"0.6%"},{"v":-0.03320611709779157,"d":"-3.3%"},{"v":0.02697490199445982,"d":"2.7%"},{"v":-0.004146717344878588,"d":"-0.4%"}]
[null,2007,{"v":-0.10629976586790116,"d":"-10.6%"},{"v":0.005691074574163717,"d":"0.6%"},{"v":-0.18003503111639732,"d":"-18.0%"},{"v":-1.2491594542417355E-3,"d":"-0.1%"},{"v":-0.006246482225288477,"d":"-0.6%"},{"v":0.09648457890759263,"d":"9.6%"},{"v":-0.004150722959994378,"d":"-0.4%"}]
[null,2006,{"v":-0.10018737577106603,"d":"-10.0%"},{"v":0.017053304504770057,"d":"1.7%"},{"v":-0.18295519340712094,"d":"-18.3%"},{"v":-0.003816771873550357,"d":"-0.4%"},{"v":-0.017522130905985995,"d":"-1.8%"},{"v":0.11075935129478771,"d":"11.1%"},{"v":-0.003951438227180482,"d":"-0.4%"}]
[null,2005,{"v":-0.09385273925273088,"d":"-9.4%"},{"v":0.038077421615381885,"d":"3.8%"},{"v":-0.18115981540510973,"d":"-18.1%"},{"v":-0.01455470212190061,"d":"-1.5%"},{"v":4.7041005390848406E-4,"d":"0.0%"},{"v":0.08546860333073417,"d":"8.5%"},{"v":-3.8703824312581367E-3,"d":"-0.4%"}]
[null,2004,{"v":-0.11168147989843696,"d":"-11.2%"},{"v":0.03706825377372632,"d":"3.7%"},{"v":-0.17135046514877816,"d":"-17.1%"},{"v":-0.05252385797353233,"d":"-5.3%"},{"v":1.860556105665969E-3,"d":"0.2%"},{"v":0.09345097388260717,"d":"9.3%"},{"v":-4.1002842635893405E-3,"d":"-0.4%"}]
[null,2003,{"v":-0.1353596599738611,"d":"-13.5%"},{"v":0.017664153401628326,"d":"1.8%"},{"v":-0.1416329550808645,"d":"-14.2%"},{"v":-0.06124711207154096,"d":"-6.1%"},{"v":-0.023776812407157667,"d":"-2.4%"},{"v":0.08478852295483491,"d":"8.5%"},{"v":-0.004336711166118259,"d":"-0.4%"}]
[null,2002,{"v":-0.12018066585750058,"d":"-12.0%"},{"v":0.02039713885086531,"d":"2.0%"},{"v":-0.11944295357511713,"d":"-11.9%"},{"v":-0.07754055292518769,"d":"-7.8%"},{"v":-0.01935854962928494,"d":"-1.9%"},{"v":0.08832532709066422,"d":"8.8%"},{"v":-5.3952998856258445E-3,"d":"-0.5%"}]
[]
[null,"Wskaźniki","WDB per capita","WDB na 1 pracującego","Współczynnik dojazdów netto","Udział pracujących wśród aktwnych zawodowo","Współczynnik aktywności zawodowej","Wskaźnik różnicy w metodologii BAEL/demo","Wskaźnik struktury wiekowej"]
[null,null,"WDB_i/N_i","WDB_i/Pp_i","Pp_i/Pz_i","Pz_i/Az_i","Az_i/NB15+_i","NB15+_i/N15+_i","Ni15+_i/N_i"]
[null,2013]
[null,2012,{"v":30884.857771345538,"d":"30,884.86"},{"v":97426.30370252914,"d":"97,426.30"},{"v":0.8009852993633713,"d":"0.80"},{"v":0.9080717488789237,"d":"0.91"},{"v":0.5373493975903615,"d":"0.54"},{"v":0.9573252102943602,"d":"0.96"},{"v":0.8472438159436421,"d":"0.85"}]
[null,2011,{"v":29497.887911739926,"d":"29,497.89"},{"v":91862.05585274563,"d":"91,862.06"},{"v":0.7841216439619926,"d":"0.78"},{"v":0.9030172413793104,"d":"0.90"},{"v":0.5471698113207547,"d":"0.55"},{"v":0.9789898164278648,"d":"0.98"},{"v":0.8465935857414006,"d":"0.85"}]
[null,2010,{"v":27826.99628132895,"d":"27,827.00"},{"v":87417.78046029121,"d":"87,417.78"},{"v":0.761008808325878,"d":"0.76"},{"v":0.8972746331236897,"d":"0.90"},{"v":0.5514450867052023,"d":"0.55"},{"v":0.9998023512114945,"d":"1.00"},{"v":0.8455417483129156,"d":"0.85"}]
[null,2009,{"v":27138.341087097924,"d":"27,138.34"},{"v":84245.82542178166,"d":"84,245.83"},{"v":0.7994330165525493,"d":"0.80"},{"v":0.9044444444444445,"d":"0.90"},{"v":0.5357142857142857,"d":"0.54"},{"v":0.9842508152291722,"d":"0.98"},{"v":0.844951769571119,"d":"0.84"}]
[null,2008,{"v":25401.353073753027,"d":"25,401.35"},{"v":77416.89150057145,"d":"77,416.89"},{"v":0.795797556357172,"d":"0.80"},{"v":0.9348314606741573,"d":"0.93"},{"v":0.5241460541813898,"d":"0.52"},{"v":0.9974294750395917,"d":"1.00"},{"v":0.8436274111413512,"d":"0.84"}]
[null,2007,{"v":24283.055407092448,"d":"24,283.06"},{"v":76438.59984821426,"d":"76,438.60"},{"v":0.7331230780405226,"d":"0.73"},{"v":0.9028925619834711,"d":"0.90"},{"v":0.5336273428886439,"d":"0.53"},{"v":1.068548505858167,"d":"1.07"},{"v":0.8416767395716924,"d":"0.84"}]
[null,2006,{"v":22020.3863086503,"d":"22,020.39"},{"v":72043.12957163315,"d":"72,043.13"},{"v":0.7374636126827885,"d":"0.74"},{"v":0.8583162217659137,"d":"0.86"},{"v":0.5305010893246187,"d":"0.53"},{"v":1.0852898303141076,"d":"1.09"},{"v":0.8387111807400944,"d":"0.84"}]
[null,2005,{"v":20537.09975644026,"d":"20,537.10"},{"v":68952.2632906388,"d":"68,952.26"},{"v":0.7552381082100323,"d":"0.76"},{"v":0.8105906313645621,"d":"0.81"},{"v":0.5492170022371364,"d":"0.55"},{"v":1.0614665097817584,"d":"1.06"},{"v":0.8345547652690553,"d":"0.83"}]
[null,2004,{"v":19072.146560334848,"d":"19,072.15"},{"v":65855.28883303747,"d":"65,855.29"},{"v":0.7752308326718068,"d":"0.78"},{"v":0.7678207739307535,"d":"0.77"},{"v":0.5479910714285714,"d":"0.55"},{"v":1.0703210485323702,"d":"1.07"},{"v":0.8295268974045946,"d":"0.83"}]
[null,2003,{"v":16871.764675560524,"d":"16,871.76"},{"v":58538.34397013165,"d":"58,538.34"},{"v":0.8167123550409761,"d":"0.82"},{"v":0.7542372881355932,"d":"0.75"},{"v":0.5345413363533409,"d":"0.53"},{"v":1.0621240315485718,"d":"1.06"},{"v":0.8241123489025423,"d":"0.82"}]
[null,2002,{"v":16459.101206511434,"d":"16,459.10"},{"v":56026.57787666983,"d":"56,026.58"},{"v":0.8319687069442049,"d":"0.83"},{"v":0.7385892116182573,"d":"0.74"},{"v":0.5434047350620068,"d":"0.54"},{"v":1.0761559273503756,"d":"1.08"},{"v":0.8175295279886053,"d":"0.82"}]
[]
[null,"Wskaźniki dla Polski","WDB per capita","WDB na 1 pracującego","Współczynnik dojazdów netto","Udział pracujących wśród aktwnych zawodowo","Współczynnik aktywności zawodowej","Wskaźnik różnicy w metodologii BAEL/demo","Wskaźnik struktury wiekowej"]
[null,null,"WDB/N","WDB/Pp","Pp/Pz","Pz/Az","Az/NB15+","NB15+/N15+","Ni15+/N"]
[null,2013]
[null,2012,{"v":37159.367019159195,"d":"37,159.37"},{"v":103021.84428620567,"d":"103,021.84"},{"v":0.8914586596331832,"d":"0.89"},{"v":0.8990830978605616,"d":"0.90"},{"v":0.5587382394638485,"d":"0.56"},{"v":0.948049565800569,"d":"0.95"},{"v":0.8495687067956471,"d":"0.85"}]
[null,2011,{"v":35435.31476501895,"d":"35,435.31"},{"v":97927.9075330495,"d":"97,927.91"},{"v":0.8961044185399302,"d":"0.90"},{"v":0.9037690922817817,"d":"0.90"},{"v":0.5553620383809063,"d":"0.56"},{"v":0.9476009238535954,"d":"0.95"},{"v":0.8490085238774671,"d":"0.85"}]
[null,2010,{"v":32855.1622785296,"d":"32,855.16"},{"v":91511.90221834507,"d":"91,511.90"},{"v":0.894023648386617,"d":"0.89"},{"v":0.9037967289719626,"d":"0.90"},{"v":0.553025163937074,"d":"0.55"},{"v":0.947447672621434,"d":"0.95"},{"v":0.8480200787617584,"d":"0.85"}]
[null,2009,{"v":31695.720703955994,"d":"31,695.72"},{"v":86036.75934332129,"d":"86,036.76"},{"v":0.8861628392252514,"d":"0.89"},{"v":0.9182291666666667,"d":"0.92"},{"v":0.5493212957370378,"d":"0.55"},{"v":0.9713581957224544,"d":"0.97"},{"v":0.8484888214210641,"d":"0.85"}]
[null,2008,{"v":29239.448964014882,"d":"29,239.45"},{"v":78678.77615084611,"d":"78,678.78"},{"v":0.8969345258052793,"d":"0.90"},{"v":0.9288695549938275,"d":"0.93"},{"v":0.5421487076521019,"d":"0.54"},{"v":0.971230624139413,"d":"0.97"},{"v":0.8471402623608278,"d":"0.85"}]
[null,2007,{"v":27171.365162139078,"d":"27,171.37"},{"v":76006.04378494697,"d":"76,006.04"},{"v":0.8940907305328947,"d":"0.89"},{"v":0.9040218293985052,"d":"0.90"},{"v":0.5369815888386316,"d":"0.54"},{"v":0.9745221468802983,"d":"0.97"},{"v":0.8451848678079427,"d":"0.85"}]
[null,2006,{"v":24472.190893654082,"d":"24,472.19"},{"v":70835.15608526816,"d":"70,835.16"},{"v":0.9025987396677198,"d":"0.90"},{"v":0.861604770620535,"d":"0.86"},{"v":0.5399623808461121,"d":"0.54"},{"v":0.9770701719044806,"d":"0.98"},{"v":0.8420384436350294,"d":"0.84"}]
[null,2005,{"v":22664.19669966668,"d":"22,664.20"},{"v":66423.04500115244,"d":"66,423.05"},{"v":0.9223266302980426,"d":"0.92"},{"v":0.8225627877163335,"d":"0.82"},{"v":0.548958766514187,"d":"0.55"},{"v":0.9778878048841524,"d":"0.98"},{"v":0.8377973614577959,"d":"0.84"}]
[null,2004,{"v":21469.941387864226,"d":"21,469.94"},{"v":63501.40272195254,"d":"63,501.40"},{"v":0.9355352293910284,"d":"0.94"},{"v":0.8103853383458647,"d":"0.81"},{"v":0.546973396735638,"d":"0.55"},{"v":0.9788468565096178,"d":"0.98"},{"v":0.832942197188205,"d":"0.83"}]
[null,2003,{"v":19513.043625804545,"d":"19,513.04"},{"v":57522.261911714486,"d":"57,522.26"},{"v":0.9514721701809001,"d":"0.95"},{"v":0.8034460376467811,"d":"0.80"},{"v":0.5475605815831988,"d":"0.55"},{"v":0.9791069955787072,"d":"0.98"},{"v":0.8277018527696652,"d":"0.83"}]
[null,2002,{"v":18707.364759781063,"d":"18,707.36"},{"v":54906.63952641513,"d":"54,906.64"},{"v":0.9448209066318307,"d":"0.94"},{"v":0.8006739092546331,"d":"0.80"},{"v":0.554131925441844,"d":"0.55"},{"v":0.9888182334478789,"d":"0.99"},{"v":0.821964271729858,"d":"0.82"}]

{"sheet":"Wielkopolskie","index":23,"n_rows":46,"n_cols":9,"rows_kept":46,"hidden":true,"merged":[[0,0,0,9],[1,0,1,9],[2,1,3,1],[17,1,18,1],[32,1,33,1]]}
["DEKOMPOZYCJA RÓŻNIC W POZIOMIE WDB PER CAPITA"]
["WIELKOPOLSKIE"]
[null,"Różnice względem średniej","WDB per capita","WDB na 1 pracującego","Współczynnik dojazdów netto","Udział pracujących wśród aktwnych zawodowo","Współczynnik aktywności zawodowej","Wskaźnik różnicy w metodologii BAEL/demo","Wskaźnik struktury wiekowej"]
[null,null,"WDB_i/N_i","WDB_i/Pp_i","Pp_i/Pz_i","Pz_i/Az_i","Az_i/NB15+_i","NB15+_i/N15+_i*(N15+/NB15+)","Ni15+_i/N_i"]
[null,2013]
[null,2012,{"$f":"(C21-C36)/C36","v":{"v":0.06175516631209151,"d":"6.2%"}},{"$f":"(D21-D36)/D36","v":{"v":-0.032277545892290954,"d":"-3.2%"}},{"v":0.12023434326222751,"d":"12.0%"},{"v":0.01733273469736816,"d":"1.7%"},{"v":0.02505546548833493,"d":"2.5%"},{"v":-0.049385332727160856,"d":"-4.9%"},{"v":-0.01201628417959351,"d":"-1.2%"}]
[null,2011,{"$f":"(C22-C37)/C37","v":{"v":0.050880299548278975,"d":"5.1%"}},{"v":-0.0362540015988454,"d":"-3.6%"},{"v":0.11628223892503148,"d":"11.6%"},{"v":0.01081004185282571,"d":"1.1%"},{"v":0.03209212580595784,"d":"3.2%"},{"v":-0.05249414689485504,"d":"-5.2%"},{"v":-0.011795711882396656,"d":"-1.2%"}]
[null,2010,{"v":0.05087833292268709,"d":"5.1%"},{"v":-0.033243841339884346,"d":"-3.3%"},{"v":0.1178321898725491,"d":"11.8%"},{"v":0.010361551583574295,"d":"1.0%"},{"v":0.04523130841121487,"d":"4.5%"},{"v":-0.0686099629405843,"d":"-6.9%"},{"v":-0.011360246505697932,"d":"-1.1%"}]
[null,2009,{"v":0.07686973089168082,"d":"7.7%"},{"v":-3.8334740029063803E-3,"d":"-0.4%"},{"v":0.1800352478908011,"d":"18.0%"},{"v":0.008267097566639632,"d":"0.8%"},{"v":0.020896157407407447,"d":"2.1%"},{"v":-0.09985763096421207,"d":"-10.0%"},{"v":-0.011292389279702143,"d":"-1.1%"}]
[null,2008,{"v":0.05639521073309925,"d":"5.6%"},{"v":-0.028151900648733522,"d":"-2.8%"},{"v":0.1789044547300793,"d":"17.9%"},{"v":0.01041034453140358,"d":"1.0%"},{"v":0.014701914765526595,"d":"1.5%"},{"v":-0.09089009670062378,"d":"-9.1%"},{"v":-0.010771152236140787,"d":"-1.1%"}]
[null,2007,{"v":0.05529720881228544,"d":"5.5%"},{"v":-0.03191111890360176,"d":"-3.2%"},{"v":0.1251424945122976,"d":"12.5%"},{"v":0.014889782133876654,"d":"1.5%"},{"v":0.013330888342467881,"d":"1.3%"},{"v":-0.04802195518156154,"d":"-4.8%"},{"v":-0.010410824203360628,"d":"-1.0%"}]
[null,2006,{"v":0.06309500959366725,"d":"6.3%"},{"v":-0.023459173789552375,"d":"-2.3%"},{"v":0.0887711490001516,"d":"8.9%"},{"v":0.012610033483415353,"d":"1.3%"},{"v":0.023735788795553353,"d":"2.4%"},{"v":-0.025642439123484802,"d":"-2.6%"},{"v":-0.010087977265785456,"d":"-1.0%"}]
[null,2005,{"v":0.07736014943931244,"d":"7.7%"},{"v":-0.012733329474844584,"d":"-1.3%"},{"v":0.06781082279543467,"d":"6.8%"},{"v":7.824219609322865E-3,"d":"0.8%"},{"v":0.03803913243318046,"d":"3.8%"},{"v":-0.013289228860352878,"d":"-1.3%"},{"v":-0.009980549207975727,"d":"-1.0%"}]
[null,2004,{"v":0.07085673553170582,"d":"7.1%"},{"v":-0.015692807260577143,"d":"-1.6%"},{"v":0.05598713758316847,"d":"5.6%"},{"v":0.010573870990359946,"d":"1.1%"},{"v":0.045295589028625426,"d":"4.5%"},{"v":-0.014843468233869466,"d":"-1.5%"},{"v":-0.010012612533324439,"d":"-1.0%"}]
[null,2003,{"v":0.055054342360561184,"d":"5.5%"},{"v":-0.019418007971102463,"d":"-1.9%"},{"v":-0.010072497833766368,"d":"-1.0%"},{"v":0.03152102854244939,"d":"3.2%"},{"v":0.04711274609247618,"d":"4.7%"},{"v":0.01668989243131341,"d":"1.7%"},{"v":-0.010245493267808561,"d":"-1.0%"}]
[null,2002,{"v":0.04112850924151648,"d":"4.1%"},{"v":-0.023741089451661784,"d":"-2.4%"},{"v":0.02327210625759421,"d":"2.3%"},{"v":0.022013825931951884,"d":"2.2%"},{"v":0.025793514775264734,"d":"2.6%"},{"v":0.004550562542185605,"d":"0.5%"},{"v":-0.010400035281943032,"d":"-1.0%"}]
[]
[null,"Wskaźniki","WDB per capita","WDB na 1 pracującego","Współczynnik dojazdów netto","Udział pracujących wśród aktwnych zawodowo","Współczynnik aktywności zawodowej","Wskaźnik różnicy w metodologii BAEL/demo","Wskaźnik struktury wiekowej"]
[null,null,"WDB_i/N_i","WDB_i/Pp_i","Pp_i/Pz_i","Pz_i/Az_i","Az_i/NB15+_i","NB15+_i/N15+_i","Ni15+_i/N_i"]
[null,2013]
[null,2012,{"v":39454.14990947942,"d":"39,454.15"},{"v":99696.55197934921,"d":"99,696.55"},{"v":0.9986426061196045,"d":"1.00"},{"v":0.9146666666666666,"d":"0.91"},{"v":0.572737686139748,"d":"0.57"},{"v":0.9012298225516675,"d":"0.90"},{"v":0.8393600477847009,"d":"0.84"}]
[null,2011,{"v":37238.27419485067,"d":"37,238.27"},{"v":94377.62901677474,"d":"94,377.63"},{"v":1.0003054466383667,"d":"1.00"},{"v":0.9135388739946381,"d":"0.91"},{"v":0.5731847867844795,"d":"0.57"},{"v":0.8978574217591244,"d":"0.90"},{"v":0.8389938639441096,"d":"0.84"}]
[null,2010,{"v":34526.77816316554,"d":"34,526.78"},{"v":88469.6950602874,"d":"88,469.70"},{"v":0.9993684126738579,"d":"1.00"},{"v":0.9131614654002713,"d":"0.91"},{"v":0.5780392156862745,"d":"0.58"},{"v":0.8824433229147346,"d":"0.88"},{"v":0.8383863616252435,"d":"0.84"}]
[null,2009,{"v":34132.16222488697,"d":"34,132.16"},{"v":85706.93966308435,"d":"85,706.94"},{"v":1.0457033856567857,"d":"1.05"},{"v":0.9258202567760342,"d":"0.93"},{"v":0.5608,"d":"0.56"},{"v":0.8743606674799387,"d":"0.87"},{"v":0.8389073553501017,"d":"0.84"}]
[null,2008,{"v":30888.413850060202,"d":"30,888.41"},{"v":76463.81906148355,"d":"76,463.82"},{"v":1.057400108073055,"d":"1.06"},{"v":0.9385394070860448,"d":"0.94"},{"v":0.5501193317422435,"d":"0.55"},{"v":0.8829553787927745,"d":"0.88"},{"v":0.8380155856295751,"d":"0.84"}]
[null,2007,{"v":28673.86581522474,"d":"28,673.87"},{"v":73580.60588433317,"d":"73,580.61"},{"v":1.0059794748721036,"d":"1.01"},{"v":0.9174825174825175,"d":"0.92"},{"v":0.5441400304414004,"d":"0.54"},{"v":0.9277236880193734,"d":"0.93"},{"v":0.8363857967298536,"d":"0.84"}]
[null,2006,{"v":26016.264012867243,"d":"26,016.26"},{"v":69173.42184825378,"d":"69,173.42"},{"v":0.9827234668741119,"d":"0.98"},{"v":0.8724696356275303,"d":"0.87"},{"v":0.5527788138754196,"d":"0.55"},{"v":0.9520157095020472,"d":"0.95"},{"v":0.8335439789587219,"d":"0.83"}]
[null,2005,{"v":24417.502343274868,"d":"24,417.50"},{"v":65577.25848443033,"d":"65,577.26"},{"v":0.9848703579846936,"d":"0.98"},{"v":0.8289986996098829,"d":"0.83"},{"v":0.5698406817339755,"d":"0.57"},{"v":0.9648924300452988,"d":"0.96"},{"v":0.8294356836654542,"d":"0.83"}]
[null,2004,{"v":22991.231346665347,"d":"22,991.23"},{"v":62504.88744826065,"d":"62,504.89"},{"v":0.987913168992845,"d":"0.99"},{"v":0.818954248366013,"d":"0.82"},{"v":0.5717488789237668,"d":"0.57"},{"v":0.9643173742891943,"d":"0.96"},{"v":0.8246022697051035,"d":"0.82"}]
[null,2003,{"v":20587.321410076154,"d":"20,587.32"},{"v":56405.29417139697,"d":"56,405.29"},{"v":0.941888468807864,"d":"0.94"},{"v":0.8287714831317632,"d":"0.83"},{"v":0.5733576642335766,"d":"0.57"},{"v":0.9954481860136623,"d":"1.00"},{"v":0.819221639009361,"d":"0.82"}]
[null,2002,{"v":19476.77078418814,"d":"19,476.77"},{"v":53603.09608592836,"d":"53,603.10"},{"v":0.9668088791653632,"d":"0.97"},{"v":0.81829980532122,"d":"0.82"},{"v":0.5684249354481741,"d":"0.57"},{"v":0.993317912662037,"d":"0.99"},{"v":0.8134158143033708,"d":"0.81"}]
[]
[null,"Wskaźniki dla Polski","WDB per capita","WDB na 1 pracującego","Współczynnik dojazdów netto","Udział pracujących wśród aktwnych zawodowo","Współczynnik aktywności zawodowej","Wskaźnik różnicy w metodologii BAEL/demo","Wskaźnik struktury wiekowej"]
[null,null,"WDB/N","WDB/Pp","Pp/Pz","Pz/Az","Az/NB15+","NB15+/N15+","Ni15+/N"]
[null,2013]
[null,2012,{"v":37159.367019159195,"d":"37,159.37"},{"v":103021.84428620567,"d":"103,021.84"},{"v":0.8914586596331832,"d":"0.89"},{"v":0.8990830978605616,"d":"0.90"},{"v":0.5587382394638485,"d":"0.56"},{"v":0.948049565800569,"d":"0.95"},{"v":0.8495687067956471,"d":"0.85"}]
[null,2011,{"v":35435.31476501895,"d":"35,435.31"},{"v":97927.9075330495,"d":"97,927.91"},{"v":0.8961044185399302,"d":"0.90"},{"v":0.9037690922817817,"d":"0.90"},{"v":0.5553620383809063,"d":"0.56"},{"v":0.9476009238535954,"d":"0.95"},{"v":0.8490085238774671,"d":"0.85"}]
[null,2010,{"v":32855.1622785296,"d":"32,855.16"},{"v":91511.90221834507,"d":"91,511.90"},{"v":0.894023648386617,"d":"0.89"},{"v":0.9037967289719626,"d":"0.90"},{"v":0.553025163937074,"d":"0.55"},{"v":0.947447672621434,"d":"0.95"},{"v":0.8480200787617584,"d":"0.85"}]
[null,2009,{"v":31695.720703955994,"d":"31,695.72"},{"v":86036.75934332129,"d":"86,036.76"},{"v":0.8861628392252514,"d":"0.89"},{"v":0.9182291666666667,"d":"0.92"},{"v":0.5493212957370378,"d":"0.55"},{"v":0.9713581957224544,"d":"0.97"},{"v":0.8484888214210641,"d":"0.85"}]
[null,2008,{"v":29239.448964014882,"d":"29,239.45"},{"v":78678.77615084611,"d":"78,678.78"},{"v":0.8969345258052793,"d":"0.90"},{"v":0.9288695549938275,"d":"0.93"},{"v":0.5421487076521019,"d":"0.54"},{"v":0.971230624139413,"d":"0.97"},{"v":0.8471402623608278,"d":"0.85"}]
[null,2007,{"v":27171.365162139078,"d":"27,171.37"},{"v":76006.04378494697,"d":"76,006.04"},{"v":0.8940907305328947,"d":"0.89"},{"v":0.9040218293985052,"d":"0.90"},{"v":0.5369815888386316,"d":"0.54"},{"v":0.9745221468802983,"d":"0.97"},{"v":0.8451848678079427,"d":"0.85"}]
[null,2006,{"v":24472.190893654082,"d":"24,472.19"},{"v":70835.15608526816,"d":"70,835.16"},{"v":0.9025987396677198,"d":"0.90"},{"v":0.861604770620535,"d":"0.86"},{"v":0.5399623808461121,"d":"0.54"},{"v":0.9770701719044806,"d":"0.98"},{"v":0.8420384436350294,"d":"0.84"}]
[null,2005,{"v":22664.19669966668,"d":"22,664.20"},{"v":66423.04500115244,"d":"66,423.05"},{"v":0.9223266302980426,"d":"0.92"},{"v":0.8225627877163335,"d":"0.82"},{"v":0.548958766514187,"d":"0.55"},{"v":0.9778878048841524,"d":"0.98"},{"v":0.8377973614577959,"d":"0.84"}]
[null,2004,{"v":21469.941387864226,"d":"21,469.94"},{"v":63501.40272195254,"d":"63,501.40"},{"v":0.9355352293910284,"d":"0.94"},{"v":0.8103853383458647,"d":"0.81"},{"v":0.546973396735638,"d":"0.55"},{"v":0.9788468565096178,"d":"0.98"},{"v":0.832942197188205,"d":"0.83"}]
[null,2003,{"v":19513.043625804545,"d":"19,513.04"},{"v":57522.261911714486,"d":"57,522.26"},{"v":0.9514721701809001,"d":"0.95"},{"v":0.8034460376467811,"d":"0.80"},{"v":0.5475605815831988,"d":"0.55"},{"v":0.9791069955787072,"d":"0.98"},{"v":0.8277018527696652,"d":"0.83"}]
[null,2002,{"v":18707.364759781063,"d":"18,707.36"},{"v":54906.63952641513,"d":"54,906.64"},{"v":0.9448209066318307,"d":"0.94"},{"v":0.8006739092546331,"d":"0.80"},{"v":0.554131925441844,"d":"0.55"},{"v":0.9888182334478789,"d":"0.99"},{"v":0.821964271729858,"d":"0.82"}]

{"sheet":"Zachodniopomorskie","index":24,"n_rows":46,"n_cols":9,"rows_kept":46,"hidden":true,"merged":[[0,0,0,9],[1,0,1,9],[2,1,3,1],[17,1,18,1],[32,1,33,1]]}
["DEKOMPOZYCJA RÓŻNIC W POZIOMIE WDB PER CAPITA"]
["ZACHODNIOPOMORSKIE"]
[null,"Różnice względem średniej","WDB per capita","WDB na 1 pracującego","Współczynnik dojazdów netto","Udział pracujących wśród aktwnych zawodowo","Współczynnik aktywności zawodowej","Wskaźnik różnicy w metodologii BAEL/demo","Wskaźnik struktury wiekowej"]
[null,null,"WDB_i/N_i","WDB_i/Pp_i","Pp_i/Pz_i","Pz_i/Az_i","Az_i/NB15+_i","NB15+_i/N15+_i*(N15+/NB15+)","Ni15+_i/N_i"]
[null,2013]
[null,2012,{"$f":"(C21-C36)/C36","v":{"v":-0.157056403350665,"d":"-15.7%"}},{"$f":"(D21-D36)/D36","v":{"v":0.006249471095551177,"d":"0.6%"}},{"v":0.038191274389186416,"d":"3.8%"},{"v":-0.009379928950435708,"d":"-0.9%"},{"v":-0.06589722268767456,"d":"-6.6%"},{"v":-0.13248491345128008,"d":"-13.2%"},{"v":0.005163370291321338,"d":"0.5%"}]
[null,2011,{"$f":"(C22-C37)/C37","v":{"v":-0.15863169825853354,"d":"-15.9%"}},{"v":-3.2079969938418416E-3,"d":"-0.3%"},{"v":0.07345776398841962,"d":"7.3%"},{"v":-0.02222440686988873,"d":"-2.2%"},{"v":-0.07656317684944934,"d":"-7.7%"},{"v":-0.133102462894422,"d":"-13.3%"},{"v":0.004575285547373991,"d":"0.5%"}]
[null,2010,{"v":-0.14185506993742852,"d":"-14.2%"},{"v":0.014105361786329637,"d":"1.4%"},{"v":0.03859803519686478,"d":"3.9%"},{"v":-0.031002913108909822,"d":"-3.1%"},{"v":-0.054785737043330555,"d":"-5.5%"},{"v":-0.11377749862114017,"d":"-11.4%"},{"v":0.003770793495734773,"d":"0.4%"}]
[null,2009,{"v":-0.12464111257224636,"d":"-12.5%"},{"v":0.010973345273673434,"d":"1.1%"},{"v":0.019192117432603666,"d":"1.9%"},{"v":-0.02214182418379811,"d":"-2.2%"},{"v":-0.05132612806468436,"d":"-5.1%"},{"v":-0.08587761518432067,"d":"-8.6%"},{"v":1.8281467595897803E-3,"d":"0.2%"}]
[null,2008,{"v":-0.10343460483593556,"d":"-10.3%"},{"v":0.019649188562793834,"d":"2.0%"},{"v":0.0897115069810762,"d":"9.0%"},{"v":-0.02505147775457252,"d":"-2.5%"},{"v":-0.07030626293043785,"d":"-7.0%"},{"v":-0.11077364609872689,"d":"-11.1%"},{"v":1.1190867014770906E-3,"d":"0.1%"}]
[null,2007,{"v":-0.11237854954740964,"d":"-11.2%"},{"v":0.014715023753200397,"d":"1.5%"},{"v":0.09405230287591414,"d":"9.4%"},{"v":-0.022161966273823663,"d":"-2.2%"},{"v":-0.08162459350221107,"d":"-8.2%"},{"v":-0.11048014131219723,"d":"-11.0%"},{"v":9.2790003434431326E-4,"d":"0.1%"}]
[null,2006,{"v":-0.09948607074868825,"d":"-9.9%"},{"v":0.02845838362581167,"d":"2.8%"},{"v":0.0467647725950017,"d":"4.7%"},{"v":-0.03960499727203737,"d":"-4.0%"},{"v":-0.05819295804657159,"d":"-5.8%"},{"v":-0.07597455519144551,"d":"-7.6%"},{"v":8.2664268981053925E-4,"d":"0.1%"}]
[null,2005,{"v":-0.09261573683268577,"d":"-9.3%"},{"v":0.0378677160397056,"d":"3.8%"},{"v":-0.00732747487304678,"d":"-0.7%"},{"v":-0.058803096920447155,"d":"-5.9%"},{"v":-0.014550451808760358,"d":"-1.5%"},{"v":-0.05135611143680983,"d":"-5.1%"},{"v":0.000979402174046972,"d":"0.1%"}]
[null,2004,{"v":-0.09730099894538466,"d":"-9.7%"},{"v":0.03837461148362687,"d":"3.8%"},{"v":-0.028303032392624616,"d":"-2.8%"},{"v":-0.05949719960755395,"d":"-5.9%"},{"v":-0.006419996987934684,"d":"-0.6%"},{"v":-0.04346992643966818,"d":"-4.3%"},{"v":9.1336722728094146E-4,"d":"0.1%"}]
[null,2003,{"v":-0.07564602222147213,"d":"-7.6%"},{"v":0.05797197424704222,"d":"5.8%"},{"v":-0.03413965518408847,"d":"-3.4%"},{"v":-0.0724559301927209,"d":"-7.2%"},{"v":-0.032834817929525015,"d":"-3.3%"},{"v":0.007362947855027936,"d":"0.7%"},{"v":0.000987457785457224,"d":"0.1%"}]
[null,2002,{"v":-0.044327374873628984,"d":"-4.4%"},{"v":0.0720121015530349,"d":"7.2%"},{"v":-0.016622462986238342,"d":"-1.7%"},{"v":-0.07823658750081054,"d":"-7.8%"},{"v":-0.034795478193521856,"d":"-3.5%"},{"v":0.017862785357328045,"d":"1.8%"},{"v":1.062342716520726E-3,"d":"0.1%"}]
[]
[null,"Wskaźniki","WDB per capita","WDB na 1 pracującego","Współczynnik dojazdów netto","Udział pracujących wśród aktwnych zawodowo","Współczynnik aktywności zawodowej","Wskaźnik różnicy w metodologii BAEL/demo","Wskaźnik struktury wiekowej"]
[null,null,"WDB_i/N_i","WDB_i/Pp_i","Pp_i/Pz_i","Pz_i/Az_i","Az_i/NB15+_i","NB15+_i/N15+_i","Ni15+_i/N_i"]
[null,2013]
[null,2012,{"v":31323.25048434273,"d":"31,323.25"},{"v":103665.67632428269,"d":"103,665.68"},{"v":0.9255046019098504,"d":"0.93"},{"v":0.8906497622820919,"d":"0.89"},{"v":0.52191894127378,"d":"0.52"},{"v":0.8224473011279569,"d":"0.82"},{"v":0.853955344616752,"d":"0.85"}]
[null,2011,{"v":29814.150605518305,"d":"29,814.15"},{"v":97613.75510007025,"d":"97,613.76"},{"v":0.9619302454260164,"d":"0.96"},{"v":0.8836833602584814,"d":"0.88"},{"v":0.5128417564208783,"d":"0.51"},{"v":0.8214729070476522,"d":"0.82"},{"v":0.852892980306361,"d":"0.85"}]
[null,2010,{"v":28194.49093570322,"d":"28,194.49"},{"v":92802.71070689005,"d":"92,802.71"},{"v":0.9285312046338731,"d":"0.93"},{"v":0.8757763975155279,"d":"0.88"},{"v":0.5227272727272727,"d":"0.52"},{"v":0.8396494463561464,"d":"0.84"},{"v":0.8512177873590058,"d":"0.85"}]
[null,2009,{"v":27745.130811635736,"d":"27,745.13"},{"v":86980.8704098235,"d":"86,980.87"},{"v":0.9031701805000719,"d":"0.90"},{"v":0.8978978978978979,"d":"0.90"},{"v":0.5211267605633803,"d":"0.52"},{"v":0.8879402703840654,"d":"0.89"},{"v":0.8500399835104931,"d":"0.85"}]
[null,2008,{"v":26215.078114801498,"d":"26,215.08"},{"v":80224.75025932393,"d":"80,224.75"},{"v":0.9773998737786279,"d":"0.98"},{"v":0.9056,"d":"0.91"},{"v":0.5040322580645161,"d":"0.50"},{"v":0.863643866700748,"d":"0.86"},{"v":0.8480882857627217,"d":"0.85"}]
[null,2007,{"v":24117.88655599487,"d":"24,117.89"},{"v":77124.47452462926,"d":"77,124.47"},{"v":0.9781820227195218,"d":"0.98"},{"v":0.8839869281045751,"d":"0.88"},{"v":0.4931506849315068,"d":"0.49"},{"v":0.8668568023810971,"d":"0.87"},{"v":0.845969114875809,"d":"0.85"}]
[null,2006,{"v":22037.548779032608,"d":"22,037.55"},{"v":72851.01013133697,"d":"72,851.01"},{"v":0.9448085644728158,"d":"0.94"},{"v":0.8274809160305343,"d":"0.83"},{"v":0.5085403726708074,"d":"0.51"},{"v":0.9028377002032085,"d":"0.90"},{"v":0.8427345085589998,"d":"0.84"}]
[null,2005,{"v":20565.135422606127,"d":"20,565.14"},{"v":68938.33400774866,"d":"68,938.33"},{"v":0.9155683050897918,"d":"0.92"},{"v":0.7741935483870968,"d":"0.77"},{"v":0.5409711684370258,"d":"0.54"},{"v":0.9276672898038245,"d":"0.93"},{"v":0.8386179020150185,"d":"0.84"}]
[null,2004,{"v":19380.89464352618,"d":"19,380.89"},{"v":65938.24438007279,"d":"65,938.24"},{"v":0.9090567454891326,"d":"0.91"},{"v":0.7621696801112656,"d":"0.76"},{"v":0.5434618291761149,"d":"0.54"},{"v":0.9362964556614443,"d":"0.94"},{"v":0.833702979293336,"d":"0.83"}]
[null,2003,{"v":18036.95949407838,"d":"18,036.96"},{"v":60856.940997892016,"d":"60,856.94"},{"v":0.9189892383736679,"d":"0.92"},{"v":0.7452316076294278,"d":"0.75"},{"v":0.5295815295815296,"d":"0.53"},{"v":0.9863161093316463,"d":"0.99"},{"v":0.82851917340822,"d":"0.83"}]
[null,2002,{"v":17878.11638917653,"d":"17,878.12"},{"v":58860.582027927216,"d":"58,860.58"},{"v":0.929115656082719,"d":"0.93"},{"v":0.738031914893617,"d":"0.74"},{"v":0.534850640113798,"d":"0.53"},{"v":1.0064812813093706,"d":"1.01"},{"v":0.8228374794871705,"d":"0.82"}]
[]
[null,"Wskaźniki dla Polski","WDB per capita","WDB na 1 pracującego","Współczynnik dojazdów netto","Udział pracujących wśród aktwnych zawodowo","Współczynnik aktywności zawodowej","Wskaźnik różnicy w metodologii BAEL/demo","Wskaźnik struktury wiekowej"]
[null,null,"WDB/N","WDB/Pp","Pp/Pz","Pz/Az","Az/NB15+","NB15+/N15+","Ni15+/N"]
[null,2013]
[null,2012,{"v":37159.367019159195,"d":"37,159.37"},{"v":103021.84428620567,"d":"103,021.84"},{"v":0.8914586596331832,"d":"0.89"},{"v":0.8990830978605616,"d":"0.90"},{"v":0.5587382394638485,"d":"0.56"},{"v":0.948049565800569,"d":"0.95"},{"v":0.8495687067956471,"d":"0.85"}]
[null,2011,{"v":35435.31476501895,"d":"35,435.31"},{"v":97927.9075330495,"d":"97,927.91"},{"v":0.8961044185399302,"d":"0.90"},{"v":0.9037690922817817,"d":"0.90"},{"v":0.5553620383809063,"d":"0.56"},{"v":0.9476009238535954,"d":"0.95"},{"v":0.8490085238774671,"d":"0.85"}]
[null,2010,{"v":32855.1622785296,"d":"32,855.16"},{"v":91511.90221834507,"d":"91,511.90"},{"v":0.894023648386617,"d":"0.89"},{"v":0.9037967289719626,"d":"0.90"},{"v":0.553025163937074,"d":"0.55"},{"v":0.947447672621434,"d":"0.95"},{"v":0.8480200787617584,"d":"0.85"}]
[null,2009,{"v":31695.720703955994,"d":"31,695.72"},{"v":86036.75934332129,"d":"86,036.76"},{"v":0.8861628392252514,"d":"0.89"},{"v":0.9182291666666667,"d":"0.92"},{"v":0.5493212957370378,"d":"0.55"},{"v":0.9713581957224544,"d":"0.97"},{"v":0.8484888214210641,"d":"0.85"}]
[null,2008,{"v":29239.448964014882,"d":"29,239.45"},{"v":78678.77615084611,"d":"78,678.78"},{"v":0.8969345258052793,"d":"0.90"},{"v":0.9288695549938275,"d":"0.93"},{"v":0.5421487076521019,"d":"0.54"},{"v":0.971230624139413,"d":"0.97"},{"v":0.8471402623608278,"d":"0.85"}]
[null,2007,{"v":27171.365162139078,"d":"27,171.37"},{"v":76006.04378494697,"d":"76,006.04"},{"v":0.8940907305328947,"d":"0.89"},{"v":0.9040218293985052,"d":"0.90"},{"v":0.5369815888386316,"d":"0.54"},{"v":0.9745221468802983,"d":"0.97"},{"v":0.8451848678079427,"d":"0.85"}]
[null,2006,{"v":24472.190893654082,"d":"24,472.19"},{"v":70835.15608526816,"d":"70,835.16"},{"v":0.9025987396677198,"d":"0.90"},{"v":0.861604770620535,"d":"0.86"},{"v":0.5399623808461121,"d":"0.54"},{"v":0.9770701719044806,"d":"0.98"},{"v":0.8420384436350294,"d":"0.84"}]
[null,2005,{"v":22664.19669966668,"d":"22,664.20"},{"v":66423.04500115244,"d":"66,423.05"},{"v":0.9223266302980426,"d":"0.92"},{"v":0.8225627877163335,"d":"0.82"},{"v":0.548958766514187,"d":"0.55"},{"v":0.9778878048841524,"d":"0.98"},{"v":0.8377973614577959,"d":"0.84"}]
[null,2004,{"v":21469.941387864226,"d":"21,469.94"},{"v":63501.40272195254,"d":"63,501.40"},{"v":0.9355352293910284,"d":"0.94"},{"v":0.8103853383458647,"d":"0.81"},{"v":0.546973396735638,"d":"0.55"},{"v":0.9788468565096178,"d":"0.98"},{"v":0.832942197188205,"d":"0.83"}]
[null,2003,{"v":19513.043625804545,"d":"19,513.04"},{"v":57522.261911714486,"d":"57,522.26"},{"v":0.9514721701809001,"d":"0.95"},{"v":0.8034460376467811,"d":"0.80"},{"v":0.5475605815831988,"d":"0.55"},{"v":0.9791069955787072,"d":"0.98"},{"v":0.8277018527696652,"d":"0.83"}]
[null,2002,{"v":18707.364759781063,"d":"18,707.36"},{"v":54906.63952641513,"d":"54,906.64"},{"v":0.9448209066318307,"d":"0.94"},{"v":0.8006739092546331,"d":"0.80"},{"v":0.554131925441844,"d":"0.55"},{"v":0.9888182334478789,"d":"0.99"},{"v":0.821964271729858,"d":"0.82"}]

{"sheet":"Dolnośląskie","index":25,"n_rows":46,"n_cols":9,"rows_kept":46,"hidden":true,"merged":[[0,0,0,9],[1,0,1,9],[2,1,3,1],[17,1,18,1],[32,1,33,1]]}
["DEKOMPOZYCJA RÓŻNIC W POZIOMIE WDB PER CAPITA"]
["DOLNOŚLĄSKIE"]
[null,"Różnice względem średniej","WDB per capita","WDB na 1 pracującego","Współczynnik dojazdów netto","Udział pracujących wśród aktwnych zawodowo","Współczynnik aktywności zawodowej","Wskaźnik różnicy w metodologii BAEL/demo","Wskaźnik struktury wiekowej"]
[null,null,"WDB_i/N_i","WDB_i/Pp_i","Pp_i/Pz_i","Pz_i/Az_i","Az_i/NB15+_i","NB15+_i/N15+_i*(N15+/NB15+)","Ni15+_i/N_i"]
[null,2013]
[null,2012,{"$f":"(C21-C36)/C36","v":{"v":0.1316038720395543,"d":"13.2%"}},{"$f":"(D21-D36)/D36","v":{"v":0.16260422539526134,"d":"16.3%"}},{"v":0.055879257623939554,"d":"5.6%"},{"v":-0.012247146522859879,"d":"-1.2%"},{"v":-0.03665341446042971,"d":"-3.7%"},{"v":-0.043251844138357566,"d":"-4.3%"},{"v":0.012557699080597113,"d":"1.3%"}]
[null,2011,{"$f":"(C22-C37)/C37","v":{"v":0.14005032039711748,"d":"14.0%"}},{"v":0.17376132445907883,"d":"17.4%"},{"v":0.043706334605256664,"d":"4.4%"},{"v":-0.010848989455009473,"d":"-1.1%"},{"v":-0.03893384217851898,"d":"-3.9%"},{"v":-0.033589243104448385,"d":"-3.4%"},{"v":0.012950602881990573,"d":"1.3%"}]
[null,2010,{"v":0.1259988190536555,"d":"12.6%"},{"v":0.1619267985686978,"d":"16.2%"},{"v":0.002025424980488469,"d":"0.2%"},{"v":-0.019091967662990483,"d":"-1.9%"},{"v":-0.019963704787044293,"d":"-2.0%"},{"v":-0.007363513417006702,"d":"-0.7%"},{"v":0.013490635042012243,"d":"1.3%"}]
[null,2009,{"v":0.09327194213201186,"d":"9.3%"},{"v":0.12808563735376388,"d":"12.8%"},{"v":0.013086933001224217,"d":"1.3%"},{"v":-0.020537462943738656,"d":"-2.1%"},{"v":-0.017987819244180383,"d":"-1.8%"},{"v":-0.018436672263517914,"d":"-1.8%"},{"v":0.0132494815403783,"d":"1.3%"}]
[null,2008,{"v":0.0818840204411801,"d":"8.2%"},{"v":0.11848835943617275,"d":"11.8%"},{"v":0.005276277363657139,"d":"0.5%"},{"v":-0.02307411844627687,"d":"-2.3%"},{"v":-0.024083867235931956,"d":"-2.4%"},{"v":-4.471831931529455E-3,"d":"-0.4%"},{"v":0.013762303431814416,"d":"1.4%"}]
[null,2007,{"v":0.08977932807339088,"d":"9.0%"},{"v":0.15042538456195176,"d":"15.0%"},{"v":-0.043665876835800845,"d":"-4.4%"},{"v":-0.033692340181615196,"d":"-3.4%"},{"v":-0.008465557142074935,"d":"-0.8%"},{"v":0.018851115664369804,"d":"1.9%"},{"v":0.014697300462223246,"d":"1.5%"}]
[null,2006,{"v":0.07497366292514311,"d":"7.5%"},{"v":0.14935776243469512,"d":"14.9%"},{"v":-0.06196094048034014,"d":"-6.2%"},{"v":-0.037914504228808564,"d":"-3.8%"},{"v":0.002275128412259247,"d":"0.2%"},{"v":0.018035652631371,"d":"1.8%"},{"v":0.01568271059624631,"d":"1.6%"}]
[null,2005,{"v":0.03474733677278227,"d":"3.5%"},{"v":0.10952867797458121,"d":"11.0%"},{"v":-6.5094753312546615E-3,"d":"-0.7%"},{"v":-0.06275187972545043,"d":"-6.3%"},{"v":-0.007977729638950585,"d":"-0.8%"},{"v":-0.006901409266408518,"d":"-0.7%"},{"v":0.01663180028949998,"d":"1.7%"}]
[null,2004,{"v":0.013576367680592371,"d":"1.4%"},{"v":0.08636468326539547,"d":"8.6%"},{"v":0.029002864896372132,"d":"2.9%"},{"v":-0.07451435198608294,"d":"-7.5%"},{"v":-0.021634844944707146,"d":"-2.2%"},{"v":-0.015605029159961304,"d":"-1.6%"},{"v":0.017241810684091,"d":"1.7%"}]
[null,2003,{"v":0.022316223899349494,"d":"2.2%"},{"v":0.09575322457528936,"d":"9.6%"},{"v":0.07717859646461055,"d":"7.7%"},{"v":-0.07937884210117413,"d":"-7.9%"},{"v":-0.03206257347990246,"d":"-3.2%"},{"v":-0.04508055778205914,"d":"-4.5%"},{"v":0.017864130467224706,"d":"1.8%"}]
[null,2002,{"v":0.02732522086204635,"d":"2.7%"},{"v":0.1005350033441285,"d":"10.1%"},{"v":0.06396470599857275,"d":"6.4%"},{"v":-0.0758589992641339,"d":"-7.6%"},{"v":-0.01652324728697383,"d":"-1.7%"},{"v":-0.05191285127791835,"d":"-5.2%"},{"v":0.018184007220658743,"d":"1.8%"}]
[]
[null,"Wskaźniki","WDB per capita","WDB na 1 pracującego","Współczynnik dojazdów netto","Udział pracujących wśród aktwnych zawodowo","Współczynnik aktywności zawodowej","Wskaźnik różnicy w metodologii BAEL/demo","Wskaźnik struktury wiekowej"]
[null,null,"WDB_i/N_i","WDB_i/Pp_i","Pp_i/Pz_i","Pz_i/Az_i","Az_i/NB15+_i","NB15+_i/N15+_i","Ni15+_i/N_i"]
[null,2013]
[null,2012,{"v":42049.683601419456,"d":"42,049.68"},{"v":119773.63147515537,"d":"119,773.63"},{"v":0.9412727077359176,"d":"0.94"},{"v":0.8880718954248366,"d":"0.89"},{"v":0.5382585751978892,"d":"0.54"},{"v":0.9070446737451252,"d":"0.91"},{"v":0.8602373349638789,"d":"0.86"}]
[null,2011,{"v":40398.04195123256,"d":"40,398.04"},{"v":114943.99044749838,"d":"114,943.99"},{"v":0.9352698580978853,"d":"0.94"},{"v":0.8939641109298532,"d":"0.89"},{"v":0.5337396604266434,"d":"0.53"},{"v":0.9157717260562771,"d":"0.92"},{"v":0.8600036961136291,"d":"0.86"}]
[null,2010,{"v":36994.87392544054,"d":"36,994.87"},{"v":106330.1315754934,"d":"106,330.13"},{"v":0.8958344262172067,"d":"0.90"},{"v":0.8865414710485133,"d":"0.89"},{"v":0.5419847328244275,"d":"0.54"},{"v":0.9404711289721743,"d":"0.94"},{"v":0.8594604081526318,"d":"0.86"}]
[null,2009,{"v":34652.04213128779,"d":"34,652.04"},{"v":97056.832499663,"d":"97,056.83"},{"v":0.8977599929303669,"d":"0.90"},{"v":0.89937106918239,"d":"0.90"},{"v":0.539440203562341,"d":"0.54"},{"v":0.9534495830174374,"d":"0.95"},{"v":0.8597308583976998,"d":"0.86"}]
[null,2008,{"v":31633.69260067312,"d":"31,633.69"},{"v":88001.29525940574,"d":"88,001.30"},{"v":0.9016670011404683,"d":"0.90"},{"v":0.9074367088607594,"d":"0.91"},{"v":0.5290916701548766,"d":"0.53"},{"v":0.9668874440215071,"d":"0.97"},{"v":0.8587988637007444,"d":"0.86"}]
[null,2007,{"v":29610.792069232666,"d":"29,610.79"},{"v":87439.28215033017,"d":"87,439.28"},{"v":0.8550494748134141,"d":"0.86"},{"v":0.8735632183908046,"d":"0.87"},{"v":0.5324357405140759,"d":"0.53"},{"v":0.9928929765886287,"d":"0.99"},{"v":0.8576068037562404,"d":"0.86"}]
[null,2006,{"v":26306.96068475466,"d":"26,306.96"},{"v":81414.93649987619,"d":"81,414.94"},{"v":0.8466728728815381,"d":"0.85"},{"v":0.8289374529012811,"d":"0.83"},{"v":0.5411908646003263,"d":"0.54"},{"v":0.9946922701214238,"d":"0.99"},{"v":0.8552438888574713,"d":"0.86"}]
[null,2005,{"v":23451.71717507458,"d":"23,451.72"},{"v":73698.27330717478,"d":"73,698.27"},{"v":0.9163227678507583,"d":"0.92"},{"v":0.7709454265949269,"d":"0.77"},{"v":0.544579321892005,"d":"0.54"},{"v":0.971139000926017,"d":"0.97"},{"v":0.851731439856632,"d":"0.85"}]
[null,2004,{"v":21761.42520622664,"d":"21,761.43"},{"v":68985.68125494229,"d":"68,985.68"},{"v":0.9626684312548529,"d":"0.96"},0.75,{"v":0.5351397121083827,"d":"0.54"},{"v":0.9635719227706487,"d":"0.96"},{"v":0.8473036288629148,"d":"0.85"}]
[null,2003,{"v":19948.501076315773,"d":"19,948.50"},{"v":63030.203974625496,"d":"63,030.20"},{"v":1.024905456850599,"d":"1.02"},{"v":0.7396694214876033,"d":"0.74"},{"v":0.5300043802014893,"d":"0.53"},{"v":0.9349683060897029,"d":"0.93"},{"v":0.8424880266555062,"d":"0.84"}]
[null,2002,{"v":19218.547633588943,"d":"19,218.55"},{"v":60426.67871481813,"d":"60,426.68"},{"v":1.0052560981458407,"d":"1.01"},{"v":0.7399355877616747,"d":"0.74"},{"v":0.5449758666081614,"d":"0.54"},{"v":0.9374858595540052,"d":"0.94"},{"v":0.8369108759821172,"d":"0.84"}]
[]
[null,"Wskaźniki dla Polski","WDB per capita","WDB na 1 pracującego","Współczynnik dojazdów netto","Udział pracujących wśród aktwnych zawodowo","Współczynnik aktywności zawodowej","Wskaźnik różnicy w metodologii BAEL/demo","Wskaźnik struktury wiekowej"]
[null,null,"WDB/N","WDB/Pp","Pp/Pz","Pz/Az","Az/NB15+","NB15+/N15+","Ni15+/N"]
[null,2013]
[null,2012,{"v":37159.367019159195,"d":"37,159.37"},{"v":103021.84428620567,"d":"103,021.84"},{"v":0.8914586596331832,"d":"0.89"},{"v":0.8990830978605616,"d":"0.90"},{"v":0.5587382394638485,"d":"0.56"},{"v":0.948049565800569,"d":"0.95"},{"v":0.8495687067956471,"d":"0.85"}]
[null,2011,{"v":35435.31476501895,"d":"35,435.31"},{"v":97927.9075330495,"d":"97,927.91"},{"v":0.8961044185399302,"d":"0.90"},{"v":0.9037690922817817,"d":"0.90"},{"v":0.5553620383809063,"d":"0.56"},{"v":0.9476009238535954,"d":"0.95"},{"v":0.8490085238774671,"d":"0.85"}]
[null,2010,{"v":32855.1622785296,"d":"32,855.16"},{"v":91511.90221834507,"d":"91,511.90"},{"v":0.894023648386617,"d":"0.89"},{"v":0.9037967289719626,"d":"0.90"},{"v":0.553025163937074,"d":"0.55"},{"v":0.947447672621434,"d":"0.95"},{"v":0.8480200787617584,"d":"0.85"}]
[null,2009,{"v":31695.720703955994,"d":"31,695.72"},{"v":86036.75934332129,"d":"86,036.76"},{"v":0.8861628392252514,"d":"0.89"},{"v":0.9182291666666667,"d":"0.92"},{"v":0.5493212957370378,"d":"0.55"},{"v":0.9713581957224544,"d":"0.97"},{"v":0.8484888214210641,"d":"0.85"}]
[null,2008,{"v":29239.448964014882,"d":"29,239.45"},{"v":78678.77615084611,"d":"78,678.78"},{"v":0.8969345258052793,"d":"0.90"},{"v":0.9288695549938275,"d":"0.93"},{"v":0.5421487076521019,"d":"0.54"},{"v":0.971230624139413,"d":"0.97"},{"v":0.8471402623608278,"d":"0.85"}]
[null,2007,{"v":27171.365162139078,"d":"27,171.37"},{"v":76006.04378494697,"d":"76,006.04"},{"v":0.8940907305328947,"d":"0.89"},{"v":0.9040218293985052,"d":"0.90"},{"v":0.5369815888386316,"d":"0.54"},{"v":0.9745221468802983,"d":"0.97"},{"v":0.8451848678079427,"d":"0.85"}]
[null,2006,{"v":24472.190893654082,"d":"24,472.19"},{"v":70835.15608526816,"d":"70,835.16"},{"v":0.9025987396677198,"d":"0.90"},{"v":0.861604770620535,"d":"0.86"},{"v":0.5399623808461121,"d":"0.54"},{"v":0.9770701719044806,"d":"0.98"},{"v":0.8420384436350294,"d":"0.84"}]
[null,2005,{"v":22664.19669966668,"d":"22,664.20"},{"v":66423.04500115244,"d":"66,423.05"},{"v":0.9223266302980426,"d":"0.92"},{"v":0.8225627877163335,"d":"0.82"},{"v":0.548958766514187,"d":"0.55"},{"v":0.9778878048841524,"d":"0.98"},{"v":0.8377973614577959,"d":"0.84"}]
[null,2004,{"v":21469.941387864226,"d":"21,469.94"},{"v":63501.40272195254,"d":"63,501.40"},{"v":0.9355352293910284,"d":"0.94"},{"v":0.8103853383458647,"d":"0.81"},{"v":0.546973396735638,"d":"0.55"},{"v":0.9788468565096178,"d":"0.98"},{"v":0.832942197188205,"d":"0.83"}]
[null,2003,{"v":19513.043625804545,"d":"19,513.04"},{"v":57522.261911714486,"d":"57,522.26"},{"v":0.9514721701809001,"d":"0.95"},{"v":0.8034460376467811,"d":"0.80"},{"v":0.5475605815831988,"d":"0.55"},{"v":0.9791069955787072,"d":"0.98"},{"v":0.8277018527696652,"d":"0.83"}]
[null,2002,{"v":18707.364759781063,"d":"18,707.36"},{"v":54906.63952641513,"d":"54,906.64"},{"v":0.9448209066318307,"d":"0.94"},{"v":0.8006739092546331,"d":"0.80"},{"v":0.554131925441844,"d":"0.55"},{"v":0.9888182334478789,"d":"0.99"},{"v":0.821964271729858,"d":"0.82"}]

{"sheet":"Opolskie","index":26,"n_rows":46,"n_cols":9,"rows_kept":46,"hidden":true,"merged":[[0,0,0,9],[1,0,1,9],[2,1,3,1],[17,1,18,1],[32,1,33,1]]}
["DEKOMPOZYCJA RÓŻNIC W POZIOMIE WDB PER CAPITA"]
["OPOLSKIE"]
[null,"Różnice względem średniej","WDB per capita","WDB na 1 pracującego","Współczynnik dojazdów netto","Udział pracujących wśród aktwnych zawodowo","Współczynnik aktywności zawodowej","Wskaźnik różnicy w metodologii BAEL/demo","Wskaźnik struktury wiekowej"]
[null,null,"WDB_i/N_i","WDB_i/Pp_i","Pp_i/Pz_i","Pz_i/Az_i","Az_i/NB15+_i","NB15+_i/N15+_i*(N15+/NB15+)","Ni15+_i/N_i"]
[null,2013]
[null,2012,{"$f":"(C21-C36)/C36","v":{"v":-0.1902181299788661,"d":"-19.0%"}},{"$f":"(D21-D36)/D36","v":{"v":-0.04565659435170732,"d":"-4.6%"}},{"v":-0.03926723230734386,"d":"-3.9%"},{"v":0.006316220285818198,"d":"0.6%"},{"v":-0.02709946831837807,"d":"-2.7%"},{"v":-0.11526079378212765,"d":"-11.5%"},{"v":0.019629946634231153,"d":"2.0%"}]
[null,2011,{"$f":"(C22-C37)/C37","v":{"v":-0.18042590668922368,"d":"-18.0%"}},{"v":-0.04081238269168475,"d":"-4.1%"},{"v":-0.02550873506539197,"d":"-2.6%"},{"v":5.6764896212668314E-4,"d":"0.1%"},{"v":-0.036591638804310864,"d":"-3.7%"},{"v":-0.10739765529082983,"d":"-10.7%"},{"v":0.019041372435146486,"d":"1.9%"}]
[null,2010,{"v":-0.17685014855176265,"d":"-17.7%"},{"v":-0.03589641207134703,"d":"-3.6%"},{"v":-0.03916356526581392,"d":"-3.9%"},{"v":0.004097460091772738,"d":"0.4%"},{"v":-0.03817235036786641,"d":"-3.8%"},{"v":-0.09620658130071864,"d":"-9.6%"},{"v":0.018036716078876452,"d":"1.8%"}]
[null,2009,{"v":-0.17573816040546197,"d":"-17.6%"},{"v":-0.03432318872143794,"d":"-3.4%"},{"v":-0.04966825190610606,"d":"-5.0%"},{"v":-0.020361427261305833,"d":"-2.0%"},{"v":-0.022404909614758967,"d":"-2.2%"},{"v":-0.07942970897029114,"d":"-7.9%"},{"v":0.018770378906441013,"d":"1.9%"}]
[null,2008,{"v":-0.13671409427387946,"d":"-13.7%"},{"v":2.222687262833198E-3,"d":"0.2%"},{"v":-0.042370148158587084,"d":"-4.2%"},{"v":0.006025027296416708,"d":"0.6%"},{"v":-0.0559762754899917,"d":"-5.6%"},{"v":-0.06909694114729023,"d":"-6.9%"},{"v":0.017411387176722696,"d":"1.7%"}]
[null,2007,{"v":-0.15678631547192554,"d":"-15.7%"},{"v":-0.012103955858655582,"d":"-1.2%"},{"v":-0.030314540030068584,"d":"-3.0%"},{"v":0.004356498348154263,"d":"0.4%"},{"v":-0.047545777527420355,"d":"-4.8%"},{"v":-0.0944172337267111,"d":"-9.4%"},{"v":0.016097450586036607,"d":"1.6%"}]
[null,2006,{"v":-0.18042491868100952,"d":"-18.0%"},{"v":-0.03865255218792788,"d":"-3.9%"},{"v":-0.04224943657954197,"d":"-4.2%"},{"v":0.0049313653555914,"d":"0.5%"},{"v":-0.02150495255613735,"d":"-2.2%"},{"v":-0.10802683231806882,"d":"-10.8%"},{"v":0.014866993688701756,"d":"1.5%"}]
[null,2005,{"v":-0.16440025867494973,"d":"-16.4%"},{"v":-0.015174298945934252,"d":"-1.5%"},{"v":-0.06333545768740527,"d":"-6.3%"},{"v":0.006403646070028982,"d":"0.6%"},{"v":-0.01733930402876616,"d":"-1.7%"},{"v":-0.09599223773873342,"d":"-9.6%"},{"v":0.013227331037795746,"d":"1.3%"}]
[null,2004,{"v":-0.1423753079574497,"d":"-14.2%"},{"v":0.01358166788708607,"d":"1.4%"},{"v":-0.004490333973223697,"d":"-0.4%"},{"v":0.014187834804054946,"d":"1.4%"},{"v":-0.04200093984962395,"d":"-4.2%"},{"v":-0.13559015352963188,"d":"-13.6%"},{"v":0.012021788700154142,"d":"1.2%"}]
[null,2003,{"v":-0.20230207021543167,"d":"-20.2%"},{"v":-0.05696013644505846,"d":"-5.7%"},{"v":-0.005102472957880418,"d":"-0.5%"},{"v":0.018630105697825028,"d":"1.9%"},{"v":-0.07742088154756377,"d":"-7.7%"},{"v":-0.1045565752182964,"d":"-10.5%"},{"v":0.010349852065313869,"d":"1.0%"}]
[null,2002,{"v":-0.18563863870327538,"d":"-18.6%"},{"v":-0.043692981649344806,"d":"-4.4%"},{"v":-0.04731125658119434,"d":"-4.7%"},{"v":2.6764855567887797E-3,"d":"0.3%"},{"v":-0.03542032695226633,"d":"-3.5%"},{"v":-0.08381417719949481,"d":"-8.4%"},{"v":8.756346067997231E-3,"d":"0.9%"}]
[]
[null,"Wskaźniki","WDB per capita","WDB na 1 pracującego","Współczynnik dojazdów netto","Udział pracujących wśród aktwnych zawodowo","Współczynnik aktywności zawodowej","Wskaźnik różnicy w metodologii BAEL/demo","Wskaźnik struktury wiekowej"]
[null,null,"WDB_i/N_i","WDB_i/Pp_i","Pp_i/Pz_i","Pz_i/Az_i","Az_i/NB15+_i","NB15+_i/N15+_i","Ni15+_i/N_i"]
[null,2013]
[null,2012,{"v":30090.98171357638,"d":"30,090.98"},{"v":98318.21773226562,"d":"98,318.22"},{"v":0.8564535453529736,"d":"0.86"},{"v":0.9047619047619048,"d":"0.90"},{"v":0.5435967302452316,"d":"0.54"},{"v":0.838776620301594,"d":"0.84"},{"v":0.8662456951721584,"d":"0.87"}]
[null,2011,{"v":29041.86596972237,"d":"29,041.87"},{"v":93931.23629461476,"d":"93,931.24"},{"v":0.873245928336468,"d":"0.87"},{"v":0.9042821158690176,"d":"0.90"},{"v":0.5350404312668463,"d":"0.54"},{"v":0.8458308064802951,"d":"0.85"},{"v":0.8651748113812319,"d":"0.87"}]
[null,2010,{"v":27044.72194887937,"d":"27,044.72"},{"v":88226.95326688254,"d":"88,226.95"},{"v":0.8590104948838466,"d":"0.86"},{"v":0.9075,"d":"0.91"},{"v":0.5319148936170213,"d":"0.53"},{"v":0.8562969710772034,"d":"0.86"},{"v":0.8633155761515707,"d":"0.86"}]
[null,2009,{"v":26125.573054717453,"d":"26,125.57"},{"v":83083.70341539953,"d":"83,083.70"},{"v":0.8421486800967815,"d":"0.84"},{"v":0.8995327102803738,"d":"0.90"},{"v":0.5370138017565872,"d":"0.54"},{"v":0.8942034969303128,"d":"0.89"},{"v":0.864415278097017,"d":"0.86"}]
[null,2008,{"v":25242.004181832264,"d":"25,242.00"},{"v":78853.6544644519,"d":"78,853.65"},{"v":0.8589312770583576,"d":"0.86"},{"v":0.9344660194174758,"d":"0.93"},{"v":0.5118012422360249,"d":"0.51"},{"v":0.904121558862806,"d":"0.90"},{"v":0.8618901494617827,"d":"0.86"}]
[null,2007,{"v":22911.266932025053,"d":"22,911.27"},{"v":75086.06998598293,"d":"75,086.07"},{"v":0.866986781291642,"d":"0.87"},{"v":0.9079601990049752,"d":"0.91"},{"v":0.5114503816793893,"d":"0.51"},{"v":0.8825104615664449,"d":"0.88"},{"v":0.8587901894535469,"d":"0.86"}]
[null,2006,{"v":20056.797841720403,"d":"20,056.80"},{"v":68097.19651794231,"d":"68,097.20"},{"v":0.8644644514593539,"d":"0.86"},{"v":0.8658536585365854,"d":"0.87"},{"v":0.5283505154639175,"d":"0.53"},{"v":0.8715203762811686,"d":"0.87"},{"v":0.8545570238621957,"d":"0.85"}]
[null,2005,{"v":18938.196899581537,"d":"18,938.20"},{"v":65415.121859405706,"d":"65,415.12"},{"v":0.8639106510308339,"d":"0.86"},{"v":0.8278301886792453,"d":"0.83"},{"v":0.539440203562341,"d":"0.54"},{"v":0.8840181662359047,"d":"0.88"},{"v":0.84887918450039,"d":"0.85"}]
[null,2004,{"v":18413.151870938662,"d":"18,413.15"},{"v":64363.8576840862,"d":"64,363.86"},{"v":0.9313343637673462,"d":"0.93"},{"v":0.821882951653944,"d":"0.82"},{"v":0.524,"d":"0.52"},{"v":0.8461248609534812,"d":"0.85"},{"v":0.8429556522822437,"d":"0.84"}]
[null,2003,{"v":15565.514504100252,"d":"15,565.51"},{"v":54245.78602459484,"d":"54,245.79"},{"v":0.9466173091623763,"d":"0.95"},{"v":0.8184143222506394,"d":"0.82"},{"v":0.5051679586563308,"d":"0.51"},{"v":0.8767349213487219,"d":"0.88"},{"v":0.8362684445000175,"d":"0.84"}]
[null,2002,{"v":15234.55503204968,"d":"15,234.56"},{"v":52507.60473316028,"d":"52,507.60"},{"v":0.9001202422948955,"d":"0.90"},{"v":0.8028169014084507,"d":"0.80"},{"v":0.534504391468005,"d":"0.53"},{"v":0.9059412468115869,"d":"0.91"},{"v":0.8291616753486539,"d":"0.83"}]
[]
[null,"Wskaźniki dla Polski","WDB per capita","WDB na 1 pracującego","Współczynnik dojazdów netto","Udział pracujących wśród aktwnych zawodowo","Współczynnik aktywności zawodowej","Wskaźnik różnicy w metodologii BAEL/demo","Wskaźnik struktury wiekowej"]
[null,null,"WDB/N","WDB/Pp","Pp/Pz","Pz/Az","Az/NB15+","NB15+/N15+","Ni15+/N"]
[null,2013]
[null,2012,{"v":37159.367019159195,"d":"37,159.37"},{"v":103021.84428620567,"d":"103,021.84"},{"v":0.8914586596331832,"d":"0.89"},{"v":0.8990830978605616,"d":"0.90"},{"v":0.5587382394638485,"d":"0.56"},{"v":0.948049565800569,"d":"0.95"},{"v":0.8495687067956471,"d":"0.85"}]
[null,2011,{"v":35435.31476501895,"d":"35,435.31"},{"v":97927.9075330495,"d":"97,927.91"},{"v":0.8961044185399302,"d":"0.90"},{"v":0.9037690922817817,"d":"0.90"},{"v":0.5553620383809063,"d":"0.56"},{"v":0.9476009238535954,"d":"0.95"},{"v":0.8490085238774671,"d":"0.85"}]
[null,2010,{"v":32855.1622785296,"d":"32,855.16"},{"v":91511.90221834507,"d":"91,511.90"},{"v":0.894023648386617,"d":"0.89"},{"v":0.9037967289719626,"d":"0.90"},{"v":0.553025163937074,"d":"0.55"},{"v":0.947447672621434,"d":"0.95"},{"v":0.8480200787617584,"d":"0.85"}]
[null,2009,{"v":31695.720703955994,"d":"31,695.72"},{"v":86036.75934332129,"d":"86,036.76"},{"v":0.8861628392252514,"d":"0.89"},{"v":0.9182291666666667,"d":"0.92"},{"v":0.5493212957370378,"d":"0.55"},{"v":0.9713581957224544,"d":"0.97"},{"v":0.8484888214210641,"d":"0.85"}]
[null,2008,{"v":29239.448964014882,"d":"29,239.45"},{"v":78678.77615084611,"d":"78,678.78"},{"v":0.8969345258052793,"d":"0.90"},{"v":0.9288695549938275,"d":"0.93"},{"v":0.5421487076521019,"d":"0.54"},{"v":0.971230624139413,"d":"0.97"},{"v":0.8471402623608278,"d":"0.85"}]
[null,2007,{"v":27171.365162139078,"d":"27,171.37"},{"v":76006.04378494697,"d":"76,006.04"},{"v":0.8940907305328947,"d":"0.89"},{"v":0.9040218293985052,"d":"0.90"},{"v":0.5369815888386316,"d":"0.54"},{"v":0.9745221468802983,"d":"0.97"},{"v":0.8451848678079427,"d":"0.85"}]
[null,2006,{"v":24472.190893654082,"d":"24,472.19"},{"v":70835.15608526816,"d":"70,835.16"},{"v":0.9025987396677198,"d":"0.90"},{"v":0.861604770620535,"d":"0.86"},{"v":0.5399623808461121,"d":"0.54"},{"v":0.9770701719044806,"d":"0.98"},{"v":0.8420384436350294,"d":"0.84"}]
[null,2005,{"v":22664.19669966668,"d":"22,664.20"},{"v":66423.04500115244,"d":"66,423.05"},{"v":0.9223266302980426,"d":"0.92"},{"v":0.8225627877163335,"d":"0.82"},{"v":0.548958766514187,"d":"0.55"},{"v":0.9778878048841524,"d":"0.98"},{"v":0.8377973614577959,"d":"0.84"}]
[null,2004,{"v":21469.941387864226,"d":"21,469.94"},{"v":63501.40272195254,"d":"63,501.40"},{"v":0.9355352293910284,"d":"0.94"},{"v":0.8103853383458647,"d":"0.81"},{"v":0.546973396735638,"d":"0.55"},{"v":0.9788468565096178,"d":"0.98"},{"v":0.832942197188205,"d":"0.83"}]
[null,2003,{"v":19513.043625804545,"d":"19,513.04"},{"v":57522.261911714486,"d":"57,522.26"},{"v":0.9514721701809001,"d":"0.95"},{"v":0.8034460376467811,"d":"0.80"},{"v":0.5475605815831988,"d":"0.55"},{"v":0.9791069955787072,"d":"0.98"},{"v":0.8277018527696652,"d":"0.83"}]
[null,2002,{"v":18707.364759781063,"d":"18,707.36"},{"v":54906.63952641513,"d":"54,906.64"},{"v":0.9448209066318307,"d":"0.94"},{"v":0.8006739092546331,"d":"0.80"},{"v":0.554131925441844,"d":"0.55"},{"v":0.9888182334478789,"d":"0.99"},{"v":0.821964271729858,"d":"0.82"}]

{"sheet":"Kujawsko-Pomorskie","index":27,"n_rows":46,"n_cols":9,"rows_kept":46,"hidden":true,"merged":[[0,0,0,9],[1,0,1,9],[2,1,3,1],[17,1,18,1],[32,1,33,1]]}
["DEKOMPOZYCJA RÓŻNIC W POZIOMIE WDB PER CAPITA"]
["KUJAWSKO-POMORSKIE"]
[null,"Różnice względem średniej","WDB per capita","WDB na 1 pracującego","Współczynnik dojazdów netto","Udział pracujących wśród aktwnych zawodowo","Współczynnik aktywności zawodowej","Wskaźnik różnicy w metodologii BAEL/demo","Wskaźnik struktury wiekowej"]
[null,null,"WDB_i/N_i","WDB_i/Pp_i","Pp_i/Pz_i","Pz_i/Az_i","Az_i/NB15+_i","NB15+_i/N15+_i*(N15+/NB15+)","Ni15+_i/N_i"]
[null,2013]
[null,2012,{"$f":"(C21-C36)/C36","v":{"v":-0.18637805865234072,"d":"-18.6%"}},{"$f":"(D21-D36)/D36","v":{"v":-0.10742757590922704,"d":"-10.7%"}},{"v":-0.022502935198006724,"d":"-2.3%"},{"v":-0.02028374544791196,"d":"-2.0%"},{"v":0.007644303939112415,"d":"0.8%"},{"v":-0.052421753171193776,"d":"-5.2%"},{"v":-3.1241508279255563E-3,"d":"-0.3%"}]
[null,2011,{"$f":"(C22-C37)/C37","v":{"v":-0.18214170105809618,"d":"-18.2%"}},{"v":-0.10769555833482752,"d":"-10.8%"},{"v":0.01920913756932224,"d":"1.9%"},{"v":-0.0150283700891339,"d":"-1.5%"},{"v":-0.023852504566126146,"d":"-2.4%"},{"v":-0.06109336913630808,"d":"-6.1%"},{"v":-3.8146991226529164E-3,"d":"-0.4%"}]
[null,2010,{"v":-0.1693386426028342,"d":"-16.9%"},{"v":-0.09639873269071014,"d":"-9.6%"},{"v":-0.004142393745222533,"d":"-0.4%"},{"v":-0.012829095014280532,"d":"-1.3%"},{"v":-0.016968967767497158,"d":"-1.7%"},{"v":-0.0442927290380667,"d":"-4.4%"},{"v":-0.004673730510654611,"d":"-0.5%"}]
[null,2009,{"v":-0.1604590437017271,"d":"-16.0%"},{"v":-0.10001319259210896,"d":"-10.0%"},{"v":-0.03326238341631097,"d":"-3.3%"},{"v":-0.02279590992012993,"d":"-2.3%"},{"v":-2.4312069400561544E-3,"d":"-0.2%"},{"v":-0.004162118837261273,"d":"-0.4%"},{"v":-0.006013803486808486,"d":"-0.6%"}]
[null,2008,{"v":-0.1412521872079187,"d":"-14.1%"},{"v":-0.09421247525740734,"d":"-9.4%"},{"v":0.10971737969275476,"d":"11.0%"},{"v":-0.023476232858068078,"d":"-2.3%"},{"v":-0.032170685242372425,"d":"-3.2%"},{"v":-0.08994739038686415,"d":"-9.0%"},{"v":-6.7036681125082695E-3,"d":"-0.7%"}]
[null,2007,{"v":-0.13683241701561216,"d":"-13.7%"},{"v":-0.08531273220187989,"d":"-8.5%"},{"v":0.052070695477879216,"d":"5.2%"},{"v":-0.018358715639586954,"d":"-1.8%"},{"v":-0.03953790228754507,"d":"-4.0%"},{"v":-0.04173042540071057,"d":"-4.2%"},{"v":-0.00721131584341168,"d":"-0.7%"}]
[null,2006,{"v":-0.13428534971412864,"d":"-13.4%"},{"v":-0.07978986265400131,"d":"-8.0%"},{"v":0.02350722990072457,"d":"2.4%"},{"v":-0.02678853072261113,"d":"-2.7%"},{"v":-0.022127031342129965,"d":"-2.2%"},{"v":-0.02690653277940838,"d":"-2.7%"},{"v":-7.44947720033987E-3,"d":"-0.7%"}]
[null,2005,{"v":-0.1351734023605202,"d":"-13.5%"},{"v":-0.07915280756332171,"d":"-7.9%"},{"v":-0.028930722163196813,"d":"-2.9%"},{"v":-0.02742986681779531,"d":"-2.7%"},{"v":0.01567700906133132,"d":"1.6%"},{"v":-0.01333361987711388,"d":"-1.3%"},{"v":-0.007696839783148875,"d":"-0.8%"}]
[null,2004,{"v":-0.1192057869839847,"d":"-11.9%"},{"v":-0.06250865977903537,"d":"-6.3%"},{"v":-0.08201019256218821,"d":"-8.2%"},{"v":-0.03870126173707191,"d":"-3.9%"},{"v":0.028844765926277185,"d":"2.9%"},{"v":0.04333922804461022,"d":"4.3%"},{"v":-0.00817382082023516,"d":"-0.8%"}]
[null,2003,{"v":-0.11093203861194063,"d":"-11.1%"},{"v":-0.060595612813912764,"d":"-6.1%"},{"v":-0.09956161928794557,"d":"-10.0%"},{"v":-0.027626046562867202,"d":"-2.8%"},{"v":0.016650775703508678,"d":"1.7%"},{"v":0.07207341786736965,"d":"7.2%"},{"v":-0.008257929774836017,"d":"-0.8%"}]
[null,2002,{"v":-0.10177683312967142,"d":"-10.2%"},{"v":-0.05372843543878144,"d":"-5.4%"},{"v":-0.10796571014871664,"d":"-10.8%"},{"v":-0.018153826701782002,"d":"-1.8%"},{"v":3.6808776048894104E-4,"d":"0.0%"},{"v":0.09209766561364381,"d":"9.2%"},{"v":-0.007976058100700956,"d":"-0.8%"}]
[]
[null,"Wskaźniki","WDB per capita","WDB na 1 pracującego","Współczynnik dojazdów netto","Udział pracujących wśród aktwnych zawodowo","Współczynnik aktywności zawodowej","Wskaźnik różnicy w metodologii BAEL/demo","Wskaźnik struktury wiekowej"]
[null,null,"WDB_i/N_i","WDB_i/Pp_i","Pp_i/Pz_i","Pz_i/Az_i","Az_i/NB15+_i","NB15+_i/N15+_i","Ni15+_i/N_i"]
[null,2013]
[null,2012,{"v":30233.676333378487,"d":"30,233.68"},{"v":91954.45728884074,"d":"91,954.46"},{"v":0.8713982231837557,"d":"0.87"},{"v":0.8808463251670379,"d":"0.88"},{"v":0.5630094043887147,"d":"0.56"},{"v":0.8983511454681141,"d":"0.90"},{"v":0.8469145260169318,"d":"0.85"}]
[null,2011,{"v":28981.066256189326,"d":"28,981.07"},{"v":87381.50685471637,"d":"87,381.51"},{"v":0.9133178115921412,"d":"0.91"},{"v":0.8901869158878505,"d":"0.89"},{"v":0.5421152628245726,"d":"0.54"},{"v":0.8897087908187011,"d":"0.89"},{"v":0.8457698118063068,"d":"0.85"}]
[null,2010,{"v":27291.513695787555,"d":"27,291.51"},{"v":82690.27081838042,"d":"82,690.27"},{"v":0.8903202504174592,"d":"0.89"},{"v":0.8922018348623854,"d":"0.89"},{"v":0.543640897755611,"d":"0.54"},{"v":0.9054826295802659,"d":"0.91"},{"v":0.8440566614460019,"d":"0.84"}]
[null,2009,{"v":26609.855670362183,"d":"26,609.86"},{"v":77431.94836111677,"d":"77,431.95"},{"v":0.8566869510976544,"d":"0.86"},{"v":0.8972972972972973,"d":"0.90"},{"v":0.5479857819905213,"d":"0.55"},{"v":0.9673152874783099,"d":"0.97"},{"v":0.8433861763882841,"d":"0.84"}]
[null,2008,{"v":25109.312845093467,"d":"25,109.31"},{"v":71266.25389945143,"d":"71,266.25"},{"v":0.9953438317325981,"d":"1.00"},{"v":0.9070631970260223,"d":"0.91"},{"v":0.5247074122236671,"d":"0.52"},{"v":0.8838709640342675,"d":"0.88"},{"v":0.8414613151972177,"d":"0.84"}]
[null,2007,{"v":23453.441593389787,"d":"23,453.44"},{"v":69521.76052579744,"d":"69,521.76"},{"v":0.9406466566920676,"d":"0.94"},{"v":0.8874251497005988,"d":"0.89"},{"v":0.515750463248919,"d":"0.52"},{"v":0.9338549231285697,"d":"0.93"},{"v":0.8390899727801074,"d":"0.84"}]
[null,2006,{"v":21185.93418122883,"d":"21,185.93"},{"v":65183.228710149866,"d":"65,183.23"},{"v":0.9238163357491931,"d":"0.92"},{"v":0.8385236447520185,"d":"0.84"},{"v":0.5280146163215591,"d":"0.53"},{"v":0.9507806012963506,"d":"0.95"},{"v":0.8357656974473606,"d":"0.84"}]
[null,2005,{"v":19600.600120004663,"d":"19,600.60"},{"v":61165.47450240636,"d":"61,165.47"},{"v":0.8956430548131724,"d":"0.90"},{"v":0.8,"d":"0.80"},{"v":0.5575647980711271,"d":"0.56"},{"v":0.9648490206113618,"d":"0.96"},{"v":0.8313489693959104,"d":"0.83"}]
[null,2004,{"v":18910.600128223847,"d":"18,910.60"},{"v":59532.015143714496,"d":"59,532.02"},{"v":0.8588118050799592,"d":"0.86"},{"v":0.7790224032586558,"d":"0.78"},{"v":0.5627507163323783,"d":"0.56"},{"v":1.021269323644638,"d":"1.02"},{"v":0.8261338769147756,"d":"0.83"}]
[null,2003,{"v":17348.421916870313,"d":"17,348.42"},{"v":54036.66520073175,"d":"54,036.67"},{"v":0.856742060210274,"d":"0.86"},{"v":0.78125,"d":"0.78"},{"v":0.5566778900112234,"d":"0.56"},{"v":1.0496745832079162,"d":"1.05"},{"v":0.8208667489949917,"d":"0.82"}]
[null,2002,{"v":16803.38841832893,"d":"16,803.39"},{"v":51956.59168945969,"d":"51,956.59"},{"v":0.8428126464839708,"d":"0.84"},{"v":0.7861386138613862,"d":"0.79"},{"v":0.5543358946212953,"d":"0.55"},{"v":1.0798860844646356,"d":"1.08"},{"v":0.8154082369418403,"d":"0.82"}]
[]
[null,"Wskaźniki dla Polski","WDB per capita","WDB na 1 pracującego","Współczynnik dojazdów netto","Udział pracujących wśród aktwnych zawodowo","Współczynnik aktywności zawodowej","Wskaźnik różnicy w metodologii BAEL/demo","Wskaźnik struktury wiekowej"]
[null,null,"WDB/N","WDB/Pp","Pp/Pz","Pz/Az","Az/NB15+","NB15+/N15+","Ni15+/N"]
[null,2013]
[null,2012,{"v":37159.367019159195,"d":"37,159.37"},{"v":103021.84428620567,"d":"103,021.84"},{"v":0.8914586596331832,"d":"0.89"},{"v":0.8990830978605616,"d":"0.90"},{"v":0.5587382394638485,"d":"0.56"},{"v":0.948049565800569,"d":"0.95"},{"v":0.8495687067956471,"d":"0.85"}]
[null,2011,{"v":35435.31476501895,"d":"35,435.31"},{"v":97927.9075330495,"d":"97,927.91"},{"v":0.8961044185399302,"d":"0.90"},{"v":0.9037690922817817,"d":"0.90"},{"v":0.5553620383809063,"d":"0.56"},{"v":0.9476009238535954,"d":"0.95"},{"v":0.8490085238774671,"d":"0.85"}]
[null,2010,{"v":32855.1622785296,"d":"32,855.16"},{"v":91511.90221834507,"d":"91,511.90"},{"v":0.894023648386617,"d":"0.89"},{"v":0.9037967289719626,"d":"0.90"},{"v":0.553025163937074,"d":"0.55"},{"v":0.947447672621434,"d":"0.95"},{"v":0.8480200787617584,"d":"0.85"}]
[null,2009,{"v":31695.720703955994,"d":"31,695.72"},{"v":86036.75934332129,"d":"86,036.76"},{"v":0.8861628392252514,"d":"0.89"},{"v":0.9182291666666667,"d":"0.92"},{"v":0.5493212957370378,"d":"0.55"},{"v":0.9713581957224544,"d":"0.97"},{"v":0.8484888214210641,"d":"0.85"}]
[null,2008,{"v":29239.448964014882,"d":"29,239.45"},{"v":78678.77615084611,"d":"78,678.78"},{"v":0.8969345258052793,"d":"0.90"},{"v":0.9288695549938275,"d":"0.93"},{"v":0.5421487076521019,"d":"0.54"},{"v":0.971230624139413,"d":"0.97"},{"v":0.8471402623608278,"d":"0.85"}]
[null,2007,{"v":27171.365162139078,"d":"27,171.37"},{"v":76006.04378494697,"d":"76,006.04"},{"v":0.8940907305328947,"d":"0.89"},{"v":0.9040218293985052,"d":"0.90"},{"v":0.5369815888386316,"d":"0.54"},{"v":0.9745221468802983,"d":"0.97"},{"v":0.8451848678079427,"d":"0.85"}]
[null,2006,{"v":24472.190893654082,"d":"24,472.19"},{"v":70835.15608526816,"d":"70,835.16"},{"v":0.9025987396677198,"d":"0.90"},{"v":0.861604770620535,"d":"0.86"},{"v":0.5399623808461121,"d":"0.54"},{"v":0.9770701719044806,"d":"0.98"},{"v":0.8420384436350294,"d":"0.84"}]
[null,2005,{"v":22664.19669966668,"d":"22,664.20"},{"v":66423.04500115244,"d":"66,423.05"},{"v":0.9223266302980426,"d":"0.92"},{"v":0.8225627877163335,"d":"0.82"},{"v":0.548958766514187,"d":"0.55"},{"v":0.9778878048841524,"d":"0.98"},{"v":0.8377973614577959,"d":"0.84"}]
[null,2004,{"v":21469.941387864226,"d":"21,469.94"},{"v":63501.40272195254,"d":"63,501.40"},{"v":0.9355352293910284,"d":"0.94"},{"v":0.8103853383458647,"d":"0.81"},{"v":0.546973396735638,"d":"0.55"},{"v":0.9788468565096178,"d":"0.98"},{"v":0.832942197188205,"d":"0.83"}]
[null,2003,{"v":19513.043625804545,"d":"19,513.04"},{"v":57522.261911714486,"d":"57,522.26"},{"v":0.9514721701809001,"d":"0.95"},{"v":0.8034460376467811,"d":"0.80"},{"v":0.5475605815831988,"d":"0.55"},{"v":0.9791069955787072,"d":"0.98"},{"v":0.8277018527696652,"d":"0.83"}]
[null,2002,{"v":18707.364759781063,"d":"18,707.36"},{"v":54906.63952641513,"d":"54,906.64"},{"v":0.9448209066318307,"d":"0.94"},{"v":0.8006739092546331,"d":"0.80"},{"v":0.554131925441844,"d":"0.55"},{"v":0.9888182334478789,"d":"0.99"},{"v":0.821964271729858,"d":"0.82"}]

{"sheet":"Pomorskie","index":28,"n_rows":48,"n_cols":9,"rows_kept":48,"hidden":true,"merged":[[0,0,0,9],[1,0,1,9],[2,1,3,1],[17,1,18,1],[32,1,33,1]]}
["DEKOMPOZYCJA RÓŻNIC W POZIOMIE WDB PER CAPITA"]
["POMORSKIE"]
[null,"Różnice względem średniej","WDB per capita","WDB na 1 pracującego","Współczynnik dojazdów netto","Udział pracujących wśród aktwnych zawodowo","Współczynnik aktywności zawodowej","Wskaźnik różnicy w metodologii BAEL/demo","Wskaźnik struktury wiekowej"]
[null,null,"WDB_i/N_i","WDB_i/Pp_i","Pp_i/Pz_i","Pz_i/Az_i","Az_i/NB15+_i","NB15+_i/N15+_i*(N15+/NB15+)","Ni15+_i/N_i"]
[null,2013]
[null,2012,{"$f":"(C21-C36)/C36","v":{"v":-0.022651082112874796,"d":"-2.3%"}},{"$f":"(D21-D36)/D36","v":{"v":0.06706306333449187,"d":"6.7%"}},{"v":-0.012009150427322023,"d":"-1.2%"},{"v":0.005702952783150924,"d":"0.6%"},{"v":-0.006277322848918118,"d":"-0.6%"},{"v":-0.058116052727769874,"d":"-5.8%"},{"v":-0.015140437502619642,"d":"-1.5%"}]
[null,2011,{"$f":"(C22-C37)/C37","v":{"v":-0.04205000872119342,"d":"-4.2%"}},{"v":0.037046471227377906,"d":"3.7%"},{"v":0.06870665927693126,"d":"6.9%"},{"v":0.012471206983480507,"d":"1.2%"},{"v":-0.0191705418999715,"d":"-1.9%"},{"v":-0.1163401336696186,"d":"-11.6%"},{"v":-0.015025944976332199,"d":"-1.5%"}]
[null,2010,{"v":-0.041167116581311926,"d":"-4.1%"},{"v":0.026140048737216308,"d":"2.6%"},{"v":0.060701354145329005,"d":"6.1%"},{"v":1.8976413574877883E-3,"d":"0.2%"},{"v":0.004701117114486028,"d":"0.5%"},{"v":-0.11179879069652417,"d":"-11.2%"},{"v":-0.01469302027187441,"d":"-1.5%"}]
[null,2009,{"v":-0.0180321475328392,"d":"-1.8%"},{"v":0.05748126879223789,"d":"5.7%"},{"v":0.08974451458349078,"d":"9.0%"},{"v":0.021795336442012744,"d":"2.2%"},{"v":-0.04735824816426116,"d":"-4.7%"},{"v":-0.11071312800538564,"d":"-11.1%"},{"v":-0.015616135931452472,"d":"-1.6%"}]
[null,2008,{"v":-0.045014314859021964,"d":"-4.5%"},{"v":0.0412130268964934,"d":"4.1%"},{"v":0.05962585024777099,"d":"6.0%"},{"v":0.01897221845333917,"d":"1.9%"},{"v":-0.028048303994363782,"d":"-2.8%"},{"v":-0.11302472770500126,"d":"-11.3%"},{"v":-0.01465983472072399,"d":"-1.5%"}]
[null,2007,{"v":-0.015925678470578224,"d":"-1.6%"},{"v":0.07065430463542294,"d":"7.1%"},{"v":0.06350623646020304,"d":"6.4%"},{"v":1.3179335995322959E-3,"d":"0.1%"},{"v":-0.010856836145343473,"d":"-1.1%"},{"v":-0.1152793955664942,"d":"-11.5%"},{"v":-0.013717559855956579,"d":"-1.4%"}]
[null,2006,{"v":-0.013903987018860238,"d":"-1.4%"},{"v":0.07538762930752474,"d":"7.5%"},{"v":0.0986074996640148,"d":"9.9%"},{"v":0.005018413097856721,"d":"0.5%"},{"v":-0.022932869863149293,"d":"-2.3%"},{"v":-0.13890703252970177,"d":"-13.9%"},{"v":-0.012895474681052507,"d":"-1.3%"}]
[null,2005,{"v":-0.011848886772585073,"d":"-1.2%"},{"v":0.07939953917236535,"d":"7.9%"},{"v":0.07158556470757789,"d":"7.2%"},{"v":-0.011789119061941186,"d":"-1.2%"},{"v":-0.02412654940188295,"d":"-2.4%"},{"v":-0.10285883715157076,"d":"-10.3%"},{"v":-0.012560801528348528,"d":"-1.3%"}]
[null,2004,{"v":-0.01842510362822091,"d":"-1.8%"},{"v":0.07234207161752654,"d":"7.2%"},{"v":0.06736588449806333,"d":"6.7%"},{"v":-0.013975337799508724,"d":"-1.4%"},{"v":-0.028210898498588693,"d":"-2.8%"},{"v":-0.09385451348448999,"d":"-9.4%"},{"v":-0.012313661482362341,"d":"-1.2%"}]
[null,2003,{"v":-0.008041037397544557,"d":"-0.8%"},{"v":0.07945016865517943,"d":"7.9%"},{"v":0.046942906203201316,"d":"4.7%"},{"v":-0.01093099492612753,"d":"-1.1%"},{"v":-0.013624667676153362,"d":"-1.4%"},{"v":-0.08947430782269072,"d":"-8.9%"},{"v":-0.011885872114188768,"d":"-1.2%"}]
[null,2002,{"v":3.0336503651890194E-3,"d":"0.3%"},{"v":0.08497161361498752,"d":"8.5%"},{"v":0.02387285184721999,"d":"2.4%"},{"v":-0.020946020863222708,"d":"-2.1%"},{"v":0.003552631199317091,"d":"0.4%"},{"v":-0.06994474492053739,"d":"-7.0%"},{"v":-0.011912152544517126,"d":"-1.2%"}]
[]
[null,"Wskaźniki","WDB per capita","WDB na 1 pracującego","Współczynnik dojazdów netto","Udział pracujących wśród aktwnych zawodowo","Współczynnik aktywności zawodowej","Wskaźnik różnicy w metodologii BAEL/demo","Wskaźnik struktury wiekowej"]
[null,null,"WDB_i/N_i","WDB_i/Pp_i","Pp_i/Pz_i","Pz_i/Az_i","Az_i/NB15+_i","NB15+_i/N15+_i","Ni15+_i/N_i"]
[null,2013]
[null,2012,{"v":36317.66714554577,"d":"36,317.67"},{"v":109930.80475440764,"d":"109,930.80"},{"v":0.8807529984899094,"d":"0.88"},{"v":0.9042105263157895,"d":"0.90"},{"v":0.5552308591466978,"d":"0.56"},{"v":0.8929526672459638,"d":"0.89"},{"v":0.8367058648862262,"d":"0.84"}]
[null,2011,{"v":33945.25947011167,"d":"33,945.26"},{"v":101555.79094182994,"d":"101,555.79"},{"v":0.9576727595011058,"d":"0.96"},{"v":0.9150401836969001,"d":"0.92"},{"v":0.5447154471544715,"d":"0.54"},{"v":0.837356905707014,"d":"0.84"},{"v":0.8362513685132472,"d":"0.84"}]
[null,2010,{"v":31502.60998271145,"d":"31,502.61"},{"v":93904.02780236799,"d":"93,904.03"},{"v":0.9482920944816321,"d":"0.95"},{"v":0.905511811023622,"d":"0.91"},{"v":0.555625,"d":"0.56"},{"v":0.8415241685741214,"d":"0.84"},{"v":0.8355601025535554,"d":"0.84"}]
[null,2009,{"v":31124.178792062594,"d":"31,124.18"},{"v":90982.26143314783,"d":"90,982.26"},{"v":0.9656910930734496,"d":"0.97"},{"v":0.9382422802850356,"d":"0.94"},{"v":0.5233064014916097,"d":"0.52"},{"v":0.8638160914603539,"d":"0.86"},{"v":0.8352387046494348,"d":"0.84"}]
[null,2008,{"v":27923.255202044413,"d":"27,923.26"},{"v":81921.36666853412,"d":"81,921.37"},{"v":0.9504150095230004,"d":"0.95"},{"v":0.9464922711058263,"d":"0.95"},{"v":0.5269423558897243,"d":"0.53"},{"v":0.8614575473072974,"d":"0.86"},{"v":0.8347213261293474,"d":"0.83"}]
[null,2007,{"v":26738.64273696018,"d":"26,738.64"},{"v":81376.19795666191,"d":"81,376.20"},{"v":0.9508710678829924,"d":"0.95"},{"v":0.9052132701421801,"d":"0.91"},{"v":0.5311516677155443,"d":"0.53"},{"v":0.8621798228217752,"d":"0.86"},{"v":0.8335909937944385,"d":"0.83"}]
[null,2006,{"v":24131.929869145646,"d":"24,131.93"},{"v":76175.25057416501,"d":"76,175.25"},{"v":0.9916017445862446,"d":"0.99"},{"v":0.8659286592865929,"d":"0.87"},{"v":0.527579493835172,"d":"0.53"},{"v":0.8413482537519437,"d":"0.84"},{"v":0.8311799582046611,"d":"0.83"}]
[null,2005,{"v":22395.651199180735,"d":"22,395.65"},{"v":71697.00416466923,"d":"71,697.00"},{"v":0.9883519029727654,"d":"0.99"},{"v":0.8128654970760234,"d":"0.81"},{"v":0.5357142857142857,"d":"0.54"},{"v":0.8773034024090663,"d":"0.88"},{"v":0.8272739550795505,"d":"0.83"}]
[null,2004,{"v":21074.355492901,"d":"21,074.36"},{"v":68095.22574547742,"d":"68,095.23"},{"v":0.9985583875980536,"d":"1.00"},{"v":0.799059929494712,"d":"0.80"},{"v":0.5315427857589007,"d":"0.53"},{"v":0.8869776610160852,"d":"0.89"},{"v":0.8226856289376543,"d":"0.82"}]
[null,2003,{"v":19356.138512269532,"d":"19,356.14"},{"v":62092.415322027606,"d":"62,092.42"},{"v":0.9961370390206585,"d":"1.00"},{"v":0.7946635730858469,"d":"0.79"},{"v":0.5401002506265664,"d":"0.54"},{"v":0.891502074864948,"d":"0.89"},{"v":0.8178638943989679,"d":"0.82"}]
[null,2002,{"v":18764.116363716297,"d":"18,764.12"},{"v":59572.14528515108,"d":"59,572.15"},{"v":0.9673764761580085,"d":"0.97"},{"v":0.7839029768467475,"d":"0.78"},{"v":0.5561005518087063,"d":"0.56"},{"v":0.9196555943365906,"d":"0.92"},{"v":0.812172907938869,"d":"0.81"}]
[]
[null,"Wskaźniki dla Polski","WDB per capita","WDB na 1 pracującego","Współczynnik dojazdów netto","Udział pracujących wśród aktwnych zawodowo","Współczynnik aktywności zawodowej","Wskaźnik różnicy w metodologii BAEL/demo","Wskaźnik struktury wiekowej"]
[null,null,"WDB/N","WDB/Pp","Pp/Pz","Pz/Az","Az/NB15+","NB15+/N15+","Ni15+/N"]
[null,2013]
[null,2012,{"v":37159.367019159195,"d":"37,159.37"},{"v":103021.84428620567,"d":"103,021.84"},{"v":0.8914586596331832,"d":"0.89"},{"v":0.8990830978605616,"d":"0.90"},{"v":0.5587382394638485,"d":"0.56"},{"v":0.948049565800569,"d":"0.95"},{"v":0.8495687067956471,"d":"0.85"}]
[null,2011,{"v":35435.31476501895,"d":"35,435.31"},{"v":97927.9075330495,"d":"97,927.91"},{"v":0.8961044185399302,"d":"0.90"},{"v":0.9037690922817817,"d":"0.90"},{"v":0.5553620383809063,"d":"0.56"},{"v":0.9476009238535954,"d":"0.95"},{"v":0.8490085238774671,"d":"0.85"}]
[null,2010,{"v":32855.1622785296,"d":"32,855.16"},{"v":91511.90221834507,"d":"91,511.90"},{"v":0.894023648386617,"d":"0.89"},{"v":0.9037967289719626,"d":"0.90"},{"v":0.553025163937074,"d":"0.55"},{"v":0.947447672621434,"d":"0.95"},{"v":0.8480200787617584,"d":"0.85"}]
[null,2009,{"v":31695.720703955994,"d":"31,695.72"},{"v":86036.75934332129,"d":"86,036.76"},{"v":0.8861628392252514,"d":"0.89"},{"v":0.9182291666666667,"d":"0.92"},{"v":0.5493212957370378,"d":"0.55"},{"v":0.9713581957224544,"d":"0.97"},{"v":0.8484888214210641,"d":"0.85"}]
[null,2008,{"v":29239.448964014882,"d":"29,239.45"},{"v":78678.77615084611,"d":"78,678.78"},{"v":0.8969345258052793,"d":"0.90"},{"v":0.9288695549938275,"d":"0.93"},{"v":0.5421487076521019,"d":"0.54"},{"v":0.971230624139413,"d":"0.97"},{"v":0.8471402623608278,"d":"0.85"}]
[null,2007,{"v":27171.365162139078,"d":"27,171.37"},{"v":76006.04378494697,"d":"76,006.04"},{"v":0.8940907305328947,"d":"0.89"},{"v":0.9040218293985052,"d":"0.90"},{"v":0.5369815888386316,"d":"0.54"},{"v":0.9745221468802983,"d":"0.97"},{"v":0.8451848678079427,"d":"0.85"}]
[null,2006,{"v":24472.190893654082,"d":"24,472.19"},{"v":70835.15608526816,"d":"70,835.16"},{"v":0.9025987396677198,"d":"0.90"},{"v":0.861604770620535,"d":"0.86"},{"v":0.5399623808461121,"d":"0.54"},{"v":0.9770701719044806,"d":"0.98"},{"v":0.8420384436350294,"d":"0.84"}]
[null,2005,{"v":22664.19669966668,"d":"22,664.20"},{"v":66423.04500115244,"d":"66,423.05"},{"v":0.9223266302980426,"d":"0.92"},{"v":0.8225627877163335,"d":"0.82"},{"v":0.548958766514187,"d":"0.55"},{"v":0.9778878048841524,"d":"0.98"},{"v":0.8377973614577959,"d":"0.84"}]
[null,2004,{"v":21469.941387864226,"d":"21,469.94"},{"v":63501.40272195254,"d":"63,501.40"},{"v":0.9355352293910284,"d":"0.94"},{"v":0.8103853383458647,"d":"0.81"},{"v":0.546973396735638,"d":"0.55"},{"v":0.9788468565096178,"d":"0.98"},{"v":0.832942197188205,"d":"0.83"}]
[null,2003,{"v":19513.043625804545,"d":"19,513.04"},{"v":57522.261911714486,"d":"57,522.26"},{"v":0.9514721701809001,"d":"0.95"},{"v":0.8034460376467811,"d":"0.80"},{"v":0.5475605815831988,"d":"0.55"},{"v":0.9791069955787072,"d":"0.98"},{"v":0.8277018527696652,"d":"0.83"}]
[null,2002,{"v":18707.364759781063,"d":"18,707.36"},{"v":54906.63952641513,"d":"54,906.64"},{"v":0.9448209066318307,"d":"0.94"},{"v":0.8006739092546331,"d":"0.80"},{"v":0.554131925441844,"d":"0.55"},{"v":0.9888182334478789,"d":"0.99"},{"v":0.821964271729858,"d":"0.82"}]
[]
[" "]

{"sheet":"Warmińsko-Mazurskie","index":29,"n_rows":46,"n_cols":9,"rows_kept":46,"hidden":true,"merged":[[0,0,0,9],[1,0,1,9],[2,1,3,1],[17,1,18,1],[32,1,33,1]]}
["DEKOMPOZYCJA RÓŻNIC W POZIOMIE WDB PER CAPITA"]
["WARMIŃSKO-MAZURSKIE"]
[null,"Różnice względem średniej","WDB per capita","WDB na 1 pracującego","Współczynnik dojazdów netto","Udział pracujących wśród aktwnych zawodowo","Współczynnik aktywności zawodowej","Wskaźnik różnicy w metodologii BAEL/demo","Wskaźnik struktury wiekowej"]
[null,null,"WDB_i/N_i","WDB_i/Pp_i","Pp_i/Pz_i","Pz_i/Az_i","Az_i/NB15+_i","NB15+_i/N15+_i*(N15+/NB15+)","Ni15+_i/N_i"]
[null,2013]
[null,2012,{"$f":"(C21-C36)/C36","v":{"v":-0.28244916742173864,"d":"-28.2%"}},{"$f":"(D21-D36)/D36","v":{"v":-0.11823411766709753,"d":"-11.8%"}},{"v":-0.05414950439117107,"d":"-5.4%"},{"v":-0.012858799728877778,"d":"-1.3%"},{"v":-0.07840185201759456,"d":"-7.8%"},{"v":-0.047004327756474236,"d":"-4.7%"},{"v":-7.649515945872618E-3,"d":"-0.8%"}]
[null,2011,{"$f":"(C22-C37)/C37","v":{"v":-0.27834285539641684,"d":"-27.8%"}},{"v":-0.12042703112598886,"d":"-12.0%"},{"v":-0.07628634574896045,"d":"-7.6%"},{"v":-9.1042995235462391E-4,"d":"-0.1%"},{"v":-0.06903055327104891,"d":"-6.9%"},{"v":-0.03648197982146208,"d":"-3.6%"},{"v":-0.008889714239347452,"d":"-0.9%"}]
[null,2010,{"v":-0.27282424184262266,"d":"-27.3%"},{"v":-0.11583161767386291,"d":"-11.6%"},{"v":-0.1254021978634421,"d":"-12.5%"},{"v":-9.2521097871672473E-4,"d":"-0.1%"},{"v":-0.04232798202481363,"d":"-4.2%"},{"v":-0.007106642711754142,"d":"-0.7%"},{"v":-0.010128940782836764,"d":"-1.0%"}]
[null,2009,{"v":-0.2627814501642948,"d":"-26.3%"},{"v":-0.09674351916241603,"d":"-9.7%"},{"v":-0.13991829397831473,"d":"-14.0%"},{"v":-0.003029758034392621,"d":"-0.3%"},{"v":-0.04474115353621534,"d":"-4.5%"},{"v":9.571430149680012E-3,"d":"1.0%"},{"v":-0.013027295659044943,"d":"-1.3%"}]
[null,2008,{"v":-0.2628483552984704,"d":"-26.3%"},{"v":-0.11179976869027358,"d":"-11.2%"},{"v":-0.12369565389423358,"d":"-12.4%"},{"v":-1.8487387209544775E-3,"d":"-0.2%"},{"v":-0.054256813153658115,"d":"-5.4%"},{"v":0.017215512832075227,"d":"1.7%"},{"v":-0.013701357387605513,"d":"-1.4%"}]
[null,2007,{"v":-0.2598820128389596,"d":"-26.0%"},{"v":-0.10882215466747211,"d":"-10.9%"},{"v":-0.12138971962978663,"d":"-12.1%"},{"v":-0.009593786241836022,"d":"-1.0%"},{"v":-0.04099121723334686,"d":"-4.1%"},{"v":0.010353391694883543,"d":"1.0%"},{"v":-0.015011743974488413,"d":"-1.5%"}]
[null,2006,{"v":-0.252927203135707,"d":"-25.3%"},{"v":-0.1023253845021957,"d":"-10.2%"},{"v":-0.10701567918565717,"d":"-10.7%"},{"v":-0.025151644884217114,"d":"-2.5%"},{"v":-0.04728318557546681,"d":"-4.7%"},{"v":0.01997595503063845,"d":"2.0%"},{"v":-0.016194337908753048,"d":"-1.6%"}]
[null,2005,{"v":-0.2462496418802614,"d":"-24.6%"},{"v":-0.08992662004691375,"d":"-9.0%"},{"v":-0.09186203173272234,"d":"-9.2%"},{"v":-0.034640024312556396,"d":"-3.5%"},{"v":-0.046784760553701336,"d":"-4.7%"},{"v":0.008820064809037164,"d":"0.9%"},{"v":-0.017561644353261376,"d":"-1.8%"}]
[null,2004,{"v":-0.2428215196365133,"d":"-24.3%"},{"v":-0.0737594906013987,"d":"-7.4%"},{"v":-0.09616260659160593,"d":"-9.6%"},{"v":-0.04114964476428341,"d":"-4.1%"},{"v":-0.022443299641452363,"d":"-2.2%"},{"v":-0.016389981780586888,"d":"-1.6%"},{"v":-0.019001252840559608,"d":"-1.9%"}]
[null,2003,{"v":-0.2329072418419312,"d":"-23.3%"},{"v":-0.057182798680037075,"d":"-5.7%"},{"v":-0.0969787980230593,"d":"-9.7%"},{"v":-0.05415704449770811,"d":"-5.4%"},{"v":-0.01599082030786348,"d":"-1.6%"},{"v":-0.011695739992862645,"d":"-1.2%"},{"v":-0.020479370157571213,"d":"-2.0%"}]
[null,2002,{"v":-0.246515573776584,"d":"-24.7%"},{"v":-0.0746206926806535,"d":"-7.5%"},{"v":-0.04891594279892297,"d":"-4.9%"},{"v":-0.0774103429642772,"d":"-7.7%"},{"v":-0.03202086807391698,"d":"-3.2%"},{"v":-0.0196285409238923,"d":"-2.0%"},{"v":-0.02215423542630265,"d":"-2.2%"}]
[]
[null,"Wskaźniki","WDB per capita","WDB na 1 pracującego","Współczynnik dojazdów netto","Udział pracujących wśród aktwnych zawodowo","Współczynnik aktywności zawodowej","Wskaźnik różnicy w metodologii BAEL/demo","Wskaźnik struktury wiekowej"]
[null,null,"WDB_i/N_i","WDB_i/Pp_i","Pp_i/Pz_i","Pz_i/Az_i","Az_i/NB15+_i","NB15+_i/N15+_i","Ni15+_i/N_i"]
[null,2013]
[null,2012,{"v":26663.734742678866,"d":"26,663.73"},{"v":90841.14742658903,"d":"90,841.15"},{"v":0.8431866150288286,"d":"0.84"},{"v":0.8875219683655536,"d":"0.89"},{"v":0.5149321266968325,"d":"0.51"},{"v":0.903487133280296,"d":"0.90"},{"v":0.8430699174258994,"d":"0.84"}]
[null,2011,{"v":25572.148071452764,"d":"25,572.15"},{"v":86134.74036446399,"d":"86,134.74"},{"v":0.8277438870400219,"d":"0.83"},{"v":0.902946273830156,"d":"0.90"},{"v":0.5170250896057348,"d":"0.52"},{"v":0.9130305660707697,"d":"0.91"},{"v":0.8414610807134262,"d":"0.84"}]
[null,2010,{"v":23891.477539273426,"d":"23,891.48"},{"v":80911.9305479818,"d":"80,911.93"},{"v":0.781911117937042,"d":"0.78"},{"v":0.9029605263157895,"d":"0.90"},{"v":0.5296167247386759,"d":"0.53"},{"v":0.9407145005240305,"d":"0.94"},{"v":0.839430533601324,"d":"0.84"}]
[null,2009,{"v":23366.673253367975,"d":"23,366.67"},{"v":77713.26046711851,"d":"77,713.26"},{"v":0.7621724465738746,"d":"0.76"},{"v":0.9154471544715447,"d":"0.92"},{"v":0.5247440273037542,"d":"0.52"},{"v":0.9806554828431311,"d":"0.98"},{"v":0.8374353066810173,"d":"0.84"}]
[null,2008,{"v":21553.907893990006,"d":"21,553.91"},{"v":69882.5071763477,"d":"69,882.51"},{"v":0.785987623135481,"d":"0.79"},{"v":0.9271523178807947,"d":"0.93"},{"v":0.5127334465195246,"d":"0.51"},{"v":0.9879508574121895,"d":"0.99"},{"v":0.8355332908687922,"d":"0.84"}]
[null,2007,{"v":20110.01609221999,"d":"20,110.02"},{"v":67734.90233251882,"d":"67,734.90"},{"v":0.7855573074299155,"d":"0.79"},{"v":0.8953488372093024,"d":"0.90"},{"v":0.5149700598802395,"d":"0.51"},{"v":0.9846117563822888,"d":"0.98"},{"v":0.832497168961298,"d":"0.83"}]
[null,2006,{"v":18282.508096319038,"d":"18,282.51"},{"v":63586.92150257005,"d":"63,586.92"},{"v":0.8060065225100606,"d":"0.81"},{"v":0.8399339933993399,"d":"0.84"},{"v":0.5144312393887945,"d":"0.51"},{"v":0.9965880817202227,"d":"1.00"},{"v":0.8284021885466433,"d":"0.83"}]
[null,2005,{"v":17083.14637886996,"d":"17,083.15"},{"v":60449.84507097475,"d":"60,449.85"},{"v":0.837599832117669,"d":"0.84"},{"v":0.7940691927512356,"d":"0.79"},{"v":0.5232758620689655,"d":"0.52"},{"v":0.9865128386991977,"d":"0.99"},{"v":0.8230842621557733,"d":"0.82"}]
[null,2004,{"v":16256.577593556163,"d":"16,256.58"},{"v":58817.571604707045,"d":"58,817.57"},{"v":0.8455717231745111,"d":"0.85"},{"v":0.7770382695507487,"d":"0.78"},{"v":0.5346975088967971,"d":"0.53"},{"v":0.9628035743654404,"d":"0.96"},{"v":0.8171152518978606,"d":"0.82"}]
[null,2003,{"v":14968.314454977131,"d":"14,968.31"},{"v":54232.97798919655,"d":"54,232.98"},{"v":0.8591995427643647,"d":"0.86"},{"v":0.7599337748344371,"d":"0.76"},{"v":0.5388046387154326,"d":"0.54"},{"v":0.9676556147332257,"d":"0.97"},{"v":0.8107510401466878,"d":"0.81"}]
[null,2002,{"v":14095.708002175787,"d":"14,095.71"},{"v":50809.46805218708,"d":"50,809.47"},{"v":0.8986041012078015,"d":"0.90"},{"v":0.7386934673366834,"d":"0.74"},{"v":0.5363881401617251,"d":"0.54"},{"v":0.9694091742863563,"d":"0.97"},{"v":0.8037542817419453,"d":"0.80"}]
[]
[null,"Wskaźniki dla Polski","WDB per capita","WDB na 1 pracującego","Współczynnik dojazdów netto","Udział pracujących wśród aktwnych zawodowo","Współczynnik aktywności zawodowej","Wskaźnik różnicy w metodologii BAEL/demo","Wskaźnik struktury wiekowej"]
[null,null,"WDB/N","WDB/Pp","Pp/Pz","Pz/Az","Az/NB15+","NB15+/N15+","Ni15+/N"]
[null,2013]
[null,2012,{"v":37159.367019159195,"d":"37,159.37"},{"v":103021.84428620567,"d":"103,021.84"},{"v":0.8914586596331832,"d":"0.89"},{"v":0.8990830978605616,"d":"0.90"},{"v":0.5587382394638485,"d":"0.56"},{"v":0.948049565800569,"d":"0.95"},{"v":0.8495687067956471,"d":"0.85"}]
[null,2011,{"v":35435.31476501895,"d":"35,435.31"},{"v":97927.9075330495,"d":"97,927.91"},{"v":0.8961044185399302,"d":"0.90"},{"v":0.9037690922817817,"d":"0.90"},{"v":0.5553620383809063,"d":"0.56"},{"v":0.9476009238535954,"d":"0.95"},{"v":0.8490085238774671,"d":"0.85"}]
[null,2010,{"v":32855.1622785296,"d":"32,855.16"},{"v":91511.90221834507,"d":"91,511.90"},{"v":0.894023648386617,"d":"0.89"},{"v":0.9037967289719626,"d":"0.90"},{"v":0.553025163937074,"d":"0.55"},{"v":0.947447672621434,"d":"0.95"},{"v":0.8480200787617584,"d":"0.85"}]
[null,2009,{"v":31695.720703955994,"d":"31,695.72"},{"v":86036.75934332129,"d":"86,036.76"},{"v":0.8861628392252514,"d":"0.89"},{"v":0.9182291666666667,"d":"0.92"},{"v":0.5493212957370378,"d":"0.55"},{"v":0.9713581957224544,"d":"0.97"},{"v":0.8484888214210641,"d":"0.85"}]
[null,2008,{"v":29239.448964014882,"d":"29,239.45"},{"v":78678.77615084611,"d":"78,678.78"},{"v":0.8969345258052793,"d":"0.90"},{"v":0.9288695549938275,"d":"0.93"},{"v":0.5421487076521019,"d":"0.54"},{"v":0.971230624139413,"d":"0.97"},{"v":0.8471402623608278,"d":"0.85"}]
[null,2007,{"v":27171.365162139078,"d":"27,171.37"},{"v":76006.04378494697,"d":"76,006.04"},{"v":0.8940907305328947,"d":"0.89"},{"v":0.9040218293985052,"d":"0.90"},{"v":0.5369815888386316,"d":"0.54"},{"v":0.9745221468802983,"d":"0.97"},{"v":0.8451848678079427,"d":"0.85"}]
[null,2006,{"v":24472.190893654082,"d":"24,472.19"},{"v":70835.15608526816,"d":"70,835.16"},{"v":0.9025987396677198,"d":"0.90"},{"v":0.861604770620535,"d":"0.86"},{"v":0.5399623808461121,"d":"0.54"},{"v":0.9770701719044806,"d":"0.98"},{"v":0.8420384436350294,"d":"0.84"}]
[null,2005,{"v":22664.19669966668,"d":"22,664.20"},{"v":66423.04500115244,"d":"66,423.05"},{"v":0.9223266302980426,"d":"0.92"},{"v":0.8225627877163335,"d":"0.82"},{"v":0.548958766514187,"d":"0.55"},{"v":0.9778878048841524,"d":"0.98"},{"v":0.8377973614577959,"d":"0.84"}]
[null,2004,{"v":21469.941387864226,"d":"21,469.94"},{"v":63501.40272195254,"d":"63,501.40"},{"v":0.9355352293910284,"d":"0.94"},{"v":0.8103853383458647,"d":"0.81"},{"v":0.546973396735638,"d":"0.55"},{"v":0.9788468565096178,"d":"0.98"},{"v":0.832942197188205,"d":"0.83"}]
[null,2003,{"v":19513.043625804545,"d":"19,513.04"},{"v":57522.261911714486,"d":"57,522.26"},{"v":0.9514721701809001,"d":"0.95"},{"v":0.8034460376467811,"d":"0.80"},{"v":0.5475605815831988,"d":"0.55"},{"v":0.9791069955787072,"d":"0.98"},{"v":0.8277018527696652,"d":"0.83"}]
[null,2002,{"v":18707.364759781063,"d":"18,707.36"},{"v":54906.63952641513,"d":"54,906.64"},{"v":0.9448209066318307,"d":"0.94"},{"v":0.8006739092546331,"d":"0.80"},{"v":0.554131925441844,"d":"0.55"},{"v":0.9888182334478789,"d":"0.99"},{"v":0.821964271729858,"d":"0.82"}]