{"text_format":"3","workbook":"xlsx","n_sheets":14,"sheets":["START","odwolanie","2012wyd","2007wyd","2002wyd","2012prac","2007prac","2002prac","2012akt","2007akt","2002akt","2012","2007","2002"],"not_rendered":{"charts":4,"images":2,"macros":1,"comments":6},"read":"whole","date_system":"1900"}

{"sheet":"START","index":0,"n_rows":14,"n_cols":14,"rows_kept":14,"merged":[[7,0,7,1]]}
["PODDEKOMPOZYCJA RÓŻNIC"]
["dla województw"]
[]
[null,null,"WYBIERZ WOJEWÓDZTWO"]
[null,null,"WYBIERZ ROK"]
[]
["Podkarpackie"]
[2007]
[]
[]
[]
[]
[]
[null,null,"wydajność pracy",{"$nulls":4},"pracujący wśród aktywnych zawodowo",{"$nulls":5},"współczynnik aktywności zawodowej"]

{"sheet":"odwolanie","index":1,"n_rows":17,"n_cols":2,"rows_kept":17,"hidden":true}
["województwo","rok"]
["Łódzkie",2002]
["Mazowieckie",2007]
["Małopolskie",2012]
["Śląskie"]
["Lubelskie"]
["Podkarpackie"]
["Podlaskie"]
["Świętokrzyskie"]
["Lubuskie"]
["Wielkopolskie"]
["Zachodniopomorskie"]
["Dolnośląskie"]
["Opolskie"]
["Kujawsko-pomorskie"]
["Pomorskie"]
["Warmińsko-mazurskie"]

{"sheet":"2012wyd","index":2,"n_rows":153,"n_cols":14,"rows_kept":153,"merged":[[0,1,0,9],[1,1,1,9]]}
[null,"PODDEKOMPOZYCJA RÓŻNIC W WYDAJNOŚCI PRACY"]
[null,2012]
[]
[null,null,"Sekcje","Rolnictwo - A","Przemysł pozostały - B, D, E","Przetwórstwo przemysłowe - C","Budownictwo - F","Usługi - G, H, I, J","Usługi - K, L","Usługi  - M, N, O, P, Q, R"]
[null,"ŁÓDZKIE","Różnice w rozwoju infrastruktury i technologii",{"$f":"D41","v":{"v":-0.004066818685166821,"d":"-0.4%"}},{"v":0.02614456846741058,"d":"2.6%"},{"v":-0.038485030469581925,"d":"-3.8%"},{"v":-2.7475685540984604E-3,"d":"-0.3%"},{"v":-0.026599944317295256,"d":"-2.7%"},{"v":1.3658320283687062E-3,"d":"0.1%"},{"v":-0.015265672080763326,"d":"-1.5%"}]
[null,null,"Specjalizacja sektorowa",{"$f":"D61","v":{"v":6.1498691184886396E-3,"d":"0.6%"}},{"v":-6.6633535296318925E-3,"d":"-0.7%"},{"v":0.02729131663198196,"d":"2.7%"},{"v":-0.015553084073974273,"d":"-1.6%"},{"v":-0.020196734297653177,"d":"-2.0%"},{"v":-0.011367277436340514,"d":"-1.1%"},{"v":-0.013546279879116078,"d":"-1.4%"}]
[null,"MAZOWIECKIE","Różnice w rozwoju infrastruktury i technologii",{"$f":"D42","v":{"v":0.010455961216658122,"d":"1.0%"}},{"v":0.024966429199883185,"d":"2.5%"},{"v":0.03684114518677217,"d":"3.7%"},{"v":0.021558676659734818,"d":"2.2%"},{"v":0.12128918054979687,"d":"12.1%"},{"v":0.007850809808710373,"d":"0.8%"},{"v":0.053025934412819095,"d":"5.3%"}]
[null,null,"Specjalizacja sektorowa",{"$f":"D62","v":{"v":-0.005133246497324984,"d":"-0.5%"}},{"v":-0.02953428310889146,"d":"-3.0%"},{"v":-0.06394741978383249,"d":"-6.4%"},{"v":-7.423916830893512E-3,"d":"-0.7%"},{"v":0.05145431559287089,"d":"5.1%"},{"v":0.05884364599840138,"d":"5.9%"},{"v":0.027901120644214114,"d":"2.8%"}]
[null,"MAŁOPOLSKIE","Różnice w rozwoju infrastruktury i technologii",{"$f":"D43","v":{"v":-0.023597738894631102,"d":"-2.4%"}},{"v":-0.011135030256103679,"d":"-1.1%"},{"v":-0.010567306080953093,"d":"-1.1%"},{"v":-0.006334502065586238,"d":"-0.6%"},{"v":-0.033877101524840636,"d":"-3.4%"},{"v":2.6684761862167945E-4,"d":"0.0%"},{"v":-1.4516457363155735E-3,"d":"-0.1%"}]
[null,null,"Specjalizacja sektorowa",{"$f":"D63","v":{"v":6.4307388738578525E-3,"d":"0.6%"}},{"v":-0.013820031286676486,"d":"-1.4%"},{"v":-0.02917905597833879,"d":"-2.9%"},{"v":0.013912668677022389,"d":"1.4%"},{"v":-0.000604157158580677,"d":"-0.1%"},{"v":-0.01708427403871997,"d":"-1.7%"},{"v":-0.002196031344221808,"d":"-0.2%"}]
[null,"ŚLĄSKIE","Różnice w rozwoju infrastruktury i technologii",{"$f":"D44","v":{"v":-1.1643570335995853E-3,"d":"-0.1%"}},{"v":-0.037133514057353316,"d":"-3.7%"},{"v":3.8241163621921073E-3,"d":"0.4%"},{"v":-0.002073117760948613,"d":"-0.2%"},{"v":-0.020368353825870798,"d":"-2.0%"},{"v":-0.008506638337916343,"d":"-0.9%"},{"v":-0.012657949262332891,"d":"-1.3%"}]
[null,null,"Specjalizacja sektorowa",{"$f":"D64","v":{"v":-0.02047238858585653,"d":"-2.0%"}},{"v":0.11551925108996455,"d":"11.6%"},{"v":0.030353474886810474,"d":"3.0%"},{"v":0.007313775741209991,"d":"0.7%"},{"v":0.012663282113641781,"d":"1.3%"},{"v":-1.7721298401370442E-3,"d":"-0.2%"},{"v":-7.2436883686464494E-4,"d":"-0.1%"}]
[null,"LUBELSKIE","Różnice w rozwoju infrastruktury i technologii",{"$f":"D45","v":{"v":-0.02578305266464992,"d":"-2.6%"}},{"v":-0.00657042631385441,"d":"-0.7%"},{"v":-0.01673240250933556,"d":"-1.7%"},{"v":-0.007314879896371715,"d":"-0.7%"},{"v":-0.018096639370851438,"d":"-1.8%"},{"v":0.010259493723423567,"d":"1.0%"},{"v":-0.01957748748539805,"d":"-2.0%"}]
[null,null,"Specjalizacja sektorowa",{"$f":"D65","v":{"v":0.037439611962857736,"d":"3.7%"}},{"v":-0.016186315397916793,"d":"-1.6%"},{"v":-0.07181134165795688,"d":"-7.2%"},{"v":-0.017554311973338253,"d":"-1.8%"},{"v":-0.07038116996916438,"d":"-7.0%"},{"v":-0.027224855197520822,"d":"-2.7%"},{"v":-0.025293063368040433,"d":"-2.5%"}]
[null,"PODKARPACKIE","Różnice w rozwoju infrastruktury i technologii",{"$f":"D46","v":{"v":-0.04063547056519856,"d":"-4.1%"}},{"v":-0.009118227425732968,"d":"-0.9%"},{"v":-0.036170754916378035,"d":"-3.6%"},{"v":-0.009899686697012062,"d":"-1.0%"},{"v":-0.02562918710226307,"d":"-2.6%"},{"v":0.012056709356321882,"d":"1.2%"},{"v":-0.030357066310890884,"d":"-3.0%"}]
[null,null,"Specjalizacja sektorowa",{"$f":"D66","v":{"v":0.023295074490838646,"d":"2.3%"}},{"v":-0.019878282711337045,"d":"-2.0%"},{"v":0.009371180640464515,"d":"0.9%"},{"v":-0.009495474624034385,"d":"-0.9%"},{"v":-0.06380764278816162,"d":"-6.4%"},{"v":-0.0409826756590227,"d":"-4.1%"},{"v":-0.028761265354347462,"d":"-2.9%"}]
[null,"PODLASKIE","Różnice w rozwoju infrastruktury i technologii",{"$f":"D47","v":{"v":1.9054912126519941E-3,"d":"0.2%"}},{"v":-8.531494556313796E-3,"d":"-0.9%"},{"v":-0.02183214569047351,"d":"-2.2%"},{"v":-0.004784922488273349,"d":"-0.5%"},{"v":-0.018047271707781493,"d":"-1.8%"},{"v":0.007069282288275327,"d":"0.7%"},{"v":-0.017464568134346627,"d":"-1.7%"}]
[null,null,"Specjalizacja sektorowa",{"$f":"D67","v":{"v":0.028145723464239113,"d":"2.8%"}},{"v":-0.027020602018369665,"d":"-2.7%"},{"v":-0.04495425642456204,"d":"-4.5%"},{"v":-0.014338012695632826,"d":"-1.4%"},{"v":-0.052406251895075244,"d":"-5.2%"},{"v":-0.02709783647038774,"d":"-2.7%"},{"v":-0.01592841422465304,"d":"-1.6%"}]
[null,"ŚWIĘTOKRZYSKIE","Różnice w rozwoju infrastruktury i technologii",{"$f":"D48","v":{"v":-0.029181321257847656,"d":"-2.9%"}},{"v":9.151807222974262E-3,"d":"0.9%"},{"v":-0.03025975958627581,"d":"-3.0%"},{"v":-1.4637945045831101E-3,"d":"-0.1%"},{"v":-0.01860160830412099,"d":"-1.9%"},{"v":0.011853864195586487,"d":"1.2%"},{"v":-0.01821797548761765,"d":"-1.8%"}]
[null,null,"Specjalizacja sektorowa",{"$f":"D68","v":{"v":0.029644421673991103,"d":"3.0%"}},{"v":-0.015994557640905453,"d":"-1.6%"},{"v":-0.024355570768349318,"d":"-2.4%"},{"v":-0.005138867960209688,"d":"-0.5%"},{"v":-0.06404081497896426,"d":"-6.4%"},{"v":-0.042282601797655944,"d":"-4.2%"},{"v":-0.034966608994505516,"d":"-3.5%"}]
[null,"LUBUSKIE","Różnice w rozwoju infrastruktury i technologii",{"$f":"D49","v":{"v":0.01779750123670873,"d":"1.8%"}},{"v":0.015272122615617105,"d":"1.5%"},{"v":-0.026472012603416743,"d":"-2.6%"},{"v":-0.006205405932487931,"d":"-0.6%"},{"v":-0.058884457735085965,"d":"-5.9%"},{"v":-5.8031046272540281E-4,"d":"-0.1%"},{"v":-0.030677292665531264,"d":"-3.1%"}]
[null,null,"Specjalizacja sektorowa",{"$f":"D69","v":{"v":-0.010593248858905861,"d":"-1.1%"}},{"v":-0.011733694232538328,"d":"-1.2%"},{"v":0.06265835221315712,"d":"6.3%"},{"v":-6.35376847522092E-3,"d":"-0.6%"},{"v":0.009993875776635203,"d":"1.0%"},{"v":-0.016346062142392002,"d":"-1.6%"},{"v":0.007805697709658724,"d":"0.8%"}]
[null,"WIELKOPOLSKIE","Różnice w rozwoju infrastruktury i technologii",{"$f":"D50","v":{"v":0.016594592400258606,"d":"1.7%"}},{"v":7.8404126690945187E-5,"d":"0.0%"},{"v":-0.023616369084882932,"d":"-2.4%"},{"v":-0.008581003605823454,"d":"-0.9%"},{"v":-0.0137206075664231,"d":"-1.4%"},{"v":-7.116399795278717E-4,"d":"-0.1%"},{"v":-3.4769699824020277E-3,"d":"-0.3%"}]
[null,null,"Specjalizacja sektorowa",{"$f":"D70","v":{"v":-1.5440224987603034E-3,"d":"-0.2%"}},{"v":-0.020630246089409564,"d":"-2.1%"},{"v":0.05375227903956234,"d":"5.4%"},{"v":0.006125247359673056,"d":"0.6%"},{"v":0.007565287716875354,"d":"0.8%"},{"v":-0.01639817868646204,"d":"-1.6%"},{"v":-0.027719011684838434,"d":"-2.8%"}]
[null,"ZACHODNIOPOMORSKIE","Różnice w rozwoju infrastruktury i technologii",{"$f":"D51","v":{"v":0.019242855689920502,"d":"1.9%"}},{"v":-0.00474214465679725,"d":"-0.5%"},{"v":-0.034029088111120896,"d":"-3.4%"},{"v":0.010530919896795646,"d":"1.1%"},{"v":-0.03050190494791001,"d":"-3.1%"},{"v":-3.1565811892861526E-3,"d":"-0.3%"},{"v":0.002992534517832231,"d":"0.3%"}]
[null,null,"Specjalizacja sektorowa",{"$f":"D71","v":{"v":-0.012466414460091068,"d":"-1.2%"}},{"v":-0.009212165858307912,"d":"-0.9%"},{"v":-0.008956343466687552,"d":"-0.9%"},{"v":0.010224210024643687,"d":"1.0%"},{"v":0.03813308565104831,"d":"3.8%"},{"v":-2.4472062454971594E-3,"d":"-0.2%"},{"v":0.030632834784074445,"d":"3.1%"}]
[null,"DOLNOŚLĄSKIE","Różnice w rozwoju infrastruktury i technologii",{"$f":"D52","v":{"v":0.00267516734098259,"d":"0.3%"}},{"v":0.004835710347789113,"d":"0.5%"},{"v":0.10499254275440889,"d":"10.5%"},{"v":3.667867404338132E-3,"d":"0.4%"},{"v":-0.027862791075710384,"d":"-2.8%"},{"v":-5.0330565016677145E-3,"d":"-0.5%"},{"v":3.5628384355387587E-3,"d":"0.4%"}]
[null,null,"Specjalizacja sektorowa",{"$f":"D72","v":{"v":-0.014637350071474603,"d":"-1.5%"}},{"v":0.02484180459029422,"d":"2.5%"},{"v":0.027383171490412018,"d":"2.7%"},{"v":2.3247857131626186E-3,"d":"0.2%"},{"v":0.007933059604003713,"d":"0.8%"},{"v":0.006915064034117767,"d":"0.7%"},{"v":0.02099977367256221,"d":"2.1%"}]
[null,"OPOLSKIE","Różnice w rozwoju infrastruktury i technologii",{"$f":"D53","v":{"v":0.012907031931394003,"d":"1.3%"}},{"v":6.1028413009210445E-3,"d":"0.6%"},{"v":-0.024889523171373832,"d":"-2.5%"},{"v":-0.015989050753631735,"d":"-1.6%"},{"v":-0.01805158390592836,"d":"-1.8%"},{"v":0.011065085938457335,"d":"1.1%"},{"v":-0.009623497755152284,"d":"-1.0%"}]
[null,null,"Specjalizacja sektorowa",{"$f":"D73","v":{"v":-0.002246255778920023,"d":"-0.2%"}},{"v":-7.870235693349362E-3,"d":"-0.8%"},{"v":0.04665254093521799,"d":"4.7%"},{"v":0.012201629766361004,"d":"1.2%"},{"v":-0.03812381517887265,"d":"-3.8%"},{"v":-0.02478223064619951,"d":"-2.5%"},{"v":0.006985840893367067,"d":"0.7%"}]
[null,"KUJAWSKO-POMORSKIE","Różnice w rozwoju infrastruktury i technologii",{"$f":"D54","v":{"v":0.01024697485937411,"d":"1.0%"}},{"v":-6.1663243203969095E-3,"d":"-0.6%"},{"v":-0.028833176753956843,"d":"-2.9%"},{"v":-7.3756339365503385E-3,"d":"-0.7%"},{"v":-0.02862535535364498,"d":"-2.9%"},{"v":-0.017252654239771993,"d":"-1.7%"},{"v":-0.019609030450014702,"d":"-2.0%"}]
[null,null,"Specjalizacja sektorowa",{"$f":"D74","v":{"v":1.5391851229531265E-5,"d":"0.0%"}},{"v":-0.021716559674216693,"d":"-2.2%"},{"v":0.03825406968464004,"d":"3.8%"},{"v":0.000899884264891212,"d":"0.1%"},{"v":-0.015817393782095866,"d":"-1.6%"},{"v":-5.4681762493262506E-3,"d":"-0.5%"},{"v":-0.0059839200378783,"d":"-0.6%"}]
[null,"POMORSKIE","Różnice w rozwoju infrastruktury i technologii",{"$f":"D55","v":{"v":0.010107925433308702,"d":"1.0%"}},{"v":0.004468205578814124,"d":"0.4%"},{"v":0.02346448301231252,"d":"2.3%"},{"v":-4.3227152059451355E-3,"d":"-0.4%"},{"v":-0.014384599420949983,"d":"-1.4%"},{"v":-0.019266317633261976,"d":"-1.9%"},{"v":6.584124475419965E-5,"d":"0.0%"}]
[null,null,"Specjalizacja sektorowa",{"$f":"D75","v":{"v":-0.014124158282232532,"d":"-1.4%"}},{"v":-0.023875779387850984,"d":"-2.4%"},{"v":0.01581553678991799,"d":"1.6%"},{"v":0.017253975740132883,"d":"1.7%"},{"v":0.03474523089259135,"d":"3.5%"},{"v":0.02513026865381669,"d":"2.5%"},{"v":0.011979991557174755,"d":"1.2%"}]
[null,"WARMIŃSKO-MAZURSKIE","Różnice w rozwoju infrastruktury i technologii",{"$f":"D56","v":{"v":0.028676082870631794,"d":"2.9%"}},{"v":-0.01189683843314882,"d":"-1.2%"},{"v":-0.04768629574089246,"d":"-4.8%"},{"v":-0.007299118136128473,"d":"-0.7%"},{"v":-0.03554605565571906,"d":"-3.6%"},{"v":1.073545150557227E-3,"d":"0.1%"},{"v":-0.01857575940025032,"d":"-1.9%"}]
[null,null,"Specjalizacja sektorowa",{"$f":"D76","v":{"v":1.359171729841215E-3,"d":"0.1%"}},{"v":-0.018316542738421843,"d":"-1.8%"},{"v":0.03421681838514777,"d":"3.4%"},{"v":-1.1566229965049712E-3,"d":"-0.1%"},{"v":-0.037836472485673664,"d":"-3.8%"},{"v":-0.017151043729359924,"d":"-1.7%"},{"v":0.011900737687007156,"d":"1.2%"}]
[]
[]
[]
[null,null,"Roznice wynikajace w rozwoju infrastruktury i technologii","rolnictwo,leśnictwo, łowiectwo i rybactwo (sekcja A)","przemysł bez przetwórstwa przemsyłowego (sekcje B,D,E)","przetwórstwo przemysłowe (sekcja C)","budownictwo (sekcja F)","handel; naprawa pojazd_w samochodowych; transport i gospodarka magazynowa; zakwaterowanie i gastronomia; informacja i komunikacja  (sekcje G,H,I,J)","działalność finansowa i ubezpieczeniowa; obsługa rynku nieruchomości (sekcje K,L)","pozostałe usługi (sekcje M,N,O,P,Q,R,S,T)","SUMA (*)"]
[null,null,"ŁÓDZKIE",{"$f":"D80*(E99-E$115)/$D$115","v":{"v":-0.004066818685166821,"d":"-0.4%"}},{"v":0.02614456846741058,"d":"2.6%"},{"v":-0.038485030469581925,"d":"-3.8%"},{"v":-2.7475685540984604E-3,"d":"-0.3%"},{"v":-0.026599944317295256,"d":"-2.7%"},{"v":1.3658320283687062E-3,"d":"0.1%"},{"v":-0.015265672080763326,"d":"-1.5%"},{"$f":"SUM(D41:J41)","v":{"v":-0.0596546336111265,"d":"-6.0%"}}]
[null,null,"MAZOWIECKIE",{"v":0.010455961216658122,"d":"1.0%"},{"v":0.024966429199883185,"d":"2.5%"},{"v":0.03684114518677217,"d":"3.7%"},{"v":0.021558676659734818,"d":"2.2%"},{"v":0.12128918054979687,"d":"12.1%"},{"v":0.007850809808710373,"d":"0.8%"},{"v":0.053025934412819095,"d":"5.3%"},{"v":0.27598813703437464,"d":"27.6%"}]
[null,null,"MAŁOPOLSKIE",{"v":-0.023597738894631102,"d":"-2.4%"},{"v":-0.011135030256103679,"d":"-1.1%"},{"v":-0.010567306080953093,"d":"-1.1%"},{"v":-0.006334502065586238,"d":"-0.6%"},{"v":-0.033877101524840636,"d":"-3.4%"},{"v":2.6684761862167945E-4,"d":"0.0%"},{"v":-1.4516457363155735E-3,"d":"-0.1%"},{"v":-0.08669647693980864,"d":"-8.7%"}]
[null,null,"ŚLĄSKIE",{"v":-1.1643570335995853E-3,"d":"-0.1%"},{"v":-0.037133514057353316,"d":"-3.7%"},{"v":3.8241163621921073E-3,"d":"0.4%"},{"v":-0.002073117760948613,"d":"-0.2%"},{"v":-0.020368353825870798,"d":"-2.0%"},{"v":-0.008506638337916343,"d":"-0.9%"},{"v":-0.012657949262332891,"d":"-1.3%"},{"v":-0.07807981391582945,"d":"-7.8%"}]
[null,null,"LUBELSKIE",{"v":-0.02578305266464992,"d":"-2.6%"},{"v":-0.00657042631385441,"d":"-0.7%"},{"v":-0.01673240250933556,"d":"-1.7%"},{"v":-0.007314879896371715,"d":"-0.7%"},{"v":-0.018096639370851438,"d":"-1.8%"},{"v":0.010259493723423567,"d":"1.0%"},{"v":-0.01957748748539805,"d":"-2.0%"},{"v":-0.08381539451703753,"d":"-8.4%"}]
[null,null,"PODKARPACKIE",{"v":-0.04063547056519856,"d":"-4.1%"},{"v":-0.009118227425732968,"d":"-0.9%"},{"v":-0.036170754916378035,"d":"-3.6%"},{"v":-0.009899686697012062,"d":"-1.0%"},{"v":-0.02562918710226307,"d":"-2.6%"},{"v":0.012056709356321882,"d":"1.2%"},{"v":-0.030357066310890884,"d":"-3.0%"},{"v":-0.1397536836611537,"d":"-14.0%"}]
[null,null,"PODLASKIE",{"v":1.9054912126519941E-3,"d":"0.2%"},{"v":-8.531494556313796E-3,"d":"-0.9%"},{"v":-0.02183214569047351,"d":"-2.2%"},{"v":-0.004784922488273349,"d":"-0.5%"},{"v":-0.018047271707781493,"d":"-1.8%"},{"v":0.007069282288275327,"d":"0.7%"},{"v":-0.017464568134346627,"d":"-1.7%"},{"v":-0.06168562907626145,"d":"-6.2%"}]
[null,null,"ŚWIĘTOKRZYSKIE",{"v":-0.029181321257847656,"d":"-2.9%"},{"v":9.151807222974262E-3,"d":"0.9%"},{"v":-0.03025975958627581,"d":"-3.0%"},{"v":-1.4637945045831101E-3,"d":"-0.1%"},{"v":-0.01860160830412099,"d":"-1.9%"},{"v":0.011853864195586487,"d":"1.2%"},{"v":-0.01821797548761765,"d":"-1.8%"},{"v":-0.07671878772188447,"d":"-7.7%"}]
[null,null,"LUBUSKIE",{"v":0.01779750123670873,"d":"1.8%"},{"v":0.015272122615617105,"d":"1.5%"},{"v":-0.026472012603416743,"d":"-2.6%"},{"v":-0.006205405932487931,"d":"-0.6%"},{"v":-0.058884457735085965,"d":"-5.9%"},{"v":-5.8031046272540281E-4,"d":"-0.1%"},{"v":-0.030677292665531264,"d":"-3.1%"},{"v":-0.08974985554692147,"d":"-9.0%"}]
[null,null,"WIELKOPOLSKIE",{"v":0.016594592400258606,"d":"1.7%"},{"v":7.8404126690945187E-5,"d":"0.0%"},{"v":-0.023616369084882932,"d":"-2.4%"},{"v":-0.008581003605823454,"d":"-0.9%"},{"v":-0.0137206075664231,"d":"-1.4%"},{"v":-7.116399795278717E-4,"d":"-0.1%"},{"v":-3.4769699824020277E-3,"d":"-0.3%"},{"v":-0.03343359369210983,"d":"-3.3%"}]
[null,null,"ZACHODNIOPOMORSKIE",{"$f":"D90*(E109-E$115)/$D$115","v":{"v":0.019242855689920502,"d":"1.9%"}},{"v":-0.00474214465679725,"d":"-0.5%"},{"v":-0.034029088111120896,"d":"-3.4%"},{"v":0.010530919896795646,"d":"1.1%"},{"v":-0.03050190494791001,"d":"-3.1%"},{"v":-3.1565811892861526E-3,"d":"-0.3%"},{"v":0.002992534517832231,"d":"0.3%"},{"v":-0.03966340880056593,"d":"-4.0%"}]
[null,null,"DOLNOŚLĄSKIE",{"v":0.00267516734098259,"d":"0.3%"},{"v":0.004835710347789113,"d":"0.5%"},{"v":0.10499254275440889,"d":"10.5%"},{"v":3.667867404338132E-3,"d":"0.4%"},{"v":-0.027862791075710384,"d":"-2.8%"},{"v":-5.0330565016677145E-3,"d":"-0.5%"},{"v":3.5628384355387587E-3,"d":"0.4%"},{"v":0.0868382787056794,"d":"8.7%"}]
[null,null,"OPOLSKIE",{"v":0.012907031931394003,"d":"1.3%"},{"v":6.1028413009210445E-3,"d":"0.6%"},{"v":-0.024889523171373832,"d":"-2.5%"},{"v":-0.015989050753631735,"d":"-1.6%"},{"v":-0.01805158390592836,"d":"-1.8%"},{"v":0.011065085938457335,"d":"1.1%"},{"v":-0.009623497755152284,"d":"-1.0%"},{"v":-0.038478696415313825,"d":"-3.8%"}]
[null,null,"KUJAWSKO-POMORSKIE",{"v":0.01024697485937411,"d":"1.0%"},{"v":-6.1663243203969095E-3,"d":"-0.6%"},{"v":-0.028833176753956843,"d":"-2.9%"},{"v":-7.3756339365503385E-3,"d":"-0.7%"},{"v":-0.02862535535364498,"d":"-2.9%"},{"v":-0.017252654239771993,"d":"-1.7%"},{"v":-0.019609030450014702,"d":"-2.0%"},{"v":-0.09761520019496166,"d":"-9.8%"}]
[null,null,"POMORSKIE",{"v":0.010107925433308702,"d":"1.0%"},{"v":0.004468205578814124,"d":"0.4%"},{"v":0.02346448301231252,"d":"2.3%"},{"v":-4.3227152059451355E-3,"d":"-0.4%"},{"v":-0.014384599420949983,"d":"-1.4%"},{"v":-0.019266317633261976,"d":"-1.9%"},{"v":6.584124475419965E-5,"d":"0.0%"},{"v":1.3282300903245213E-4,"d":"0.0%"}]
[null,null,"WARMIŃSKO-MAZURSKIE",{"v":0.028676082870631794,"d":"2.9%"},{"v":-0.01189683843314882,"d":"-1.2%"},{"v":-0.04768629574089246,"d":"-4.8%"},{"v":-0.007299118136128473,"d":"-0.7%"},{"v":-0.03554605565571906,"d":"-3.6%"},{"v":1.073545150557227E-3,"d":"0.1%"},{"v":-0.01857575940025032,"d":"-1.9%"},{"v":-0.09125443934495012,"d":"-9.1%"}]
[{"$nulls":3},{"$f":"COUNTIF(D41:D56,\">0\")","v":10},8,4,3,1,9,4]
[]
[]
[null,null,"Specjalizacja sektorowa","rolnictwo,leśnictwo, łowiectwo i rybactwo (sekcja A)","przemysł bez przetwórstwa przemsyłowego (sekcje B,D,E)","przetwórstwo przemysłowe (sekcja C)","budownictwo (sekcja F)","handel; naprawa pojazd_w samochodowych; transport i gospodarka magazynowa; zakwaterowanie i gastronomia; informacja i komunikacja  (sekcje G,H,I,J)","działalność finansowa i ubezpieczeniowa; obsługa rynku nieruchomości (sekcje K,L)","pozostałe usługi (sekcje M,N,O,P,Q,R,S,T)","SUMA (*)",null,"(WDBi/Pi-WDB/P)/(WDB/P)","Weryfikacja"]
[null,null,"ŁÓDZKIE",{"$f":"E$115*(D80-D$96)/$D$115","v":{"v":6.1498691184886396E-3,"d":"0.6%"}},{"v":-6.6633535296318925E-3,"d":"-0.7%"},{"v":0.02729131663198196,"d":"2.7%"},{"v":-0.015553084073974273,"d":"-1.6%"},{"v":-0.020196734297653177,"d":"-2.0%"},{"v":-0.011367277436340514,"d":"-1.1%"},{"v":-0.013546279879116078,"d":"-1.4%"},{"$f":"SUM(D61:J61)","v":{"v":-0.03388554346624534,"d":"-3.4%"}},null,{"$f":"(D99-$D$115)/$D$115","v":{"v":-0.09354017707737187,"d":"-9.35%"}},{"$f":"K41+K61","v":{"v":-0.09354017707737183,"d":"-9.35%"}}]
[null,null,"MAZOWIECKIE",{"v":-0.005133246497324984,"d":"-0.5%"},{"v":-0.02953428310889146,"d":"-3.0%"},{"v":-0.06394741978383249,"d":"-6.4%"},{"v":-7.423916830893512E-3,"d":"-0.7%"},{"v":0.05145431559287089,"d":"5.1%"},{"v":0.05884364599840138,"d":"5.9%"},{"v":0.027901120644214114,"d":"2.8%"},{"v":0.03216021601454395,"d":"3.2%"},null,{"v":0.3081483530489184,"d":"30.81%"},{"v":0.3081483530489186,"d":"30.81%"}]
[null,null,"MAŁOPOLSKIE",{"v":6.4307388738578525E-3,"d":"0.6%"},{"v":-0.013820031286676486,"d":"-1.4%"},{"v":-0.02917905597833879,"d":"-2.9%"},{"v":0.013912668677022389,"d":"1.4%"},{"v":-0.000604157158580677,"d":"-0.1%"},{"v":-0.01708427403871997,"d":"-1.7%"},{"v":-0.002196031344221808,"d":"-0.2%"},{"v":-0.04254014225565749,"d":"-4.3%"},null,{"v":-0.1292366191954662,"d":"-12.92%"},{"v":-0.12923661919546614,"d":"-12.92%"}]
[null,null,"ŚLĄSKIE",{"v":-0.02047238858585653,"d":"-2.0%"},{"v":0.11551925108996455,"d":"11.6%"},{"v":0.030353474886810474,"d":"3.0%"},{"v":0.007313775741209991,"d":"0.7%"},{"v":0.012663282113641781,"d":"1.3%"},{"v":-1.7721298401370442E-3,"d":"-0.2%"},{"v":-7.2436883686464494E-4,"d":"-0.1%"},{"v":0.1428808965687686,"d":"14.3%"},null,{"v":0.06480108265293905,"d":"6.48%"},{"v":0.06480108265293914,"d":"6.48%"}]
[null,null,"LUBELSKIE",{"v":0.037439611962857736,"d":"3.7%"},{"v":-0.016186315397916793,"d":"-1.6%"},{"v":-0.07181134165795688,"d":"-7.2%"},{"v":-0.017554311973338253,"d":"-1.8%"},{"v":-0.07038116996916438,"d":"-7.0%"},{"v":-0.027224855197520822,"d":"-2.7%"},{"v":-0.025293063368040433,"d":"-2.5%"},{"v":-0.19101144560107983,"d":"-19.1%"},null,{"v":-0.27482684011811737,"d":"-27.48%"},{"v":-0.27482684011811737,"d":"-27.48%"}]
[null,null,"PODKARPACKIE",{"v":0.023295074490838646,"d":"2.3%"},{"v":-0.019878282711337045,"d":"-2.0%"},{"v":0.009371180640464515,"d":"0.9%"},{"v":-0.009495474624034385,"d":"-0.9%"},{"v":-0.06380764278816162,"d":"-6.4%"},{"v":-0.0409826756590227,"d":"-4.1%"},{"v":-0.028761265354347462,"d":"-2.9%"},{"v":-0.13025908600560004,"d":"-13.0%"},null,{"v":-0.2700127696667538,"d":"-27.00%"},{"v":-0.27001276966675375,"d":"-27.00%"}]
[null,null,"PODLASKIE",{"v":0.028145723464239113,"d":"2.8%"},{"v":-0.027020602018369665,"d":"-2.7%"},{"v":-0.04495425642456204,"d":"-4.5%"},{"v":-0.014338012695632826,"d":"-1.4%"},{"v":-0.052406251895075244,"d":"-5.2%"},{"v":-0.02709783647038774,"d":"-2.7%"},{"v":-0.01592841422465304,"d":"-1.6%"},{"v":-0.15359965026444145,"d":"-15.4%"},null,{"v":-0.21528527934070293,"d":"-21.53%"},{"v":-0.2152852793407029,"d":"-21.53%"}]
[null,null,"ŚWIĘTOKRZYSKIE",{"v":0.029644421673991103,"d":"3.0%"},{"v":-0.015994557640905453,"d":"-1.6%"},{"v":-0.024355570768349318,"d":"-2.4%"},{"v":-0.005138867960209688,"d":"-0.5%"},{"v":-0.06404081497896426,"d":"-6.4%"},{"v":-0.042282601797655944,"d":"-4.2%"},{"v":-0.034966608994505516,"d":"-3.5%"},{"v":-0.15713460046659908,"d":"-15.7%"},null,{"v":-0.23385338818848359,"d":"-23.39%"},{"v":-0.23385338818848356,"d":"-23.39%"}]
[null,null,"LUBUSKIE",{"v":-0.010593248858905861,"d":"-1.1%"},{"v":-0.011733694232538328,"d":"-1.2%"},{"v":0.06265835221315712,"d":"6.3%"},{"v":-6.35376847522092E-3,"d":"-0.6%"},{"v":0.009993875776635203,"d":"1.0%"},{"v":-0.016346062142392002,"d":"-1.6%"},{"v":0.007805697709658724,"d":"0.8%"},{"v":0.035431151990393935,"d":"3.5%"},null,{"v":-0.054318703556527584,"d":"-5.43%"},{"v":-0.054318703556527535,"d":"-5.43%"}]
[null,null,"WIELKOPOLSKIE",{"v":-1.5440224987603034E-3,"d":"-0.2%"},{"v":-0.020630246089409564,"d":"-2.1%"},{"v":0.05375227903956234,"d":"5.4%"},{"v":0.006125247359673056,"d":"0.6%"},{"v":0.007565287716875354,"d":"0.8%"},{"v":-0.01639817868646204,"d":"-1.6%"},{"v":-0.027719011684838434,"d":"-2.8%"},{"v":1.1513551566404052E-3,"d":"0.1%"},null,{"v":-0.0322822385354695,"d":"-3.23%"},{"v":-0.032282238535469424,"d":"-3.23%"}]
[null,null,"ZACHODNIOPOMORSKIE",{"$f":"E$115*(D90-D$96)/$D$115","v":{"v":-0.012466414460091068,"d":"-1.2%"}},{"v":-0.009212165858307912,"d":"-0.9%"},{"v":-0.008956343466687552,"d":"-0.9%"},{"v":0.010224210024643687,"d":"1.0%"},{"v":0.03813308565104831,"d":"3.8%"},{"v":-2.4472062454971594E-3,"d":"-0.2%"},{"v":0.030632834784074445,"d":"3.1%"},{"v":0.04590800042918275,"d":"4.6%"},null,{"v":0.006244591628616818,"d":"0.62%"},{"v":6.244591628616819E-3,"d":"0.62%"}]
[null,null,"DOLNOŚLĄSKIE",{"v":-0.014637350071474603,"d":"-1.5%"},{"v":0.02484180459029422,"d":"2.5%"},{"v":0.027383171490412018,"d":"2.7%"},{"v":2.3247857131626186E-3,"d":"0.2%"},{"v":0.007933059604003713,"d":"0.8%"},{"v":0.006915064034117767,"d":"0.7%"},{"v":0.02099977367256221,"d":"2.1%"},{"v":0.07576030903307794,"d":"7.6%"},null,{"v":0.16259858773875716,"d":"16.26%"},{"v":0.16259858773875735,"d":"16.26%"}]
[null,null,"OPOLSKIE",{"v":-0.002246255778920023,"d":"-0.2%"},{"v":-7.870235693349362E-3,"d":"-0.8%"},{"v":0.04665254093521799,"d":"4.7%"},{"v":0.012201629766361004,"d":"1.2%"},{"v":-0.03812381517887265,"d":"-3.8%"},{"v":-0.02478223064619951,"d":"-2.5%"},{"v":0.006985840893367067,"d":"0.7%"},{"v":-0.007182525702395475,"d":"-0.7%"},null,{"v":-0.04566122211770934,"d":"-4.57%"},{"v":-0.0456612221177093,"d":"-4.57%"}]
[null,null,"KUJAWSKO-POMORSKIE",{"v":1.5391851229531265E-5,"d":"0.0%"},{"v":-0.021716559674216693,"d":"-2.2%"},{"v":0.03825406968464004,"d":"3.8%"},{"v":0.000899884264891212,"d":"0.1%"},{"v":-0.015817393782095866,"d":"-1.6%"},{"v":-5.4681762493262506E-3,"d":"-0.5%"},{"v":-0.0059839200378783,"d":"-0.6%"},{"v":-0.009816703942756324,"d":"-1.0%"},null,{"v":-0.10743190413771805,"d":"-10.74%"},{"v":-0.10743190413771798,"d":"-10.74%"}]
[null,null,"POMORSKIE",{"v":-0.014124158282232532,"d":"-1.4%"},{"v":-0.023875779387850984,"d":"-2.4%"},{"v":0.01581553678991799,"d":"1.6%"},{"v":0.017253975740132883,"d":"1.7%"},{"v":0.03474523089259135,"d":"3.5%"},{"v":0.02513026865381669,"d":"2.5%"},{"v":0.011979991557174755,"d":"1.2%"},{"v":0.06692506596355016,"d":"6.7%"},null,{"v":0.06705788897258265,"d":"6.71%"},{"v":0.06705788897258261,"d":"6.71%"}]
[null,null,"WARMIŃSKO-MAZURSKIE",{"v":1.359171729841215E-3,"d":"0.1%"},{"v":-0.018316542738421843,"d":"-1.8%"},{"v":0.03421681838514777,"d":"3.4%"},{"v":-1.1566229965049712E-3,"d":"-0.1%"},{"v":-0.037836472485673664,"d":"-3.8%"},{"v":-0.017151043729359924,"d":"-1.7%"},{"v":0.011900737687007156,"d":"1.2%"},{"v":-0.026983954147964263,"d":"-2.7%"},null,{"v":-0.11823839349291437,"d":"-11.82%"},{"v":-0.11823839349291437,"d":"-11.82%"}]
[{"$nulls":3},{"$f":"COUNTIF(D61:D76,\">0\")","v":8},2,10,8,7,3,7]
[]
[null,null,"Ppij/PPi","rolnictwo,leśnictwo, łowiectwo i rybactwo (sekcja A)","przemysł bez przetwórstwa przemsyłowego (sekcje B,D,E)","przetwórstwo przemysłowe (sekcja C)","budownictwo (sekcja F)","handel; naprawa pojazd_w samochodowych; transport i gospodarka magazynowa; zakwaterowanie i gastronomia; informacja i komunikacja  (sekcje G,H,I,J)","działalność finansowa i ubezpieczeniowa; obsługa rynku nieruchomości (sekcje K,L)","pozostałe usługi (sekcje M,N,O,P,Q,R,S,T)"]
[null,null,"ŁÓDZKIE",{"$f":"E137/$D137","v":0.18621030799665428},{"$f":"F137/$D137","v":0.02982955132338551},0.19670659071408353,0.05275082973434351,0.232947008676223,0.03620978303634386,{"$f":"K137/$D137","v":0.2653459285189663}]
[null,null,"MAZOWIECKIE",{"$f":"E138/$D138","v":0.12984542331620483},0.017810723977649715,0.11713301631219038,0.05956248223251762,0.2931150754137541,0.06917034359692079,{"$f":"K138/$D138","v":0.31336293515076263}]
[null,null,"MAŁOPOLSKIE",0.18761339486650996,0.026068669019371552,0.14745613446125977,0.0774409932326704,0.24939962857035025,0.033525935516342455,{"$f":"K139/$D139","v":0.2784952443334956}]
[null,null,"ŚLĄSKIE",0.053218629409620924,0.09403733196851186,0.19937724231770146,0.07191159960509197,0.26054079360264093,0.04071423089090442,{"$f":"K140/$D140","v":0.28020017220552845}]
[null,null,"LUBELSKIE",0.3425184419514269,0.02482517080101554,0.11027452180729662,0.05107394591432847,0.19080526086816815,0.02876543354523874,{"$f":"K141/$D141","v":0.2517372251125256}]
[null,null,"PODKARPACKIE",0.27185930394248237,0.022885017142095718,0.1810776009819779,0.057826667062916996,0.1963252975282291,0.022306816391109523,{"$f":"K142/$D142","v":0.24771929695118833}]
[null,null,"PODLASKIE",0.29609075554862124,0.019131680300151777,0.13369784345762917,0.053768971413835236,0.20589947193605762,0.028825062563676142,{"$f":"K143/$D143","v":0.26258621478002886}]
[null,null,"ŚWIĘTOKRZYSKIE",0.3035775131641396,0.024925940792271815,0.1516629217789215,0.06147718743946139,0.19612949411768613,0.021696565277455934,{"$f":"K144/$D144","v":0.24053037743006359}]
[null,null,"LUBUSKIE",0.10256994250537597,0.027165053176027652,0.2275518385523169,0.06045918893104676,0.25829919325093637,0.033872489538496454,{"$f":"K145/$D145","v":0.2900822940457998}]
[null,null,"WIELKOPOLSKIE",0.14777541744724623,0.02248985532849083,0.2197844350990517,0.07091569903161837,0.2562598170145677,0.03384802339529546,{"$f":"K146/$D146","v":0.2489267526837296}]
[null,null,"ZACHODNIOPOMORSKIE",0.09321253036025763,0.02849013329890696,0.16509330899774374,0.074350332425406,0.28192874034413246,0.040397315863251064,{"$f":"K147/$D147","v":0.3165276387103022}]
[null,null,"DOLNOŚLĄSKIE",0.08236760600152675,0.04638572384935403,0.19678670163734477,0.06773118783944157,0.2565686488248864,0.04479243932039452,{"$f":"K148/$D148","v":0.305367692527052}]
[null,null,"OPOLSKIE",0.1442674060785156,0.029195326627703598,0.2135924210436918,0.07600726673624482,0.21789296828856106,0.029912125121306803,{"$f":"K149/$D149","v":0.2891324861039763}]
[null,null,"KUJAWSKO-POMORSKIE",0.15556548297515999,0.021918990232086346,0.2062677209966163,0.06653722378143413,0.23662450471862606,0.03897911966397384,{"$f":"K150/$D150","v":0.2741069576321033}]
[null,null,"POMORSKIE",0.08493125925161328,0.020784305747586274,0.18669802574535668,0.08024076618887027,0.27908383197900244,0.053343578169165226,{"$f":"K151/$D151","v":0.29491823291840585}]
[null,null,"WARMIŃSKO-MAZURSKIE",0.16227834496052343,0.023705722003625425,0.20274664508873466,0.06481401986574083,0.2181342606962418,0.03349459044460309,{"$f":"K152/$D152","v":0.2948264169405307}]
[null,null,"POLSKA",0.1554885928723629,0.033331188427321606,0.17290455552758763,0.06578318604082409,0.2499069619352204,0.041546158318426896,{"$f":"K153/$D153","v":0.28103935687825643}]
[]
[null,null,"WDBij/PPij","Ogółem","rolnictwo,leśnictwo, łowiectwo i rybactwo (sekcja A)","przemysł bez przetwórstwa przemsyłowego (sekcje B,D,E)","przetwórstwo przemysłowe (sekcja C)","budownictwo (sekcja F)","handel; naprawa pojazd_w samochodowych; transport i gospodarka magazynowa; zakwaterowanie i gastronomia; informacja i komunikacja  (sekcje G,H,I,J)","działalność finansowa i ubezpieczeniowa; obsługa rynku nieruchomości (sekcje K,L)","pozostałe usługi (sekcje M,N,O,P,Q,R,S,T)"]
[null,null,"ŁÓDZKIE",{"$f":"D118/D137*1000000","v":{"v":93385.61557083689,"d":"93,385.62"}},{"$f":"E118/E137*1000000","v":{"v":18373,"d":"18,373.00"}},{"v":286339.3313597027,"d":"286,339.33"},{"v":97969,"d":"97,969.00"},{"v":117583,"d":"117,583.00"},{"v":110919.99999999999,"d":"110,920.00"},{"v":223338.99999999997,"d":"223,339.00"},{"v":83000,"d":"83,000.00"}]
[null,null,"MAZOWIECKIE",{"$f":"D119/D138*1000000","v":{"v":134768.50944542856,"d":"134,768.51"}},{"v":28919,"d":"28,919.00"},{"v":340456.8140016473,"d":"340,456.81"},{"v":150528,"d":"150,528.00"},{"v":160238,"d":"160,238.00"},{"v":165314.00000000003,"d":"165,314.00"},{"v":231146.00000000003,"d":"231,146.00"},{"v":106360.00000000001,"d":"106,360.00"}]
[null,null,"MAŁOPOLSKIE",{"v":89708.08443642993,"d":"89,708.08"},{"v":7665,"d":"7,665.00"},{"v":152038.6185574666,"d":"152,038.62"},{"v":110742,"d":"110,742.00"},{"v":114521.99999999999,"d":"114,522.00"},{"v":108690,"d":"108,690.00"},{"v":220273,"d":"220,273.00"},{"v":88390,"d":"88,390.00"}]
[null,null,"ŚLĄSKIE",{"v":109698.30327772381,"d":"109,698.30"},{"v":18369,"d":"18,369.00"},{"v":155362.2950048265,"d":"155,362.30"},{"v":120100.99999999999,"d":"120,101.00"},{"v":119978.99999999999,"d":"119,979.00"},{"v":114630.00000000001,"d":"114,630.00"},{"v":197928,"d":"197,928.00"},{"v":84273,"d":"84,273.00"}]
[null,null,"LUBELSKIE",{"v":74709.03863413581,"d":"74,709.04"},{"v":12868,"d":"12,868.00"},{"v":168777.10612594563,"d":"168,777.11"},{"v":102493,"d":"102,493.00"},{"v":108194.00000000001,"d":"108,194.00"},{"v":112913,"d":"112,913.00"},{"v":256197,"d":"256,197.00"},{"v":80915,"d":"80,915.00"}]
[null,null,"PODKARPACKIE",{"v":75204.9954555341,"d":"75,205.00"},{"v":5224,"d":"5,224.00"},{"v":154995.9476344889,"d":"154,995.95"},{"v":97546.00000000001,"d":"97,546.00"},{"v":105312,"d":"105,312.00"},{"v":109235,"d":"109,235.00"},{"v":275136,"d":"275,136.00"},{"v":76302.00000000001,"d":"76,302.00"}]
[null,null,"PODLASKIE",{"v":80843.14978240438,"d":"80,843.15"},{"v":21286.000000000004,"d":"21,286.00"},{"v":150102.49979869652,"d":"150,102.50"},{"v":101302,"d":"101,302.00"},{"v":113781,"d":"113,781.00"},{"v":113654,"d":"113,654.00"},{"v":244719,"d":"244,719.00"},{"v":82075.00000000001,"d":"82,075.00"}]
[null,null,"ŚWIĘTOKRZYSKIE",{"v":78930.21968789063,"d":"78,930.22"},{"v":10720,"d":"10,720.00"},{"v":233869.49438299768,"d":"233,869.49"},{"v":97570,"d":"97,570.00"},{"v":120495.99999999999,"d":"120,496.00"},{"v":112913.00000000001,"d":"112,913.00"},{"v":275739,"d":"275,739.00"},{"v":81124,"d":"81,124.00"}]
[null,null,"LUBUSKIE",{"v":97426.30370252914,"d":"97,426.30"},{"v":38499.00000000001,"d":"38,499.00"},{"v":253962.71074812426,"d":"253,962.71"},{"v":106140,"d":"106,140.00"},{"v":112375,"d":"112,375.00"},{"v":99198,"d":"99,198.00"},{"v":217688,"d":"217,688.00"},{"v":78032,"d":"78,032.00"}]
[null,null,"WIELKOPOLSKIE",{"v":99696.55197934921,"d":"99,696.55"},{"v":32192,"d":"32,192.00"},{"v":196402.97202810104,"d":"196,402.97"},{"v":107055,"d":"107,055.00"},{"v":110483,"d":"110,483.00"},{"v":117168.00000000001,"d":"117,168.00"},{"v":217287,"d":"217,287.00"},{"v":87488,"d":"87,488.00"}]
[null,null,"ZACHODNIOPOMORSKIE",{"v":103665.67632428269,"d":"103,665.68"},{"v":41891,"d":"41,891.00"},{"v":178895.88395168772,"d":"178,895.88"},{"v":96890,"d":"96,890.00"},{"v":137541,"d":"137,541.00"},{"v":111538.00000000001,"d":"111,538.00"},{"v":211403.00000000003,"d":"211,403.00"},{"v":89901.00000000001,"d":"89,901.00"}]
[null,null,"DOLNOŚLĄSKIE",{"v":119773.63147515537,"d":"119,773.63"},{"v":23969.000000000004,"d":"23,969.00"},{"v":206783.8918836906,"d":"206,783.89"},{"v":173091,"d":"173,091.00"},{"v":128528,"d":"128,528.00"},{"v":111496,"d":"111,496.00"},{"v":207876.99999999997,"d":"207,877.00"},{"v":90129,"d":"90,129.00"}]
[null,null,"OPOLSKIE",{"v":98318.21773226562,"d":"98,318.22"},{"v":29840,"d":"29,840.00"},{"v":217579.07780157856,"d":"217,579.08"},{"v":106119.99999999999,"d":"106,120.00"},{"v":101277,"d":"101,277.00"},{"v":114148.99999999999,"d":"114,149.00"},{"v":257563,"d":"257,563.00"},{"v":85497.99999999999,"d":"85,498.00"}]
[null,null,"KUJAWSKO-POMORSKIE",{"v":91954.45728884074,"d":"91,954.46"},{"v":27409,"d":"27,409.00"},{"v":167061.2220351265,"d":"167,061.22"},{"v":103724.00000000001,"d":"103,724.00"},{"v":111529.00000000001,"d":"111,529.00"},{"v":110221,"d":"110,221.00"},{"v":173854,"d":"173,854.00"},{"v":81557,"d":"81,557.00"}]
[null,null,"POMORSKIE",{"v":109930.80475440764,"d":"109,930.80"},{"v":32884,"d":"32,884.00"},{"v":218191.53688686198,"d":"218,191.54"},{"v":131073,"d":"131,073.00"},{"v":117399,"d":"117,399.00"},{"v":117373.99999999999,"d":"117,374.00"},{"v":182244,"d":"182,244.00"},{"v":88950,"d":"88,950.00"}]
[null,null,"WARMIŃSKO-MAZURSKIE",{"v":90841.14742658903,"d":"90,841.15"},{"v":38828,"d":"38,828.00"},{"v":144341.52277242855,"d":"144,341.52"},{"v":93893.99999999999,"d":"93,894.00"},{"v":111347,"d":"111,347.00"},{"v":105895.99999999999,"d":"105,896.00"},{"v":222754.99999999997,"d":"222,755.00"},{"v":82436,"d":"82,436.00"}]
[null,null,"POLSKA",{"v":103022.34385826488,"d":"103,022.34"},{"v":20623.000000000004,"d":"20,623.00"},{"v":196043.81556480317,"d":"196,043.82"},{"v":118125.00000000001,"d":"118,125.00"},{"v":122949,"d":"122,949.00"},{"v":122684,"d":"122,684.00"},{"v":219452.99999999997,"d":"219,453.00"},{"v":88927,"d":"88,927.00"}]
[]
[null,null,"WDBi","Ogółem","rolnictwo,leśnictwo, łowiectwo i rybactwo (sekcja A)","przemysł bez przetwórstwa przemsyłowego (sekcje B,D,E)","przetwórstwo przemysłowe (sekcja C)","budownictwo (sekcja F)","handel; naprawa pojazd_w samochodowych; transport i gospodarka magazynowa; zakwaterowanie i gastronomia; informacja i komunikacja  (sekcje G,H,I,J)","działalność finansowa i ubezpieczeniowa; obsługa rynku nieruchomości (sekcje K,L)","pozostałe usługi (sekcje M,N,O,P,Q,R,S,T)"]
[null,null,"ŁÓDZKIE",87565,3208,8009,18070,5816,24228,7583,20651]
[null,null,"MAZOWIECKIE",313108,8724,14088,40964,22174,112578,37146,77434]
[null,null,"MAŁOPOLSKIE",109729,1759,4848,19974,10848,33157,9033,30110]
[null,null,"ŚLĄSKIE",181676,1619,24196,39657,14289,49462,13346,39107]
[null,null,"LUBELSKIE",56648,3342,3177,8570,4190,16336,5588,15445]
[null,null,"PODKARPACKIE",55337,1045,2610,12997,4481,15780,4516,13908]
[null,null,"PODLASKIE",31952,2491,1135,5353,2418,9249,2788,8518]
[null,null,"ŚWIĘTOKRZYSKIE",35556,1466,2626,6666,3337,9976,2695,8790]
[null,null,"LUBUSKIE",31605,1281,2238,7835,2204,8312,2392,7343]
[null,null,"WIELKOPOLSKIE",136598,6518,6052,32238,10735,41139,10077,29839]
[null,null,"ZACHODNIOPOMORSKIE",53920,2031,2651,8320,5319,16356,4442,14801]
[null,null,"DOLNOŚLĄSKIE",122548,2020,9814,34851,8907,29269,9527,28160]
[null,null,"OPOLSKIE",30398,1331,1964,7008,2380,7690,2382,7643]
[null,null,"KUJAWSKO-POMORSKIE",63382,2939,2524,14747,5115,17977,4671,15409]
[null,null,"POMORSKIE",83170,2113,3431,18514,7127,24783,7355,19847]
[null,null,"WARMIŃSKO-MAZURSKIE",38681,2683,1457,8106,3073,9836,3177,10349]
[null,null,"POLSKA",1431872,44568,90819,283871,112412,426127,126720,347355]
[]
[null,null,"PPi","Ogółem","rolnictwo,leśnictwo, łowiectwo i rybactwo (sekcja A)","przemysł bez przetwórstwa przemsyłowego (sekcje B,D,E)","przetwórstwo przemysłowe (sekcja C)","budownictwo (sekcja F)","handel; naprawa pojazd_w samochodowych; transport i gospodarka magazynowa; zakwaterowanie i gastronomia; informacja i komunikacja  (sekcje G,H,I,J)","działalność finansowa i ubezpieczeniowa; obsługa rynku nieruchomości (sekcje K,L)","pozostałe usługi (sekcje M,N,O,P,Q,R,S,T)"]
[null,null,"ŁÓDZKIE",937671.1762806585,174604.03853480652,27970.31047732316,184446.10029703274,49462.93256678261,218427.69563649478,33952.86985255598,248807.22891566265]
[null,null,"MAZOWIECKIE",2323302.389322529,301670.18223313394,41379.69757283764,272135.4166666667,138381.65728478887,680994.9550552282,160703.62454898635,728036.8559608875]
[null,null,"MAŁOPOLSKIE",1223178.4982295274,229484.67058056098,31886.6354219575,180365.17310505497,94724.15780374077,305060.26313368295,41008.20345661974,340649.3947279104]
[null,null,"ŚLĄSKIE",1656142.2972974326,88137.6231694703,155739.20299805253,330197.084120865,119095.84177231016,431492.62845677393,67428.55988036054,464051.35689960007]
[null,null,"LUBELSKIE",758248.279400514,259714.01927261424,18823.643045693912,83615.46642209712,38726.731611734474,144677.76075385473,21811.340491887102,190879.3178026324]
[null,null,"PODKARPACKIE",735815.4822669819,200038.28483920367,16839.149925099307,133239.70229430217,42549.756912792465,144459.1934819426,16413.70086066527,182275.69395297632]
[null,null,"PODLASKIE",395234.4767120194,117025.27482852578,7561.499652052138,52841.99719650155,21251.3512800907,81378.57004592886,11392.65851854576,103783.12519037465]
[null,null,"ŚWIĘTOKRZYSKIE",450473.8507075884,136753.73134328358,11228.484531204042,68320.18038331454,27693.86535652636,88351.20845252539,9773.735307664132,108352.64533307037]
[null,null,"LUBUSKIE",324399.0462421654,33273.59152185771,8812.317341421076,73817.5993970228,19612.90322580645,83792.01193572451,10988.203300135974,94102.41952019684]
[null,null,"WIELKOPOLSKIE",1370137.6555960975,202472.6640159046,30814.197654473828,301134.93064312736,97164.26961614004,351111.22490782465,46376.45142139198,341063.91733723483]
[null,null,"ZACHODNIOPOMORSKIE",520133.5862733359,48482.96770189301,14818.675206165863,85870.57487872845,38672.10504504111,146640.60678871773,21012.0007757695,164636.65587702027]
[null,null,"DOLNOŚLĄSKIE",1023163.4333089425,84275.52254996035,47460.17647022556,201344.95727680816,69300.07469189593,262511.65961110714,45829.98600133733,312441.056707608]
[null,null,"OPOLSKIE",309179.72987242346,44604.557640750674,9026.60320029057,66038.44704108557,23499.906197853412,67368.08907655784,9248.222764915768,89393.90395096962]
[null,null,"KUJAWSKO-POMORSKIE",689275.9945383507,107227.55299354227,15108.23379149771,142175.38853110175,45862.51109576881,163099.59082207564,26867.371472614952,188935.34583174955]
[null,null,"POMORSKIE",756566.8257028322,64256.17321493736,15724.716223888478,141249.53270315015,60707.50176747672,211145.56886533645,40357.98160707623,223125.35132096685]
[null,null,"WARMIŃSKO-MAZURSKIE",425809.2405895585,69099.61883177089,10094.115483990929,86331.39497731485,27598.40857858766,92883.5838936315,14262.306121074724,125539.81270318793]
[null,null,"POLSKA",13898654.858502613,2161082.2867672015,463258.68397505954,2403140.7407407407,914297.7982740811,3473370.6106745787,577435.7151645228,3906069.0229064287]

{"sheet":"2007wyd","index":3,"n_rows":152,"n_cols":14,"rows_kept":152,"hidden":true,"merged":[[0,1,0,9],[1,1,1,9]]}
[null,"PODDEKOMPOZYCJA RÓŻNIC W WYDAJNOŚCI PRACY"]
[null,2007]
[]
[null,null,"Sekcje","Rolnictwo - A","Przemysł pozostały - B, D, E","Przetwórstwo przemysłowe - C","Budownictwo - F","Usługi - G, H, I, J","Usługi - K, L","Usługi  - M, N, O, P, Q, R"]
[null,"ŁÓDZKIE","Roznice w rozwoju infrastruktury i technologii",{"$f":"D41","v":{"v":3.7036028287618446E-3,"d":"0.4%"}},{"v":5.5171694796197455E-3,"d":"0.6%"},{"v":-0.03744601470160577,"d":"-3.7%"},{"v":0.001432898664595371,"d":"0.1%"},{"v":-0.03128815629941827,"d":"-3.1%"},{"v":-0.004172823540262191,"d":"-0.4%"},{"v":-0.0165240028799579,"d":"-1.7%"}]
[null,null,"Specjalizacja sektorowa",{"$f":"D61","v":{"v":0.006602113715017278,"d":"0.7%"}},{"v":-0.008322120039722679,"d":"-0.8%"},{"v":0.029649835191909137,"d":"3.0%"},{"v":-0.011407121429547562,"d":"-1.1%"},{"v":-0.025609221973342956,"d":"-2.6%"},{"v":-0.015962147114653973,"d":"-1.6%"},{"v":-0.01707514583807396,"d":"-1.7%"}]
[null,"MAZOWIECKIE","Roznice w rozwoju infrastruktury i technologii",{"$f":"D42","v":{"v":0.010145806342303177,"d":"1.0%"}},{"v":0.02014756115788174,"d":"2.0%"},{"v":0.011257285522204535,"d":"1.1%"},{"v":0.005427118893953621,"d":"0.5%"},{"v":0.11662791270064808,"d":"11.7%"},{"v":0.013051690468925674,"d":"1.3%"},{"v":0.06096303031819977,"d":"6.1%"}]
[null,null,"Specjalizacja sektorowa",{"$f":"D62","v":{"v":-4.603942769978905E-3,"d":"-0.5%"}},{"v":-0.021794662856476656,"d":"-2.2%"},{"v":-0.052204701264925546,"d":"-5.2%"},{"v":1.283172976420374E-3,"d":"0.1%"},{"v":0.04757583800272792,"d":"4.8%"},{"v":0.05906414078546071,"d":"5.9%"},{"v":0.022278363547564187,"d":"2.2%"}]
[null,"MAŁOPOLSKIE","Roznice w rozwoju infrastruktury i technologii",{"$f":"D43","v":{"v":-0.02100295558275473,"d":"-2.1%"}},{"v":-3.2492692751406723E-3,"d":"-0.3%"},{"v":4.1772347038219445E-3,"d":"0.4%"},{"v":-2.893783863751226E-3,"d":"-0.3%"},{"v":-0.027587432390701473,"d":"-2.8%"},{"v":0.010871050913275197,"d":"1.1%"},{"v":-0.004138104014134051,"d":"-0.4%"}]
[null,null,"Specjalizacja sektorowa",{"$f":"D63","v":{"v":0.008651006096645425,"d":"0.9%"}},{"v":-0.009794173348869324,"d":"-1.0%"},{"v":-0.028004995005900896,"d":"-2.8%"},{"v":0.00682986646980968,"d":"0.7%"},{"v":-0.011142019263250712,"d":"-1.1%"},{"v":-0.0218275375305657,"d":"-2.2%"},{"v":8.2957924183243016E-4,"d":"0.1%"}]
[null,"ŚLĄSKIE","Roznice w rozwoju infrastruktury i technologii",{"$f":"D44","v":{"v":-1.6906082403273868E-3,"d":"-0.2%"}},{"v":-0.025552611064029496,"d":"-2.6%"},{"v":0.029116431426575762,"d":"2.9%"},{"v":-0.005599040825115371,"d":"-0.6%"},{"v":-0.014261641066657884,"d":"-1.4%"},{"v":-0.01255003371494427,"d":"-1.3%"},{"v":-0.01261209053832987,"d":"-1.3%"}]
[null,null,"Specjalizacja sektorowa",{"$f":"D64","v":{"v":-0.021854948770572806,"d":"-2.2%"}},{"v":0.09079794469724363,"d":"9.1%"},{"v":0.019293879541412078,"d":"1.9%"},{"v":0.011013284239702627,"d":"1.1%"},{"v":0.020911297568159053,"d":"2.1%"},{"v":-9.2692007325312754E-4,"d":"-0.1%"},{"v":3.4493844166778934E-3,"d":"0.3%"}]
[null,"LUBELSKIE","Roznice w rozwoju infrastruktury i technologii",{"$f":"D45","v":{"v":-0.03068496193188397,"d":"-3.1%"}},{"v":-0.005345345340141012,"d":"-0.5%"},{"v":-0.01930521394971135,"d":"-1.9%"},{"v":-1.5385123514518534E-3,"d":"-0.2%"},{"v":-0.020761532340373496,"d":"-2.1%"},{"v":0.013773159592767049,"d":"1.4%"},{"v":-0.0230597253537833,"d":"-2.3%"}]
[null,null,"Specjalizacja sektorowa",{"$f":"D65","v":{"v":0.03914359547631986,"d":"3.9%"}},{"v":-0.016364839306365987,"d":"-1.6%"},{"v":-0.07305251355566264,"d":"-7.3%"},{"v":-0.02094926218333297,"d":"-2.1%"},{"v":-0.07382186984129148,"d":"-7.4%"},{"v":-0.030462713959637774,"d":"-3.0%"},{"v":-0.026022324044291615,"d":"-2.6%"}]
[null,"PODKARPACKIE","Roznice w rozwoju infrastruktury i technologii",{"$f":"D46","v":{"v":-0.03683314256792893,"d":"-3.7%"}},{"v":-5.9227871592872515E-3,"d":"-0.6%"},{"v":-0.04307258033898397,"d":"-4.3%"},{"v":-0.008741631993643873,"d":"-0.9%"},{"v":-0.02427670607989576,"d":"-2.4%"},{"v":0.013211936240533132,"d":"1.3%"},{"v":-0.027442526915636773,"d":"-2.7%"}]
[null,null,"Specjalizacja sektorowa",{"$f":"D66","v":{"v":0.022915307549996253,"d":"2.3%"}},{"v":-0.01736983193554627,"d":"-1.7%"},{"v":0.009991828663067505,"d":"1.0%"},{"v":-0.015683389720671216,"d":"-1.6%"},{"v":-0.06418207813655193,"d":"-6.4%"},{"v":-0.04197508390483342,"d":"-4.2%"},{"v":-0.028580360849894893,"d":"-2.9%"}]
[null,"PODLASKIE","Roznice w rozwoju infrastruktury i technologii",{"$f":"D47","v":{"v":-1.3188928985149965E-3,"d":"-0.1%"}},{"v":-2.4933487422225775E-3,"d":"-0.2%"},{"v":-0.011353590692079446,"d":"-1.1%"},{"v":3.6493051154850597E-3,"d":"0.4%"},{"v":-0.0195484730467028,"d":"-2.0%"},{"v":3.5933930569745625E-3,"d":"0.4%"},{"v":-0.014573889696818146,"d":"-1.5%"}]
[null,null,"Specjalizacja sektorowa",{"$f":"D67","v":{"v":0.03143262947038569,"d":"3.1%"}},{"v":-0.02437023410063218,"d":"-2.4%"},{"v":-0.049925275213112415,"d":"-5.0%"},{"v":-0.01961584489800711,"d":"-2.0%"},{"v":-0.05814058005178014,"d":"-5.8%"},{"v":-0.027425148051903468,"d":"-2.7%"},{"v":-0.019028389587171183,"d":"-1.9%"}]
[null,"ŚWIĘTOKRZYSKIE","Roznice w rozwoju infrastruktury i technologii",{"$f":"D48","v":{"v":-0.02504337543870391,"d":"-2.5%"}},{"v":-2.8344835863486103E-3,"d":"-0.3%"},{"v":-9.7525394355476346E-5,"d":"-0.0%"},{"v":0.006196321198884414,"d":"0.6%"},{"v":-0.02585759722130424,"d":"-2.6%"},{"v":0.012684267471558451,"d":"1.3%"},{"v":-0.017086792464494863,"d":"-1.7%"}]
[null,null,"Specjalizacja sektorowa",{"$f":"D68","v":{"v":0.030211799833281743,"d":"3.0%"}},{"v":-0.013282730362031592,"d":"-1.3%"},{"v":-0.030257134364524912,"d":"-3.0%"},{"v":-0.011061002360839456,"d":"-1.1%"},{"v":-0.05419939003368447,"d":"-5.4%"},{"v":-0.04539791852668942,"d":"-4.5%"},{"v":-0.04057582759156183,"d":"-4.1%"}]
[null,"LUBUSKIE","Roznice w rozwoju infrastruktury i technologii",{"$f":"D49","v":{"v":0.016521708258827435,"d":"1.7%"}},{"v":0.01735502557968548,"d":"1.7%"},{"v":-0.014509886768559518,"d":"-1.5%"},{"v":5.2105047727096475E-3,"d":"0.5%"},{"v":-0.04494658827026853,"d":"-4.5%"},{"v":-0.004808326175177323,"d":"-0.5%"},{"v":-0.02356353533461613,"d":"-2.4%"}]
[null,null,"Specjalizacja sektorowa",{"$f":"D69","v":{"v":-0.014012819926856122,"d":"-1.4%"}},{"v":-0.011001494134945397,"d":"-1.1%"},{"v":0.05515162919775947,"d":"5.5%"},{"v":-0.006221846808672937,"d":"-0.6%"},{"v":0.027381534028544506,"d":"2.7%"},{"v":-8.114446666533378E-3,"d":"-0.8%"},{"v":0.011243462151402981,"d":"1.1%"}]
[null,"WIELKOPOLSKIE","Roznice w rozwoju infrastruktury i technologii",{"$f":"D50","v":{"v":0.016373763649156218,"d":"1.6%"}},{"v":-6.9936554237135137E-6,"d":"-0.0%"},{"v":-0.02096136590740088,"d":"-2.1%"},{"v":-2.963164256217306E-3,"d":"-0.3%"},{"v":-0.013052923710717394,"d":"-1.3%"},{"v":-0.002807285269129116,"d":"-0.3%"},{"v":-0.007803551382730869,"d":"-0.8%"}]
[null,null,"Specjalizacja sektorowa",{"$f":"D70","v":{"v":-1.7888075583384103E-3,"d":"-0.2%"}},{"v":-0.01653030841727301,"d":"-1.7%"},{"v":0.054340496383900455,"d":"5.4%"},{"v":3.0879186081393534E-3,"d":"0.3%"},{"v":1.2766908061585722E-3,"d":"0.1%"},{"v":-0.015194217692718975,"d":"-1.5%"},{"v":-0.025887295052372968,"d":"-2.6%"}]
[null,"ZACHODNIOPOMORSKIE","Roznice w rozwoju infrastruktury i technologii",{"$f":"D51","v":{"v":0.016461535125528497,"d":"1.6%"}},{"v":-0.008260145188882791,"d":"-0.8%"},{"v":-0.028402346002323945,"d":"-2.8%"},{"v":0.006728649624054205,"d":"0.7%"},{"v":-0.036650240074355404,"d":"-3.7%"},{"v":-0.014032839023019977,"d":"-1.4%"},{"v":0.005512338639810819,"d":"0.6%"}]
[null,null,"Specjalizacja sektorowa",{"$f":"D71","v":{"v":-0.015466517210415214,"d":"-1.5%"}},{"v":-0.004130303278812384,"d":"-0.4%"},{"v":-0.010239567369971291,"d":"-1.0%"},{"v":0.01143985691664852,"d":"1.1%"},{"v":0.053280057323656344,"d":"5.3%"},{"v":0.007290531112262373,"d":"0.7%"},{"v":0.03117780326301039,"d":"3.1%"}]
[null,"DOLNOŚLĄSKIE","Roznice w rozwoju infrastruktury i technologii",{"$f":"D52","v":{"v":0.004650147602832573,"d":"0.5%"}},{"v":0.011012636972637093,"d":"1.1%"},{"v":0.08576645719280898,"d":"8.6%"},{"v":0.003039732586154959,"d":"0.3%"},{"v":-0.0265673628476877,"d":"-2.7%"},{"v":-0.008785012478925878,"d":"-0.9%"},{"v":-2.2634724438291316E-4,"d":"-0.0%"}]
[null,null,"Specjalizacja sektorowa",{"$f":"D72","v":{"v":-0.01655022975938035,"d":"-1.7%"}},{"v":0.01787601800053419,"d":"1.8%"},{"v":0.022727702282701268,"d":"2.3%"},{"v":0.005911577950916619,"d":"0.6%"},{"v":0.012224742492448482,"d":"1.2%"},{"v":0.010772747294117896,"d":"1.1%"},{"v":0.028565534095148313,"d":"2.9%"}]
[null,"OPOLSKIE","Roznice w rozwoju infrastruktury i technologii",{"$f":"D53","v":{"v":0.008368155469148542,"d":"0.8%"}},{"v":0.021159870293552614,"d":"2.1%"},{"v":0.006664362964315932,"d":"0.7%"},{"v":-0.002284856342751129,"d":"-0.2%"},{"v":-0.02337444582879282,"d":"-2.3%"},{"v":0.005760264835114793,"d":"0.6%"},{"v":-0.01646012010100064,"d":"-1.6%"}]
[null,null,"Specjalizacja sektorowa",{"$f":"D73","v":{"v":-7.5353133163790637E-4,"d":"-0.1%"}},{"v":-0.006831236865455311,"d":"-0.7%"},{"v":0.02274461987806749,"d":"2.3%"},{"v":0.006760910455912755,"d":"0.7%"},{"v":-0.02496309906203445,"d":"-2.5%"},{"v":-0.017150360133716406,"d":"-1.7%"},{"v":8.249464142538741E-3,"d":"0.8%"}]
[null,"KUJAWSKO-POMORSKIE","Roznice w rozwoju infrastruktury i technologii",{"$f":"D54","v":{"v":0.008646718552910883,"d":"0.9%"}},{"v":-0.008652368264151817,"d":"-0.9%"},{"v":-0.02034680930152699,"d":"-2.0%"},{"v":-2.3679008909231581E-4,"d":"-0.0%"},{"v":-0.02000099831604007,"d":"-2.0%"},{"v":-0.01859223845490007,"d":"-1.9%"},{"v":-0.01979715916139035,"d":"-2.0%"}]
[null,null,"Specjalizacja sektorowa",{"$f":"D74","v":{"v":1.73356700026168e-05,"d":"0.0%"}},{"v":-0.016821453528726153,"d":"-1.7%"},{"v":0.03233211027909875,"d":"3.2%"},{"v":-9.6077719826393739E-4,"d":"-0.1%"},{"v":-0.010460616406441171,"d":"-1.0%"},{"v":-3.1676282381597628E-3,"d":"-0.3%"},{"v":-0.007277655487109219,"d":"-0.7%"}]
[null,"POMORSKIE","Roznice w rozwoju infrastruktury i technologii",{"$f":"D55","v":{"v":6.946668884808339E-3,"d":"0.7%"}},{"v":-2.0280700798768108E-3,"d":"-0.2%"},{"v":2.50482455119754E-3,"d":"0.3%"},{"v":-1.9758369637959323E-3,"d":"-0.2%"},{"v":-0.004774198480713565,"d":"-0.5%"},{"v":-0.01309141927743911,"d":"-1.3%"},{"v":9.6957490196423882E-4,"d":"0.1%"}]
[null,null,"Specjalizacja sektorowa",{"$f":"D75","v":{"v":-0.015828988389695226,"d":"-1.6%"}},{"v":-0.014896835631250802,"d":"-1.5%"},{"v":0.03095462419920252,"d":"3.1%"},{"v":0.012404792962317038,"d":"1.2%"},{"v":0.03287748018045542,"d":"3.3%"},{"v":0.022359005682082697,"d":"2.2%"},{"v":0.014226129860574272,"d":"1.4%"}]
[null,"WARMIŃSKO-MAZURSKIE","Roznice w rozwoju infrastruktury i technologii",{"$f":"D56","v":{"v":0.021707909694848104,"d":"2.2%"}},{"v":-0.011946167538353317,"d":"-1.2%"},{"v":-0.03969028096890888,"d":"-4.0%"},{"v":0.000553999998332314,"d":"0.1%"},{"v":-0.043989004762246015,"d":"-4.4%"},{"v":-0.005941159175511241,"d":"-0.6%"},{"v":-0.022253805421929163,"d":"-2.2%"}]
[null,null,"Specjalizacja sektorowa",{"$f":"D76","v":{"v":-1.3840696375117846E-3,"d":"-0.1%"}},{"v":-0.010771891749683495,"d":"-1.1%"},{"v":0.02909079786341503,"d":"2.9%"},{"v":-0.004360166902201874,"d":"-0.4%"},{"v":-0.02448984926455932,"d":"-2.4%"},{"v":-0.008762841643045166,"d":"-0.9%"},{"v":0.013408920971932971,"d":"1.3%"}]
[]
[]
[]
[null,null,"Roznice wynikajace w rozwoju infrastruktury i technologii","rolnictwo,leśnictwo, łowiectwo i rybactwo (sekcja A)","przemysł bez przetwórstwa przemsyłowego (sekcje B,D,E)","przetwórstwo przemysłowe (sekcja C)","budownictwo (sekcja F)","handel; naprawa pojazd_w samochodowych; transport i gospodarka magazynowa; zakwaterowanie i gastronomia; informacja i komunikacja  (sekcje G,H,I,J)","działalność finansowa i ubezpieczeniowa; obsługa rynku nieruchomości (sekcje K,L)","pozostałe usługi (sekcje M,N,O,P,Q,R,S,T)","SUMA (*)"]
[null,null,"ŁÓDZKIE",{"$f":"D79*(E98-E$114)/$D$114","v":{"v":3.7036028287618446E-3,"d":"0.4%"}},{"v":5.5171694796197455E-3,"d":"0.6%"},{"v":-0.03744601470160577,"d":"-3.7%"},{"v":0.001432898664595371,"d":"0.1%"},{"v":-0.03128815629941827,"d":"-3.1%"},{"v":-0.004172823540262191,"d":"-0.4%"},{"v":-0.0165240028799579,"d":"-1.7%"},{"$f":"SUM(D41:J41)","v":{"v":-0.07877732644826718,"d":"-7.9%"}}]
[null,null,"MAZOWIECKIE",{"v":0.010145806342303177,"d":"1.0%"},{"v":0.02014756115788174,"d":"2.0%"},{"v":0.011257285522204535,"d":"1.1%"},{"v":0.005427118893953621,"d":"0.5%"},{"v":0.11662791270064808,"d":"11.7%"},{"v":0.013051690468925674,"d":"1.3%"},{"v":0.06096303031819977,"d":"6.1%"},{"v":0.2376204054041166,"d":"23.8%"}]
[null,null,"MAŁOPOLSKIE",{"v":-0.02100295558275473,"d":"-2.1%"},{"v":-3.2492692751406723E-3,"d":"-0.3%"},{"v":4.1772347038219445E-3,"d":"0.4%"},{"v":-2.893783863751226E-3,"d":"-0.3%"},{"v":-0.027587432390701473,"d":"-2.8%"},{"v":0.010871050913275197,"d":"1.1%"},{"v":-0.004138104014134051,"d":"-0.4%"},{"v":-0.04382325950938502,"d":"-4.4%"}]
[null,null,"ŚLĄSKIE",{"v":-1.6906082403273868E-3,"d":"-0.2%"},{"v":-0.025552611064029496,"d":"-2.6%"},{"v":0.029116431426575762,"d":"2.9%"},{"v":-0.005599040825115371,"d":"-0.6%"},{"v":-0.014261641066657884,"d":"-1.4%"},{"v":-0.01255003371494427,"d":"-1.3%"},{"v":-0.01261209053832987,"d":"-1.3%"},{"v":-0.043149594022828516,"d":"-4.3%"}]
[null,null,"LUBELSKIE",{"v":-0.03068496193188397,"d":"-3.1%"},{"v":-0.005345345340141012,"d":"-0.5%"},{"v":-0.01930521394971135,"d":"-1.9%"},{"v":-1.5385123514518534E-3,"d":"-0.2%"},{"v":-0.020761532340373496,"d":"-2.1%"},{"v":0.013773159592767049,"d":"1.4%"},{"v":-0.0230597253537833,"d":"-2.3%"},{"v":-0.08692213167457793,"d":"-8.7%"}]
[null,null,"PODKARPACKIE",{"v":-0.03683314256792893,"d":"-3.7%"},{"v":-5.9227871592872515E-3,"d":"-0.6%"},{"v":-0.04307258033898397,"d":"-4.3%"},{"v":-0.008741631993643873,"d":"-0.9%"},{"v":-0.02427670607989576,"d":"-2.4%"},{"v":0.013211936240533132,"d":"1.3%"},{"v":-0.027442526915636773,"d":"-2.7%"},{"v":-0.13307743881484344,"d":"-13.3%"}]
[null,null,"PODLASKIE",{"v":-1.3188928985149965E-3,"d":"-0.1%"},{"v":-2.4933487422225775E-3,"d":"-0.2%"},{"v":-0.011353590692079446,"d":"-1.1%"},{"v":3.6493051154850597E-3,"d":"0.4%"},{"v":-0.0195484730467028,"d":"-2.0%"},{"v":3.5933930569745625E-3,"d":"0.4%"},{"v":-0.014573889696818146,"d":"-1.5%"},{"v":-0.04204549690387834,"d":"-4.2%"}]
[null,null,"ŚWIĘTOKRZYSKIE",{"v":-0.02504337543870391,"d":"-2.5%"},{"v":-2.8344835863486103E-3,"d":"-0.3%"},{"v":-9.7525394355476346E-5,"d":"-0.0%"},{"v":0.006196321198884414,"d":"0.6%"},{"v":-0.02585759722130424,"d":"-2.6%"},{"v":0.012684267471558451,"d":"1.3%"},{"v":-0.017086792464494863,"d":"-1.7%"},{"v":-0.05203918543476423,"d":"-5.2%"}]
[null,null,"LUBUSKIE",{"v":0.016521708258827435,"d":"1.7%"},{"v":0.01735502557968548,"d":"1.7%"},{"v":-0.014509886768559518,"d":"-1.5%"},{"v":5.2105047727096475E-3,"d":"0.5%"},{"v":-0.04494658827026853,"d":"-4.5%"},{"v":-0.004808326175177323,"d":"-0.5%"},{"v":-0.02356353533461613,"d":"-2.4%"},{"v":-0.04874109793739893,"d":"-4.9%"}]
[null,null,"WIELKOPOLSKIE",{"v":0.016373763649156218,"d":"1.6%"},{"v":-6.9936554237135137E-6,"d":"-0.0%"},{"v":-0.02096136590740088,"d":"-2.1%"},{"v":-2.963164256217306E-3,"d":"-0.3%"},{"v":-0.013052923710717394,"d":"-1.3%"},{"v":-0.002807285269129116,"d":"-0.3%"},{"v":-0.007803551382730869,"d":"-0.8%"},{"v":-0.03122152053246306,"d":"-3.1%"}]
[null,null,"ZACHODNIOPOMORSKIE",{"$f":"D89*(E108-E$114)/$D$114","v":{"v":0.016461535125528497,"d":"1.6%"}},{"v":-0.008260145188882791,"d":"-0.8%"},{"v":-0.028402346002323945,"d":"-2.8%"},{"v":0.006728649624054205,"d":"0.7%"},{"v":-0.036650240074355404,"d":"-3.7%"},{"v":-0.014032839023019977,"d":"-1.4%"},{"v":0.005512338639810819,"d":"0.6%"},{"v":-0.0586430468991886,"d":"-5.9%"}]
[null,null,"DOLNOŚLĄSKIE",{"v":0.004650147602832573,"d":"0.5%"},{"v":0.011012636972637093,"d":"1.1%"},{"v":0.08576645719280898,"d":"8.6%"},{"v":0.003039732586154959,"d":"0.3%"},{"v":-0.0265673628476877,"d":"-2.7%"},{"v":-0.008785012478925878,"d":"-0.9%"},{"v":-2.2634724438291316E-4,"d":"-0.0%"},{"v":0.06889025178343712,"d":"6.9%"}]
[null,null,"OPOLSKIE",{"v":0.008368155469148542,"d":"0.8%"},{"v":0.021159870293552614,"d":"2.1%"},{"v":0.006664362964315932,"d":"0.7%"},{"v":-0.002284856342751129,"d":"-0.2%"},{"v":-0.02337444582879282,"d":"-2.3%"},{"v":0.005760264835114793,"d":"0.6%"},{"v":-0.01646012010100064,"d":"-1.6%"},{"v":-1.6676871041271246E-4,"d":"-0.0%"}]
[null,null,"KUJAWSKO-POMORSKIE",{"v":0.008646718552910883,"d":"0.9%"},{"v":-0.008652368264151817,"d":"-0.9%"},{"v":-0.02034680930152699,"d":"-2.0%"},{"v":-2.3679008909231581E-4,"d":"-0.0%"},{"v":-0.02000099831604007,"d":"-2.0%"},{"v":-0.01859223845490007,"d":"-1.9%"},{"v":-0.01979715916139035,"d":"-2.0%"},{"v":-0.07897964503419073,"d":"-7.9%"}]
[null,null,"POMORSKIE",{"v":6.946668884808339E-3,"d":"0.7%"},{"v":-2.0280700798768108E-3,"d":"-0.2%"},{"v":2.50482455119754E-3,"d":"0.3%"},{"v":-1.9758369637959323E-3,"d":"-0.2%"},{"v":-0.004774198480713565,"d":"-0.5%"},{"v":-0.01309141927743911,"d":"-1.3%"},{"v":9.6957490196423882E-4,"d":"0.1%"},{"v":-0.0114484564638553,"d":"-1.1%"}]
[null,null,"WARMIŃSKO-MAZURSKIE",{"v":0.021707909694848104,"d":"2.2%"},{"v":-0.011946167538353317,"d":"-1.2%"},{"v":-0.03969028096890888,"d":"-4.0%"},{"v":0.000553999998332314,"d":"0.1%"},{"v":-0.043989004762246015,"d":"-4.4%"},{"v":-0.005941159175511241,"d":"-0.6%"},{"v":-0.022253805421929163,"d":"-2.2%"},{"v":-0.1015585081737682,"d":"-10.2%"}]
[{"$nulls":3},{"$f":"COUNTIF(D41:D56,\">0\")","v":10},5,6,8,1,7,3]
[]
[]
[null,null,"Specjalizacja sektorowa","rolnictwo,leśnictwo, łowiectwo i rybactwo (sekcja A)","przemysł bez przetwórstwa przemsyłowego (sekcje B,D,E)","przetwórstwo przemysłowe (sekcja C)","budownictwo (sekcja F)","handel; naprawa pojazd_w samochodowych; transport i gospodarka magazynowa; zakwaterowanie i gastronomia; informacja i komunikacja  (sekcje G,H,I,J)","działalność finansowa i ubezpieczeniowa; obsługa rynku nieruchomości (sekcje K,L)","pozostałe usługi (sekcje M,N,O,P,Q,R,S,T)","SUMA (**)",null,"(WDBi/Pi-WDB/P)/(WDB/P)","Weryfikacja"]
[null,null,"ŁÓDZKIE",{"$f":"E$114*(D79-D$95)/$D$114","v":{"v":0.006602113715017278,"d":"0.7%"}},{"v":-0.008322120039722679,"d":"-0.8%"},{"v":0.029649835191909137,"d":"3.0%"},{"v":-0.011407121429547562,"d":"-1.1%"},{"v":-0.025609221973342956,"d":"-2.6%"},{"v":-0.015962147114653973,"d":"-1.6%"},{"v":-0.01707514583807396,"d":"-1.7%"},{"$f":"SUM(D61:J61)","v":{"v":-0.04212380748841472,"d":"-4.2%"}},null,{"$f":"(D98-$D$114)/$D$114","v":{"v":-0.12090113393668189,"d":"-12.1%"}},{"$f":"K41+K61","v":{"v":-0.12090113393668189,"d":"-12.1%"}}]
[null,null,"MAZOWIECKIE",{"v":-4.603942769978905E-3,"d":"-0.5%"},{"v":-0.021794662856476656,"d":"-2.2%"},{"v":-0.052204701264925546,"d":"-5.2%"},{"v":1.283172976420374E-3,"d":"0.1%"},{"v":0.04757583800272792,"d":"4.8%"},{"v":0.05906414078546071,"d":"5.9%"},{"v":0.022278363547564187,"d":"2.2%"},{"v":0.05159820842079209,"d":"5.2%"},null,{"v":0.2892186138249086,"d":"28.9%"},{"v":0.2892186138249087,"d":"28.9%"}]
[null,null,"MAŁOPOLSKIE",{"v":0.008651006096645425,"d":"0.9%"},{"v":-0.009794173348869324,"d":"-1.0%"},{"v":-0.028004995005900896,"d":"-2.8%"},{"v":0.00682986646980968,"d":"0.7%"},{"v":-0.011142019263250712,"d":"-1.1%"},{"v":-0.0218275375305657,"d":"-2.2%"},{"v":8.2957924183243016E-4,"d":"0.1%"},{"v":-0.05445827334029909,"d":"-5.4%"},null,{"v":-0.09828153284968426,"d":"-9.8%"},{"v":-0.0982815328496841,"d":"-9.8%"}]
[null,null,"ŚLĄSKIE",{"v":-0.021854948770572806,"d":"-2.2%"},{"v":0.09079794469724363,"d":"9.1%"},{"v":0.019293879541412078,"d":"1.9%"},{"v":0.011013284239702627,"d":"1.1%"},{"v":0.020911297568159053,"d":"2.1%"},{"v":-9.2692007325312754E-4,"d":"-0.1%"},{"v":3.4493844166778934E-3,"d":"0.3%"},{"v":0.12268392161936936,"d":"12.3%"},null,{"v":0.07953432759654065,"d":"8.0%"},{"v":0.07953432759654085,"d":"8.0%"}]
[null,null,"LUBELSKIE",{"v":0.03914359547631986,"d":"3.9%"},{"v":-0.016364839306365987,"d":"-1.6%"},{"v":-0.07305251355566264,"d":"-7.3%"},{"v":-0.02094926218333297,"d":"-2.1%"},{"v":-0.07382186984129148,"d":"-7.4%"},{"v":-0.030462713959637774,"d":"-3.0%"},{"v":-0.026022324044291615,"d":"-2.6%"},{"v":-0.20152992741426262,"d":"-20.2%"},null,{"v":-0.28845205908884064,"d":"-28.8%"},{"v":-0.28845205908884053,"d":"-28.8%"}]
[null,null,"PODKARPACKIE",{"v":0.022915307549996253,"d":"2.3%"},{"v":-0.01736983193554627,"d":"-1.7%"},{"v":0.009991828663067505,"d":"1.0%"},{"v":-0.015683389720671216,"d":"-1.6%"},{"v":-0.06418207813655193,"d":"-6.4%"},{"v":-0.04197508390483342,"d":"-4.2%"},{"v":-0.028580360849894893,"d":"-2.9%"},{"v":-0.13488360833443397,"d":"-13.5%"},null,{"v":-0.2679610471492775,"d":"-26.8%"},{"v":-0.2679610471492774,"d":"-26.8%"}]
[null,null,"PODLASKIE",{"v":0.03143262947038569,"d":"3.1%"},{"v":-0.02437023410063218,"d":"-2.4%"},{"v":-0.049925275213112415,"d":"-5.0%"},{"v":-0.01961584489800711,"d":"-2.0%"},{"v":-0.05814058005178014,"d":"-5.8%"},{"v":-0.027425148051903468,"d":"-2.7%"},{"v":-0.019028389587171183,"d":"-1.9%"},{"v":-0.1670728424322208,"d":"-16.7%"},null,{"v":-0.20911833933609925,"d":"-20.9%"},{"v":-0.20911833933609913,"d":"-20.9%"}]
[null,null,"ŚWIĘTOKRZYSKIE",{"v":0.030211799833281743,"d":"3.0%"},{"v":-0.013282730362031592,"d":"-1.3%"},{"v":-0.030257134364524912,"d":"-3.0%"},{"v":-0.011061002360839456,"d":"-1.1%"},{"v":-0.05419939003368447,"d":"-5.4%"},{"v":-0.04539791852668942,"d":"-4.5%"},{"v":-0.04057582759156183,"d":"-4.1%"},{"v":-0.16456220340604993,"d":"-16.5%"},null,{"v":-0.2166013888408142,"d":"-21.7%"},{"v":-0.21660138884081417,"d":"-21.7%"}]
[null,null,"LUBUSKIE",{"v":-0.014012819926856122,"d":"-1.4%"},{"v":-0.011001494134945397,"d":"-1.1%"},{"v":0.05515162919775947,"d":"5.5%"},{"v":-0.006221846808672937,"d":"-0.6%"},{"v":0.027381534028544506,"d":"2.7%"},{"v":-8.114446666533378E-3,"d":"-0.8%"},{"v":0.011243462151402981,"d":"1.1%"},{"v":0.05442601784069913,"d":"5.4%"},null,{"v":0.005684919903300053,"d":"0.6%"},{"v":0.005684919903300195,"d":"0.6%"}]
[null,null,"WIELKOPOLSKIE",{"v":-1.7888075583384103E-3,"d":"-0.2%"},{"v":-0.01653030841727301,"d":"-1.7%"},{"v":0.054340496383900455,"d":"5.4%"},{"v":3.0879186081393534E-3,"d":"0.3%"},{"v":1.2766908061585722E-3,"d":"0.1%"},{"v":-0.015194217692718975,"d":"-1.5%"},{"v":-0.025887295052372968,"d":"-2.6%"},{"v":-6.9552292250498263E-4,"d":"-0.1%"},null,{"v":-0.031917043454968035,"d":"-3.2%"},{"v":-0.03191704345496804,"d":"-3.2%"}]
[null,null,"ZACHODNIOPOMORSKIE",{"$f":"E$114*(D89-D$95)/$D$114","v":{"v":-0.015466517210415214,"d":"-1.5%"}},{"v":-0.004130303278812384,"d":"-0.4%"},{"v":-0.010239567369971291,"d":"-1.0%"},{"v":0.01143985691664852,"d":"1.1%"},{"v":0.053280057323656344,"d":"5.3%"},{"v":0.007290531112262373,"d":"0.7%"},{"v":0.03117780326301039,"d":"3.1%"},{"v":0.07335186075637874,"d":"7.3%"},null,{"v":0.014708813857190074,"d":"1.5%"},{"v":0.01470881385719014,"d":"1.5%"}]
[null,null,"DOLNOŚLĄSKIE",{"v":-0.01655022975938035,"d":"-1.7%"},{"v":0.01787601800053419,"d":"1.8%"},{"v":0.022727702282701268,"d":"2.3%"},{"v":0.005911577950916619,"d":"0.6%"},{"v":0.012224742492448482,"d":"1.2%"},{"v":0.010772747294117896,"d":"1.1%"},{"v":0.028565534095148313,"d":"2.9%"},{"v":0.08152809235648642,"d":"8.2%"},null,{"v":0.1504183441399234,"d":"15.0%"},{"v":0.15041834413992355,"d":"15.0%"}]
[null,null,"OPOLSKIE",{"v":-7.5353133163790637E-4,"d":"-0.1%"},{"v":-0.006831236865455311,"d":"-0.7%"},{"v":0.02274461987806749,"d":"2.3%"},{"v":0.006760910455912755,"d":"0.7%"},{"v":-0.02496309906203445,"d":"-2.5%"},{"v":-0.017150360133716406,"d":"-1.7%"},{"v":8.249464142538741E-3,"d":"0.8%"},{"v":-0.011943232916325085,"d":"-1.2%"},null,{"v":-0.012110001626737775,"d":"-1.2%"},{"v":-0.012110001626737798,"d":"-1.2%"}]
[null,null,"KUJAWSKO-POMORSKIE",{"v":1.73356700026168e-05,"d":"0.0%"},{"v":-0.016821453528726153,"d":"-1.7%"},{"v":0.03233211027909875,"d":"3.2%"},{"v":-9.6077719826393739E-4,"d":"-0.1%"},{"v":-0.010460616406441171,"d":"-1.0%"},{"v":-3.1676282381597628E-3,"d":"-0.3%"},{"v":-0.007277655487109219,"d":"-0.7%"},{"v":-6.3386849095988795E-3,"d":"-0.6%"},null,{"v":-0.08531832994378973,"d":"-8.5%"},{"v":-0.08531832994378961,"d":"-8.5%"}]
[null,null,"POMORSKIE",{"v":-0.015828988389695226,"d":"-1.6%"},{"v":-0.014896835631250802,"d":"-1.5%"},{"v":0.03095462419920252,"d":"3.1%"},{"v":0.012404792962317038,"d":"1.2%"},{"v":0.03287748018045542,"d":"3.3%"},{"v":0.022359005682082697,"d":"2.2%"},{"v":0.014226129860574272,"d":"1.4%"},{"v":0.08209620886368592,"d":"8.2%"},null,{"v":0.07064775239983052,"d":"7.1%"},{"v":0.07064775239983062,"d":"7.1%"}]
[null,null,"WARMIŃSKO-MAZURSKIE",{"v":-1.3840696375117846E-3,"d":"-0.1%"},{"v":-0.010771891749683495,"d":"-1.1%"},{"v":0.02909079786341503,"d":"2.9%"},{"v":-0.004360166902201874,"d":"-0.4%"},{"v":-0.02448984926455932,"d":"-2.4%"},{"v":-0.008762841643045166,"d":"-0.9%"},{"v":0.013408920971932971,"d":"1.3%"},{"v":-0.00726910036165364,"d":"-0.7%"},null,{"v":-0.10882760853542191,"d":"-10.9%"},{"v":-0.10882760853542184,"d":"-10.9%"}]
[{"$nulls":3},{"$f":"COUNTIF(D61:D76,\">0\")","v":7},2,10,8,7,4,9]
[null,null,"Ppij/PPi","rolnictwo,leśnictwo, łowiectwo i rybactwo (sekcja A)","przemysł bez przetwórstwa przemsyłowego (sekcje B,D,E)","przetwórstwo przemysłowe (sekcja C)","budownictwo (sekcja F)","handel; naprawa pojazd_w samochodowych; transport i gospodarka magazynowa; zakwaterowanie i gastronomia; informacja i komunikacja  (sekcje G,H,I,J)","działalność finansowa i ubezpieczeniowa; obsługa rynku nieruchomości (sekcje K,L)","pozostałe usługi (sekcje M,N,O,P,Q,R,S,T)"]
[null,null,"ŁÓDZKIE",{"$f":"E136/$D136","v":0.20339445194207864},{"$f":"F136/$D136","v":0.02868355948029498},0.2168653498106848,0.049124774537829444,0.22778769456538678,0.03215346205271127,0.24199070761101413]
[null,null,"MAZOWIECKIE",{"$f":"E137/$D137","v":0.14685723107726986},0.019418416384864787,0.14072812049383876,0.05952328437123559,0.28883937727259185,0.05987526727514266,0.28475830312505646]
[null,null,"MAŁOPOLSKIE",{"$f":"E138/$D138","v":0.21373160143471517},0.027671220181110533,0.16323754592825315,0.0640682811214114,0.23985637456382036,0.02998623220282325,0.26144874456786604]
[null,null,"ŚLĄSKIE",{"$f":"E139/$D139","v":0.059821801825098705},0.09684898273463828,0.20723272828123815,0.06749620087061912,0.26659556053353317,0.03770889665013736,0.2642958291047352]
[null,null,"LUBELSKIE",{"$f":"E140/$D140","v":0.36757396898005096},0.02315253642879226,0.12133646874376797,0.04130588229736886,0.18756823883124354,0.026795581489212496,0.23226732322956384]
[null,null,"PODKARPACKIE",{"$f":"E141/$D141","v":0.2856983957151193},0.022461397373169545,0.1985803992656683,0.04562077246719028,0.19560984602147793,0.02254182342385046,0.22948736573352413]
[null,null,"PODLASKIE",{"$f":"E142/$D142","v":0.328670311057013},0.01764718162583319,0.14284833510294853,0.042398493099760806,0.20064972197796788,0.027917945567208946,0.2398680115692678]
[null,null,"ŚWIĘTOKRZYSKIE",{"$f":"E143/$D143","v":0.3225109351049406},0.02527211999912258,0.16114271211422898,0.0494083867555096,0.20393750069335398,0.02127710465191797,0.21645124068092636]
[null,null,"LUBUSKIE",{"$f":"E144/$D144","v":0.09938720746812128},0.02684093891964209,0.24058591585699432,0.05337362231150436,0.27199309417700085,0.035053144675373106,0.27276607659136404]
[null,null,"WIELKOPOLSKIE",{"$f":"E145/$D145","v":0.16106025793492657},0.023038742395158116,0.23983143836889848,0.061002104688390804,0.2502161822491355,0.03243720779644043,0.2324140665670501]
[null,null,"ZACHODNIOPOMORSKIE",{"$f":"E146/$D146","v":0.09205295884094412},0.03156629532666834,0.17976210884654534,0.06784573729853668,0.29359789203212744,0.04074520015875531,0.29442980749642284]
[null,null,"DOLNOŚLĄSKIE",{"$f":"E147/$D147","v":0.08658537121840792},0.04670016563091439,0.21042670824623136,0.06331582953217775,0.2593491525306656,0.04203186009406113,0.2915909127475418]
[null,null,"OPOLSKIE",{"$f":"E148/$D148","v":0.16628347278873534},0.029708848183106058,0.21044244419555858,0.06401177811481114,0.22832669652813656,0.03171442380626278,0.2695123363833895]
[null,null,"KUJAWSKO-POMORSKIE",{"$f":"E149/$D149","v":0.17017268019970067},0.02283852027259089,0.21936027559298293,0.057684576992929615,0.2404248073972883,0.036880967173064584,0.2526381723714431]
[null,null,"POMORSKIE",{"$f":"E150/$D150","v":0.09022420551032154},0.02416209077198912,0.21807900300766778,0.0686364121748243,0.2765778654507015,0.046312919537059793,0.27600750354743586]
[null,null,"WARMIŃSKO-MAZURSKIE",{"$f":"E151/$D151","v":0.16310225703182352},0.026998837764977968,0.21634535965352744,0.054899094943958816,0.22872148607242535,0.03481356625893868,0.27511939827434817]
[null,null,"POLSKA",{"$f":"E152/$D152","v":0.1700852176204169},0.034406728007137,0.1892864714866529,0.05847184408258528,0.24915115446835231,0.03805138857459049,0.2605471957602651]
[]
[null,null,"WDBij/PPij","Ogółem","rolnictwo,leśnictwo, łowiectwo i rybactwo (sekcja A)","przemysł bez przetwórstwa przemsyłowego (sekcje B,D,E)","przetwórstwo przemysłowe (sekcja C)","budownictwo (sekcja F)","handel; naprawa pojazd_w samochodowych; transport i gospodarka magazynowa; zakwaterowanie i gastronomia; informacja i komunikacja  (sekcje G,H,I,J)","działalność finansowa i ubezpieczeniowa; obsługa rynku nieruchomości (sekcje K,L)","pozostałe usługi (sekcje M,N,O,P,Q,R,S,T)"]
[null,null,"ŁÓDZKIE",{"$f":"D117/D136*1000000","v":66817.23581625754},{"$f":"E117/E136*1000000","v":16449},125141.42263255575,68590,94975,80672.00000000001,195840,64749]
[null,null,"MAZOWIECKIE",{"$f":"D118/D137*1000000","v":97989.0060880173},20315.999999999996,189382.35829730335,87794,99688.00000000001,121801.99999999999,222272,86211]
[null,null,"MAŁOPOLSKIE",68536.47272833284,7596,101596.87150098945,83659,89325,82370,233259,68736]
[null,null,"ŚLĄSKIE",82051.63551373268,12917,90468.33250645011,92393,86453,87046,180407.99999999997,66312]
[null,null,"LUBELSKIE",54082.274926980775,8720,92973.85634982688,69621,89927,82699,244772,62393.00000000001]
[null,null,"PODKARPACKIE",55639.72520900733,5266,90479.91290426033,65227.99999999999,78194,81679,250251.99999999997,60850]
[null,null,"PODLASKIE",60112.15400603991,14759.999999999998,99783.00373142652,75673,99299.99999999999,83707,215487,65321.00000000001]
[null,null,"ŚWIĘTOKRZYSKIE",59543.393537015196,9163.000000000002,101997.09298160317,81668,102290,81475,251015,63938.99999999999]
[null,null,"LUBUSKIE",76438.59984821426,27700.000000000004,159666.75743617382,77130,100178,78552,195278,63373.000000000015]
[null,null,"WIELKOPOLSKIE",73580.60588433317,22792,110498.79797928265,75071,89065.99999999999,87147,199126,67387]
[null,null,"ZACHODNIOPOMORSKIE",77124.47452462926,28657,90632.7834034378,69705,100296,81624,179527,71362]
[null,null,"DOLNOŚLĄSKIE",87439.28215033017,19146.999999999996,128445.40636139282,112693,96406.99999999999,83326,189818,69880]
[null,null,"OPOLSKIE",75086.06998598293,18890,164656.84949581453,84121.00000000001,90045,83330.99999999999,219508.99999999997,65296.99999999999]
[null,null,"KUJAWSKO-POMORSKIE",69521.76052579744,18927,81726.82176433537,74664.00000000001,92446,84789,167387.99999999997,63983]
[null,null,"POMORSKIE",81376.19795666191,20916.999999999996,104142.18562284525,82587.00000000001,90570,89799.99999999999,184219,70206]
[null,null,"WARMIŃSKO-MAZURSKIE",67734.90233251882,25181.000000000004,76891.29366201736,67770,93525.00000000001,76494,192733.00000000003,63791]
[null,null,"POLSKA",76006.50893280182,15064.999999999998,110521.87056390199,81714,92758,91112,205704,69939]
[]
[null,null,"WDBi","Ogółem","rolnictwo,leśnictwo, łowiectwo i rybactwo (sekcja A)","przemysł bez przetwórstwa przemsyłowego (sekcje B,D,E)","przetwórstwo przemysłowe (sekcja C)","budownictwo (sekcja F)","handel; naprawa pojazd_w samochodowych; transport i gospodarka magazynowa; zakwaterowanie i gastronomia; informacja i komunikacja  (sekcje G,H,I,J)","działalność finansowa i ubezpieczeniowa; obsługa rynku nieruchomości (sekcje K,L)","pozostałe usługi (sekcje M,N,O,P,Q,R,S,T)"]
[null,null,"ŁÓDZKIE",64388,3224,3459,14334,4496,17708,6068,15099]
[null,null,"MAZOWIECKIE",217454,6621,8161,27418,13168,78073,29534,54479]
[null,null,"MAŁOPOLSKIE",79280,1878,3252,15797,6620,22854,8091,20788]
[null,null,"ŚLĄSKIE",133794,1260,14287,31221,9515,37840,11093,28578]
[null,null,"LUBELSKIE",41204,2442,1640,6436,2830,11818,4997,11041]
[null,null,"PODKARPACKIE",40163,1086,1467,9350,2575,11533,4072,10080]
[null,null,"PODLASKIE",24101,1945,706,4334,1688,6734,2412,6282]
[null,null,"ŚWIĘTOKRZYSKIE",27604,1370,1195,6101,2343,7703,2476,6416]
[null,null,"LUBUSKIE",24489,882,1373,5945,1713,6845,2193,5538]
[null,null,"WIELKOPOLSKIE",97115,4845,3360,23763,7171,28780,8525,20671]
[null,null,"ZACHODNIOPOMORSKIE",40814,1396,1514,6631,3601,12682,3871,11119]
[null,null,"DOLNOŚLĄSKIE",85232,1616,5847,23115,5950,21065,7777,19862]
[null,null,"OPOLSKIE",23761,994,1548,5602,1824,6021,2203,5569]
[null,null,"KUJAWSKO-POMORSKIE",48458,2245,1301,11416,3717,14209,4303,11267]
[null,null,"POMORSKIE",59117,1371,1828,13084,4516,18043,6198,14077]
[null,null,"WARMIŃSKO-MAZURSKIE",28680,1739,879,6208,2174,7408,2841,7431]
[null,null,"POLSKA",1035654,34914,51815,210756,73903,309316,106654,248296]
[]
[null,null,"PPi","Ogółem","rolnictwo,leśnictwo, łowiectwo i rybactwo (sekcja A)","przemysł bez przetwórstwa przemsyłowego (sekcje B,D,E)","przetwórstwo przemysłowe (sekcja C)","budownictwo (sekcja F)","handel; naprawa pojazd_w samochodowych; transport i gospodarka magazynowa; zakwaterowanie i gastronomia; informacja i komunikacja  (sekcje G,H,I,J)","działalność finansowa i ubezpieczeniowa; obsługa rynku nieruchomości (sekcje K,L)","pozostałe usługi (sekcje M,N,O,P,Q,R,S,T)"]
[null,null,"ŁÓDZKIE",963643.5750958368,195999.75682412303,27640.727804065536,208980.90100597756,47338.773361410895,219506.14835382783,30984.477124183006,233192.79062224898]
[null,null,"MAZOWIECKIE",2219167.319695792,325900.76786769053,43092.715041537245,312299.24596213864,132092.12743760532,640982.9066846194,132873.2363950475,631926.3203071534]
[null,null,"MAŁOPOLSKIE",1156756.3494878516,247235.38704581358,32008.85964257599,188826.06772732164,74111.3909879653,277455.3842418356,34686.76449783288,302432.4953445065]
[null,null,"ŚLĄSKIE",1630607.3506311448,97545.86978400558,157922.66314825002,337915.21002673364,110059.80127930782,434712.6806516095,61488.40406190413,430962.72167933406]
[null,null,"LUBELSKIE",761876.2349703597,280045.871559633,17639.367284382344,92443.37197110067,31469.97008684822,142903.78360076906,20414.91673884268,176958.95372878367]
[null,null,"PODKARPACKIE",721840.3730271864,206228.6365362704,16213.543458560569,143343.34948181763,32930.91541550503,141199.08421993413,16271.598228985184,165653.2456861134]
[null,null,"PODLASKIE",400933.8942932971,131775.06775067752,7075.353252546418,57272.73928613905,16998.992950654585,80447.27442149402,11193.250636929373,96171.21599485617]
[null,null,"ŚWIĘTOKRZYSKIE",463594.6720577817,149514.35119502345,11716.02018319814,74704.90277709751,22905.464854824517,94544.33875421908,9863.952353445013,100345.64193997404]
[null,null,"LUBUSKIE",320374.7851037084,31841.15523465704,8599.160038362097,77077.66109166342,17099.562778254705,87139.72909664936,11230.143692581858,87387.37317153992]
[null,null,"WIELKOPOLSKIE",1319845.0710321998,212574.58757458758,30407.570593030017,316540.34180975344,80513.32719556284,330246.59483401605,42812.08882817914,306750.56019707065]
[null,null,"ZACHODNIOPOMORSKIE",529196.4742912613,48714.10126670622,16704.772193309604,95129.47421275375,35903.72497407674,155370.96932274822,21562.21626830505,155811.21605336174]
[null,null,"DOLNOŚLĄSKIE",974756.4012872921,84399.64485297959,45521.2853899106,205114.78086482745,61717.51013930524,252802.2465977006,40970.824684697975,284230.1087578706]
[null,null,"OPOLSKIE",316450.1751714493,52620.43409211223,9401.370211685906,66594.54832919246,20256.53839746793,72254.02311264716,10036.034968953438,85287.22605939017]
[null,null,"KUJAWSKO-POMORSKIE",697019.1726088221,118613.62075342104,15918.886504011112,152898.31779706417,40207.256127901695,167580.7003266933,25706.741223982604,176093.64987574823]
[null,null,"POMORSKIE",726465.4958626062,65544.77219486542,17552.925253750378,158426.87105718817,49861.98520481396,200924.27616926504,33644.738056335125,200509.92792638805]
[null,null,"WARMIŃSKO-MAZURSKIE",423415.38870472444,69060.00555974743,11431.723386833939,91603.95455216173,23245.121625233893,96844.1969304782,14740.599689726201,116489.78696054302]
[null,null,"POLSKA",13625859.344699452,2317557.2519083973,468821.23633658,2579190.8363315957,796729.123094504,3394898.586355255,518482.8685878738,3550179.4420852456]

{"sheet":"2002wyd","index":4,"n_rows":152,"n_cols":14,"rows_kept":152,"merged":[[0,1,0,9],[1,1,1,9]]}
[null,"PODDEKOMPOZYCJA RÓŻNIC W WYDAJNOŚCI PRACY"]
[null,2002]
[]
[null,null,"Sekcje","Rolnictwo - A","Przemysł pozostały - B, D, E","Przetwórstwo przemysłowe - C","Budownictwo - F","Usługi - G, H, I, J","Usługi - K, L","Usługi  - M, N, O, P, Q, R"]
[null,"ŁÓDZKIE","Roznice w rozwoju infrastruktury i technologii",{"$f":"D41","v":{"v":-2.1595976382948515E-3,"d":"-0.2%"}},{"$f":"E41","v":{"v":-1.4345583783182878E-4,"d":"-0.0%"}},{"v":-0.031810797441558944,"d":"-3.2%"},{"v":-0.00123493224555748,"d":"-0.1%"},{"v":-0.02179176521577216,"d":"-2.2%"},{"v":7.3570403022555909E-5,"d":"0.0%"},{"v":-0.007797867197597632,"d":"-0.8%"}]
[null,null,"Specjalizacja sektorowa",{"$f":"D60","v":{"v":0.005930122990223557,"d":"0.6%"}},{"$f":"E60","v":{"v":-4.8392369701095285E-3,"d":"-0.5%"}},{"v":0.030537184612907622,"d":"3.1%"},{"v":-0.010996699463458166,"d":"-1.1%"},{"v":-0.03163982852251984,"d":"-3.2%"},{"v":-0.018823437822024745,"d":"-1.9%"},{"v":-0.024101588143445447,"d":"-2.4%"}]
[null,"MAZOWIECKIE","Roznice w rozwoju infrastruktury i technologii",{"$f":"D42","v":{"v":5.973954762099277E-3,"d":"0.6%"}},{"$f":"E42","v":{"v":0.02088079805745445,"d":"2.1%"}},{"v":0.021777544184984038,"d":"2.2%"},{"v":-0.00274474194278355,"d":"-0.3%"},{"v":0.11475928958200832,"d":"11.5%"},{"v":-0.014648020608658809,"d":"-1.5%"},{"v":0.04626050173018961,"d":"4.6%"}]
[null,null,"Specjalizacja sektorowa",{"$f":"D61","v":{"v":-3.7945674210262724E-3,"d":"-0.4%"}},{"$f":"E61","v":{"v":-0.02551328759686136,"d":"-2.6%"}},{"v":-0.03891711422328909,"d":"-3.9%"},{"v":0.004128610994543501,"d":"0.4%"},{"v":0.04364351523478436,"d":"4.4%"},{"v":0.06582583497431589,"d":"6.6%"},{"v":0.024458882322193932,"d":"2.4%"}]
[null,"MAŁOPOLSKIE","Roznice w rozwoju infrastruktury i technologii",{"$f":"D43","v":{"v":-0.022903621948173525,"d":"-2.3%"}},{"$f":"E43","v":{"v":-0.004016169868715107,"d":"-0.4%"}},{"v":-9.740276393176709E-3,"d":"-1.0%"},{"v":1.9473969026110546E-3,"d":"0.2%"},{"v":-0.026228936508771037,"d":"-2.6%"},{"v":0.01226461119690836,"d":"1.2%"},{"v":2.7599704870317934E-3,"d":"0.3%"}]
[null,null,"Specjalizacja sektorowa",{"$f":"D62","v":{"v":0.007808457016770276,"d":"0.8%"}},{"$f":"E62","v":{"v":-0.010660330837823365,"d":"-1.1%"}},{"v":-0.017512158532020955,"d":"-1.8%"},{"v":0.005662321438030151,"d":"0.6%"},{"v":-0.017983533111143018,"d":"-1.8%"},{"v":-0.026901546266018143,"d":"-2.7%"},{"v":-2.6957407054960317E-3,"d":"-0.3%"}]
[null,"ŚLĄSKIE","Roznice w rozwoju infrastruktury i technologii",{"$f":"D44","v":{"v":-6.6589267601822552E-4,"d":"-0.1%"}},{"$f":"E44","v":{"v":-0.014563651130624888,"d":"-1.5%"}},{"v":0.011903980862611177,"d":"1.2%"},{"v":-0.006368333446100072,"d":"-0.6%"},{"v":-0.01308479672198571,"d":"-1.3%"},{"v":0.001061348991066416,"d":"0.1%"},{"v":-0.022147755065792318,"d":"-2.2%"}]
[null,null,"Specjalizacja sektorowa",{"$f":"D63","v":{"v":-0.0197599930713819,"d":"-2.0%"}},{"$f":"E63","v":{"v":0.10569962978298282,"d":"10.6%"}},{"v":0.009283847122825928,"d":"0.9%"},{"v":0.013312598621023785,"d":"1.3%"},{"v":0.025327410243247497,"d":"2.5%"},{"v":-0.00583219547899117,"d":"-0.6%"},{"v":0.003485021027679971,"d":"0.3%"}]
[null,"LUBELSKIE","Roznice w rozwoju infrastruktury i technologii",{"$f":"D45","v":{"v":-0.03177733413309972,"d":"-3.2%"}},{"$f":"E45","v":{"v":-0.005934347386488181,"d":"-0.6%"}},{"v":-0.014005242268196667,"d":"-1.4%"},{"v":8.1067272612862415E-4,"d":"0.1%"},{"v":-0.013891512873576988,"d":"-1.4%"},{"v":0.012281801182383293,"d":"1.2%"},{"v":-0.013719175411459268,"d":"-1.4%"}]
[null,null,"Specjalizacja sektorowa",{"$f":"D64","v":{"v":0.03374388537852614,"d":"3.4%"}},{"$f":"E64","v":{"v":-0.021515919266227024,"d":"-2.2%"}},{"v":-0.05843296848213186,"d":"-5.8%"},{"v":-0.01990114420107606,"d":"-2.0%"},{"v":-0.07606423454802846,"d":"-7.6%"},{"v":-0.024830151270689917,"d":"-2.5%"},{"v":-0.036733678919632036,"d":"-3.7%"}]
[null,"PODKARPACKIE","Roznice w rozwoju infrastruktury i technologii",{"$f":"D46","v":{"v":-0.03680512926850857,"d":"-3.7%"}},{"$f":"E46","v":{"v":-0.004107283432631706,"d":"-0.4%"}},{"v":-0.017626453530867742,"d":"-1.8%"},{"v":-0.006413583269736492,"d":"-0.6%"},{"v":-0.023528822232515893,"d":"-2.4%"},{"v":0.017219004096623823,"d":"1.7%"},{"v":-0.018639369875111864,"d":"-1.9%"}]
[null,null,"Specjalizacja sektorowa",{"$f":"D65","v":{"v":0.020158824693402386,"d":"2.0%"}},{"$f":"E65","v":{"v":-0.025086505622081395,"d":"-2.5%"}},{"v":0.010055575532876343,"d":"1.0%"},{"v":-0.017066342740294768,"d":"-1.7%"},{"v":-0.06742620204805677,"d":"-6.7%"},{"v":-0.038340380909361836,"d":"-3.8%"},{"v":-0.032958482143984516,"d":"-3.3%"}]
[null,"PODLASKIE","Roznice w rozwoju infrastruktury i technologii",{"$f":"D47","v":{"v":-0.014026279527066704,"d":"-1.4%"}},{"$f":"E47","v":{"v":-3.4542458425173687E-3,"d":"-0.3%"}},{"v":-2.1933191840558157E-3,"d":"-0.2%"},{"v":0.006897073077683438,"d":"0.7%"},{"v":-0.023557448345033677,"d":"-2.4%"},{"v":5.1877176232341055E-3,"d":"0.5%"},{"v":-0.010352206241825562,"d":"-1.0%"}]
[null,null,"Specjalizacja sektorowa",{"$f":"D66","v":{"v":0.026258038392167816,"d":"2.6%"}},{"$f":"E66","v":{"v":-0.029777993043368464,"d":"-3.0%"}},{"v":-0.043970895586406315,"d":"-4.4%"},{"v":-0.0188823670035815,"d":"-1.9%"},{"v":-0.05421144060961397,"d":"-5.4%"},{"v":-0.020672645820235033,"d":"-2.1%"},{"v":-0.021964757164930272,"d":"-2.2%"}]
[null,"ŚWIĘTOKRZYSKIE","Roznice w rozwoju infrastruktury i technologii",{"$f":"D48","v":{"v":-0.023086058222876946,"d":"-2.3%"}},{"$f":"E48","v":{"v":-1.8341025558644669E-3,"d":"-0.2%"}},{"v":-0.012016793100222654,"d":"-1.2%"},{"v":0.01564493043830135,"d":"1.6%"},{"v":-0.02218144338065626,"d":"-2.2%"},{"v":0.018260835420051826,"d":"1.8%"},{"v":-0.02192713898370766,"d":"-2.2%"}]
[null,null,"Specjalizacja sektorowa",{"$f":"D67","v":{"v":0.025968470091943124,"d":"2.6%"}},{"$f":"E67","v":{"v":-0.017744515791132436,"d":"-1.8%"}},{"v":-0.028133819429083218,"d":"-2.8%"},{"v":-0.011714744217420527,"d":"-1.2%"},{"v":-0.06221885640988356,"d":"-6.2%"},{"v":-0.04443540811203142,"d":"-4.4%"},{"v":-0.03795122932956824,"d":"-3.8%"}]
[null,"LUBUSKIE","Roznice w rozwoju infrastruktury i technologii",{"$f":"D49","v":{"v":0.01957181771034901,"d":"2.0%"}},{"$f":"E49","v":{"v":0.013739850895134154,"d":"1.4%"}},{"v":-0.023822505515494717,"d":"-2.4%"},{"v":0.010830436390947192,"d":"1.1%"},{"v":-0.04217098055239189,"d":"-4.2%"},{"v":-3.3700718877580117E-3,"d":"-0.3%"},{"v":-0.011501110449257147,"d":"-1.2%"}]
[null,null,"Specjalizacja sektorowa",{"$f":"D68","v":{"v":-0.012264477738803969,"d":"-1.2%"}},{"$f":"E68","v":{"v":-0.02067231066372229,"d":"-2.1%"}},{"v":0.042004070644110464,"d":"4.2%"},{"v":-0.00917608737772474,"d":"-0.9%"},{"v":0.033922025611769595,"d":"3.4%"},{"v":1.4832058597478047E-3,"d":"0.1%"},{"v":0.02178130062306151,"d":"2.2%"}]
[null,"WIELKOPOLSKIE","Roznice w rozwoju infrastruktury i technologii",{"$f":"D50","v":{"v":0.020401497271951147,"d":"2.0%"}},{"$f":"E50","v":{"v":-1.5017368950348505E-3,"d":"-0.2%"}},{"v":-3.2941347452861763E-3,"d":"-0.3%"},{"v":-1.3915455974138184E-3,"d":"-0.1%"},{"v":-0.01854909149421312,"d":"-1.9%"},{"v":-1.2012825337031662E-3,"d":"-0.1%"},{"v":-0.002860384055480823,"d":"-0.3%"}]
[null,null,"Specjalizacja sektorowa",{"$f":"D69","v":{"v":-5.242600584551071E-4,"d":"-0.1%"}},{"$f":"E69","v":{"v":-0.018611905799286513,"d":"-1.9%"}},{"v":0.043223016637469566,"d":"4.3%"},{"v":-1.2789586217836935E-3,"d":"-0.1%"},{"v":-2.8509501460313735E-4,"d":"-0.0%"},{"v":-0.013841320496971477,"d":"-1.4%"},{"v":-0.024066047669026664,"d":"-2.4%"}]
[null,"ZACHODNIOPOMORSKIE","Roznice w rozwoju infrastruktury i technologii",{"$f":"D51","v":{"v":0.022785368620187485,"d":"2.3%"}},{"$f":"E51","v":{"v":2.5243753014105535E-4,"d":"0.0%"}},{"v":-0.01858201676231121,"d":"-1.9%"},{"v":6.394831191986485E-3,"d":"0.6%"},{"v":-0.026993262115687446,"d":"-2.7%"},{"v":-0.014665979537249825,"d":"-1.5%"},{"v":0.014704996271173281,"d":"1.5%"}]
[null,null,"Specjalizacja sektorowa",{"$f":"D70","v":{"v":-0.013987757049319337,"d":"-1.4%"}},{"$f":"E70","v":{"v":-0.009228056668118564,"d":"-0.9%"}},{"v":-0.004300954739500346,"d":"-0.4%"},{"v":0.011504370556115378,"d":"1.2%"},{"v":0.06626425593626695,"d":"6.6%"},{"v":0.009274803432772458,"d":"0.9%"},{"v":0.028544966340222196,"d":"2.9%"}]
[null,"DOLNOŚLĄSKIE","Roznice w rozwoju infrastruktury i technologii",{"$f":"D52","v":{"v":0.011198596865937428,"d":"1.1%"}},{"$f":"E52","v":{"v":-3.8931726740007153E-3,"d":"-0.4%"}},{"v":0.02715916496112073,"d":"2.7%"},{"v":4.9600831913195345E-3,"d":"0.5%"},{"v":-0.021328372269882823,"d":"-2.1%"},{"v":-0.00490991107921183,"d":"-0.5%"},{"v":-2.0232943408951778E-4,"d":"-0.0%"}]
[null,null,"Specjalizacja sektorowa",{"$f":"D71","v":{"v":-0.014582306342980729,"d":"-1.5%"}},{"$f":"E71","v":{"v":0.02523743412565084,"d":"2.5%"}},{"v":0.008975128345224207,"d":"0.9%"},{"v":0.006454048023098565,"d":"0.6%"},{"v":0.016841465435013834,"d":"1.7%"},{"v":0.008117739357858382,"d":"0.8%"},{"v":0.03646216296780035,"d":"3.6%"}]
[null,"OPOLSKIE","Roznice w rozwoju infrastruktury i technologii",{"$f":"D53","v":{"v":0.01080308497143676,"d":"1.1%"}},{"$f":"E53","v":{"v":0.011717075528702485,"d":"1.2%"}},{"v":-5.6420728658237735E-3,"d":"-0.6%"},{"v":-4.2072444886329646E-3,"d":"-0.4%"},{"v":-0.02745730700794889,"d":"-2.7%"},{"v":0.016328467571180182,"d":"1.6%"},{"v":-0.025606131024686108,"d":"-2.6%"}]
[null,null,"Specjalizacja sektorowa",{"$f":"D72","v":{"v":-1.2415478623160718E-3,"d":"-0.1%"}},{"$f":"E72","v":{"v":-0.010442491021649404,"d":"-1.0%"}},{"v":0.02163309226376373,"d":"2.2%"},{"v":0.006399719777817463,"d":"0.6%"},{"v":-0.03026932090588728,"d":"-3.0%"},{"v":-0.020696672906533414,"d":"-2.1%"},{"v":0.014949027446868678,"d":"1.5%"}]
[null,"KUJAWSKO-POMORSKIE","Roznice w rozwoju infrastruktury i technologii",{"$f":"D54","v":{"v":0.01552858735604649,"d":"1.6%"}},{"$f":"E54","v":{"v":-0.007977123121883001,"d":"-0.8%"}},{"v":-1.7249477288566953E-4,"d":"-0.0%"},{"v":-9.4430560857188125E-4,"d":"-0.1%"},{"v":-0.02817017690746932,"d":"-2.8%"},{"v":-0.008107890073342009,"d":"-0.8%"},{"v":-0.008638484357730496,"d":"-0.9%"}]
[null,null,"Specjalizacja sektorowa",{"$f":"D73","v":{"v":1.232035731929589E-5,"d":"0.0%"}},{"$f":"E73","v":{"v":-0.021366327773075396,"d":"-2.1%"}},{"v":0.030746382203328152,"d":"3.1%"},{"v":-1.2786182756052212E-3,"d":"-0.1%"},{"v":-0.005787680152250031,"d":"-0.6%"},{"v":-7.6179237401498585E-3,"d":"-0.8%"},{"v":-0.009993626626047608,"d":"-1.0%"}]
[null,"POMORSKIE","Roznice w rozwoju infrastruktury i technologii",{"$f":"D55","v":{"v":0.005402046563293603,"d":"0.5%"}},{"$f":"E55","v":{"v":-1.1333488977940439E-4,"d":"-0.0%"}},{"v":0.014814153977237772,"d":"1.5%"},{"v":0.00110333788614806,"d":"0.1%"},{"v":-0.016820215707405033,"d":"-1.7%"},{"v":-0.004202337262602464,"d":"-0.4%"},{"v":0.003213345320217441,"d":"0.3%"}]
[null,null,"Specjalizacja sektorowa",{"$f":"D74","v":{"v":-0.013971250413504293,"d":"-1.4%"}},{"$f":"E74","v":{"v":-0.018358602638374372,"d":"-1.8%"}},{"v":0.026826838844184155,"d":"2.7%"},{"v":0.010302001515299418,"d":"1.0%"},{"v":0.041906580700609534,"d":"4.2%"},{"v":0.014740174334085952,"d":"1.5%"},{"v":0.020084243733631324,"d":"2.0%"}]
[null,"WARMIŃSKO-MAZURSKIE","Roznice w rozwoju infrastruktury i technologii",{"$f":"D56","v":{"v":0.02668646481277321,"d":"2.7%"}},{"$f":"E56","v":{"v":-0.008200867005304363,"d":"-0.8%"}},{"v":-0.021950143062817742,"d":"-2.2%"},{"v":2.3406997518685894E-3,"d":"0.2%"},{"v":-0.042613051292894215,"d":"-4.3%"},{"v":4.840580234586056E-3,"d":"0.5%"},{"v":-0.02256758610137397,"d":"-2.3%"}]
[null,null,"Specjalizacja sektorowa",{"$f":"D75","v":{"v":-7.7370239833622232E-4,"d":"-0.1%"}},{"$f":"E75","v":{"v":-0.018213047910035696,"d":"-1.8%"}},{"v":0.017282369367163018,"d":"1.7%"},{"v":-0.006710652020954086,"d":"-0.7%"},{"v":-0.014787310563967341,"d":"-1.5%"},{"v":-0.007330328216966352,"d":"-0.7%"},{"v":0.01733781510096425,"d":"1.7%"}]
[]
[]
[]
[null,null,"Roznice wynikajace w rozwoju infrastruktury i technologii","rolnictwo,leśnictwo, łowiectwo i rybactwo (sekcja A)","przemysł bez przetwórstwa przemsyłowego (sekcje B,D,E)","przetwórstwo przemysłowe (sekcja C)","budownictwo (sekcja F)","handel; naprawa pojazd_w samochodowych; transport i gospodarka magazynowa; zakwaterowanie i gastronomia; informacja i komunikacja  (sekcje G,H,I,J)","działalność finansowa i ubezpieczeniowa; obsługa rynku nieruchomości (sekcje K,L)","pozostałe usługi (sekcje M,N,O,P,Q,R,S,T)","SUMA (*)"]
[null,null,"ŁÓDZKIE",{"$f":"D79*(E98-E$114)/$D$114","v":{"v":-2.1595976382948515E-3,"d":"-0.2%"}},{"v":-1.4345583783182878E-4,"d":"-0.0%"},{"v":-0.031810797441558944,"d":"-3.2%"},{"v":-0.00123493224555748,"d":"-0.1%"},{"v":-0.02179176521577216,"d":"-2.2%"},{"v":7.3570403022555909E-5,"d":"0.0%"},{"v":-0.007797867197597632,"d":"-0.8%"},{"$f":"SUM(D41:J41)","v":{"v":-0.06486484517359034,"d":"-6.5%"}}]
[null,null,"MAZOWIECKIE",{"v":5.973954762099277E-3,"d":"0.6%"},{"v":0.02088079805745445,"d":"2.1%"},{"v":0.021777544184984038,"d":"2.2%"},{"v":-0.00274474194278355,"d":"-0.3%"},{"v":0.11475928958200832,"d":"11.5%"},{"v":-0.014648020608658809,"d":"-1.5%"},{"v":0.04626050173018961,"d":"4.6%"},{"v":0.19225932576529334,"d":"19.2%"}]
[null,null,"MAŁOPOLSKIE",{"v":-0.022903621948173525,"d":"-2.3%"},{"v":-0.004016169868715107,"d":"-0.4%"},{"v":-9.740276393176709E-3,"d":"-1.0%"},{"v":1.9473969026110546E-3,"d":"0.2%"},{"v":-0.026228936508771037,"d":"-2.6%"},{"v":0.01226461119690836,"d":"1.2%"},{"v":2.7599704870317934E-3,"d":"0.3%"},{"v":-0.04591702613228518,"d":"-4.6%"}]
[null,null,"ŚLĄSKIE",{"v":-6.6589267601822552E-4,"d":"-0.1%"},{"v":-0.014563651130624888,"d":"-1.5%"},{"v":0.011903980862611177,"d":"1.2%"},{"v":-0.006368333446100072,"d":"-0.6%"},{"v":-0.01308479672198571,"d":"-1.3%"},{"v":0.001061348991066416,"d":"0.1%"},{"v":-0.022147755065792318,"d":"-2.2%"},{"v":-0.04386509918684362,"d":"-4.4%"}]
[null,null,"LUBELSKIE",{"v":-0.03177733413309972,"d":"-3.2%"},{"v":-0.005934347386488181,"d":"-0.6%"},{"v":-0.014005242268196667,"d":"-1.4%"},{"v":8.1067272612862415E-4,"d":"0.1%"},{"v":-0.013891512873576988,"d":"-1.4%"},{"v":0.012281801182383293,"d":"1.2%"},{"v":-0.013719175411459268,"d":"-1.4%"},{"v":-0.06623513816430891,"d":"-6.6%"}]
[null,null,"PODKARPACKIE",{"v":-0.03680512926850857,"d":"-3.7%"},{"v":-0.004107283432631706,"d":"-0.4%"},{"v":-0.017626453530867742,"d":"-1.8%"},{"v":-0.006413583269736492,"d":"-0.6%"},{"v":-0.023528822232515893,"d":"-2.4%"},{"v":0.017219004096623823,"d":"1.7%"},{"v":-0.018639369875111864,"d":"-1.9%"},{"v":-0.08990163751274843,"d":"-9.0%"}]
[null,null,"PODLASKIE",{"v":-0.014026279527066704,"d":"-1.4%"},{"v":-3.4542458425173687E-3,"d":"-0.3%"},{"v":-2.1933191840558157E-3,"d":"-0.2%"},{"v":0.006897073077683438,"d":"0.7%"},{"v":-0.023557448345033677,"d":"-2.4%"},{"v":5.1877176232341055E-3,"d":"0.5%"},{"v":-0.010352206241825562,"d":"-1.0%"},{"v":-0.04149870843958158,"d":"-4.1%"}]
[null,null,"ŚWIĘTOKRZYSKIE",{"v":-0.023086058222876946,"d":"-2.3%"},{"v":-1.8341025558644669E-3,"d":"-0.2%"},{"v":-0.012016793100222654,"d":"-1.2%"},{"v":0.01564493043830135,"d":"1.6%"},{"v":-0.02218144338065626,"d":"-2.2%"},{"v":0.018260835420051826,"d":"1.8%"},{"v":-0.02192713898370766,"d":"-2.2%"},{"v":-0.047139770384974806,"d":"-4.7%"}]
[null,null,"LUBUSKIE",{"v":0.01957181771034901,"d":"2.0%"},{"v":0.013739850895134154,"d":"1.4%"},{"v":-0.023822505515494717,"d":"-2.4%"},{"v":0.010830436390947192,"d":"1.1%"},{"v":-0.04217098055239189,"d":"-4.2%"},{"v":-3.3700718877580117E-3,"d":"-0.3%"},{"v":-0.011501110449257147,"d":"-1.2%"},{"v":-0.03672256340847141,"d":"-3.7%"}]
[null,null,"WIELKOPOLSKIE",{"v":0.020401497271951147,"d":"2.0%"},{"v":-1.5017368950348505E-3,"d":"-0.2%"},{"v":-3.2941347452861763E-3,"d":"-0.3%"},{"v":-1.3915455974138184E-3,"d":"-0.1%"},{"v":-0.01854909149421312,"d":"-1.9%"},{"v":-1.2012825337031662E-3,"d":"-0.1%"},{"v":-0.002860384055480823,"d":"-0.3%"},{"v":-0.00839667804918081,"d":"-0.8%"}]
[null,null,"ZACHODNIOPOMORSKIE",{"$f":"D89*(E108-E$114)/$D$114","v":{"v":0.022785368620187485,"d":"2.3%"}},{"v":2.5243753014105535E-4,"d":"0.0%"},{"v":-0.01858201676231121,"d":"-1.9%"},{"v":6.394831191986485E-3,"d":"0.6%"},{"v":-0.026993262115687446,"d":"-2.7%"},{"v":-0.014665979537249825,"d":"-1.5%"},{"v":0.014704996271173281,"d":"1.5%"},{"v":-0.016103624801760176,"d":"-1.6%"}]
[null,null,"DOLNOŚLĄSKIE",{"v":0.011198596865937428,"d":"1.1%"},{"v":-3.8931726740007153E-3,"d":"-0.4%"},{"v":0.02715916496112073,"d":"2.7%"},{"v":4.9600831913195345E-3,"d":"0.5%"},{"v":-0.021328372269882823,"d":"-2.1%"},{"v":-0.00490991107921183,"d":"-0.5%"},{"v":-2.0232943408951778E-4,"d":"-0.0%"},{"v":0.012984059561192808,"d":"1.3%"}]
[null,null,"OPOLSKIE",{"v":0.01080308497143676,"d":"1.1%"},{"v":0.011717075528702485,"d":"1.2%"},{"v":-5.6420728658237735E-3,"d":"-0.6%"},{"v":-4.2072444886329646E-3,"d":"-0.4%"},{"v":-0.02745730700794889,"d":"-2.7%"},{"v":0.016328467571180182,"d":"1.6%"},{"v":-0.025606131024686108,"d":"-2.6%"},{"v":-0.024064127315772302,"d":"-2.4%"}]
[null,null,"KUJAWSKO-POMORSKIE",{"v":0.01552858735604649,"d":"1.6%"},{"v":-0.007977123121883001,"d":"-0.8%"},{"v":-1.7249477288566953E-4,"d":"-0.0%"},{"v":-9.4430560857188125E-4,"d":"-0.1%"},{"v":-0.02817017690746932,"d":"-2.8%"},{"v":-0.008107890073342009,"d":"-0.8%"},{"v":-0.008638484357730496,"d":"-0.9%"},{"v":-0.038481887485835885,"d":"-3.8%"}]
[null,null,"POMORSKIE",{"v":0.005402046563293603,"d":"0.5%"},{"v":-1.1333488977940439E-4,"d":"-0.0%"},{"v":0.014814153977237772,"d":"1.5%"},{"v":0.00110333788614806,"d":"0.1%"},{"v":-0.016820215707405033,"d":"-1.7%"},{"v":-0.004202337262602464,"d":"-0.4%"},{"v":0.003213345320217441,"d":"0.3%"},{"v":0.003396995887109975,"d":"0.3%"}]
[null,null,"WARMIŃSKO-MAZURSKIE",{"v":0.02668646481277321,"d":"2.7%"},{"v":-0.008200867005304363,"d":"-0.8%"},{"v":-0.021950143062817742,"d":"-2.2%"},{"v":2.3406997518685894E-3,"d":"0.2%"},{"v":-0.042613051292894215,"d":"-4.3%"},{"v":4.840580234586056E-3,"d":"0.5%"},{"v":-0.02256758610137397,"d":"-2.3%"},{"v":-0.06146390266316243,"d":"-6.1%"}]
[{"$nulls":3},{"$f":"COUNTIF(D41:D56,\">0\")","v":9},4,4,9,1,9,4]
[]
[null,null,"Specjalizacja sektorowa","rolnictwo,leśnictwo, łowiectwo i rybactwo (sekcja A)","przemysł bez przetwórstwa przemsyłowego (sekcje B,D,E)","przetwórstwo przemysłowe (sekcja C)","budownictwo (sekcja F)","handel; naprawa pojazd_w samochodowych; transport i gospodarka magazynowa; zakwaterowanie i gastronomia; informacja i komunikacja  (sekcje G,H,I,J)","działalność finansowa i ubezpieczeniowa; obsługa rynku nieruchomości (sekcje K,L)","pozostałe usługi (sekcje M,N,O,P,Q,R,S,T)","SUMA (**)",null,"(WDBi/Pi-WDB/P)/(WDB/P)","Weryfikacja"]
[null,null,"ŁÓDZKIE",{"$f":"E$114*(D79-D$95)/$D$114","v":{"v":0.005930122990223557,"d":"0.6%"}},{"v":-4.8392369701095285E-3,"d":"-0.5%"},{"v":0.030537184612907622,"d":"3.1%"},{"v":-0.010996699463458166,"d":"-1.1%"},{"v":-0.03163982852251984,"d":"-3.2%"},{"v":-0.018823437822024745,"d":"-1.9%"},{"v":-0.024101588143445447,"d":"-2.4%"},{"$f":"SUM(D60:J60)","v":{"v":-0.05393348331842655,"d":"-5.4%"}},null,{"$f":"(D98-$D$114)/$D$114","v":{"v":-0.11879832849201695,"d":"-11.9%"}},{"$f":"K41+K60","v":{"v":-0.1187983284920169,"d":"-11.9%"}}]
[null,null,"MAZOWIECKIE",{"v":-3.7945674210262724E-3,"d":"-0.4%"},{"v":-0.02551328759686136,"d":"-2.6%"},{"v":-0.03891711422328909,"d":"-3.9%"},{"v":0.004128610994543501,"d":"0.4%"},{"v":0.04364351523478436,"d":"4.4%"},{"v":0.06582583497431589,"d":"6.6%"},{"v":0.024458882322193932,"d":"2.4%"},{"v":0.06983187428466095,"d":"7.0%"},null,{"v":0.26209120004995423,"d":"26.2%"},{"v":0.2620912000499543,"d":"26.2%"}]
[null,null,"MAŁOPOLSKIE",{"v":0.007808457016770276,"d":"0.8%"},{"v":-0.010660330837823365,"d":"-1.1%"},{"v":-0.017512158532020955,"d":"-1.8%"},{"v":0.005662321438030151,"d":"0.6%"},{"v":-0.017983533111143018,"d":"-1.8%"},{"v":-0.026901546266018143,"d":"-2.7%"},{"v":-2.6957407054960317E-3,"d":"-0.3%"},{"v":-0.06228253099770109,"d":"-6.2%"},null,{"v":-0.10819955712998637,"d":"-10.8%"},{"v":-0.10819955712998627,"d":"-10.8%"}]
[null,null,"ŚLĄSKIE",{"v":-0.0197599930713819,"d":"-2.0%"},{"v":0.10569962978298282,"d":"10.6%"},{"v":0.009283847122825928,"d":"0.9%"},{"v":0.013312598621023785,"d":"1.3%"},{"v":0.025327410243247497,"d":"2.5%"},{"v":-0.00583219547899117,"d":"-0.6%"},{"v":0.003485021027679971,"d":"0.3%"},{"v":0.13151631824738694,"d":"13.2%"},null,{"v":0.08765121906054338,"d":"8.8%"},{"v":0.08765121906054332,"d":"8.8%"}]
[null,null,"LUBELSKIE",{"v":0.03374388537852614,"d":"3.4%"},{"v":-0.021515919266227024,"d":"-2.2%"},{"v":-0.05843296848213186,"d":"-5.8%"},{"v":-0.01990114420107606,"d":"-2.0%"},{"v":-0.07606423454802846,"d":"-7.6%"},{"v":-0.024830151270689917,"d":"-2.5%"},{"v":-0.036733678919632036,"d":"-3.7%"},{"v":-0.2037342113092592,"d":"-20.4%"},null,{"v":-0.2699693494735681,"d":"-27.0%"},{"v":-0.2699693494735681,"d":"-27.0%"}]
[null,null,"PODKARPACKIE",{"v":0.020158824693402386,"d":"2.0%"},{"v":-0.025086505622081395,"d":"-2.5%"},{"v":0.010055575532876343,"d":"1.0%"},{"v":-0.017066342740294768,"d":"-1.7%"},{"v":-0.06742620204805677,"d":"-6.7%"},{"v":-0.038340380909361836,"d":"-3.8%"},{"v":-0.032958482143984516,"d":"-3.3%"},{"v":-0.15066351323750055,"d":"-15.1%"},null,{"v":-0.24056515075024903,"d":"-24.1%"},{"v":-0.24056515075024898,"d":"-24.1%"}]
[null,null,"PODLASKIE",{"v":0.026258038392167816,"d":"2.6%"},{"v":-0.029777993043368464,"d":"-3.0%"},{"v":-0.043970895586406315,"d":"-4.4%"},{"v":-0.0188823670035815,"d":"-1.9%"},{"v":-0.05421144060961397,"d":"-5.4%"},{"v":-0.020672645820235033,"d":"-2.1%"},{"v":-0.021964757164930272,"d":"-2.2%"},{"v":-0.16322206083596774,"d":"-16.3%"},null,{"v":-0.20472076927554922,"d":"-20.5%"},{"v":-0.20472076927554933,"d":"-20.5%"}]
[null,null,"ŚWIĘTOKRZYSKIE",{"v":0.025968470091943124,"d":"2.6%"},{"v":-0.017744515791132436,"d":"-1.8%"},{"v":-0.028133819429083218,"d":"-2.8%"},{"v":-0.011714744217420527,"d":"-1.2%"},{"v":-0.06221885640988356,"d":"-6.2%"},{"v":-0.04443540811203142,"d":"-4.4%"},{"v":-0.03795122932956824,"d":"-3.8%"},{"v":-0.17623010319717627,"d":"-17.6%"},null,{"v":-0.2233698735821511,"d":"-22.3%"},{"v":-0.22336987358215107,"d":"-22.3%"}]
[null,null,"LUBUSKIE",{"v":-0.012264477738803969,"d":"-1.2%"},{"v":-0.02067231066372229,"d":"-2.1%"},{"v":0.042004070644110464,"d":"4.2%"},{"v":-0.00917608737772474,"d":"-0.9%"},{"v":0.033922025611769595,"d":"3.4%"},{"v":1.4832058597478047E-3,"d":"0.1%"},{"v":0.02178130062306151,"d":"2.2%"},{"v":0.05707772695843837,"d":"5.7%"},null,{"v":0.020355163549966915,"d":"2.0%"},{"v":0.020355163549966963,"d":"2.0%"}]
[null,null,"WIELKOPOLSKIE",{"v":-5.242600584551071E-4,"d":"-0.1%"},{"v":-0.018611905799286513,"d":"-1.9%"},{"v":0.043223016637469566,"d":"4.3%"},{"v":-1.2789586217836935E-3,"d":"-0.1%"},{"v":-2.8509501460313735E-4,"d":"-0.0%"},{"v":-0.013841320496971477,"d":"-1.4%"},{"v":-0.024066047669026664,"d":"-2.4%"},{"v":-0.015384571022657027,"d":"-1.5%"},null,{"v":-0.02378124907183786,"d":"-2.4%"},{"v":-0.02378124907183784,"d":"-2.4%"}]
[null,null,"ZACHODNIOPOMORSKIE",{"$f":"E$114*(D89-D$95)/$D$114","v":{"v":-0.013987757049319337,"d":"-1.4%"}},{"v":-0.009228056668118564,"d":"-0.9%"},{"v":-0.004300954739500346,"d":"-0.4%"},{"v":0.011504370556115378,"d":"1.2%"},{"v":0.06626425593626695,"d":"6.6%"},{"v":0.009274803432772458,"d":"0.9%"},{"v":0.028544966340222196,"d":"2.9%"},{"v":0.08807162780843872,"d":"8.8%"},null,{"v":0.07196800300667865,"d":"7.2%"},{"v":0.07196800300667855,"d":"7.2%"}]
[null,null,"DOLNOŚLĄSKIE",{"v":-0.014582306342980729,"d":"-1.5%"},{"v":0.02523743412565084,"d":"2.5%"},{"v":0.008975128345224207,"d":"0.9%"},{"v":0.006454048023098565,"d":"0.6%"},{"v":0.016841465435013834,"d":"1.7%"},{"v":0.008117739357858382,"d":"0.8%"},{"v":0.03646216296780035,"d":"3.6%"},{"v":0.08750567191166544,"d":"8.8%"},null,{"v":0.10048973147285825,"d":"10.0%"},{"v":0.10048973147285825,"d":"10.0%"}]
[null,null,"OPOLSKIE",{"v":-1.2415478623160718E-3,"d":"-0.1%"},{"v":-0.010442491021649404,"d":"-1.0%"},{"v":0.02163309226376373,"d":"2.2%"},{"v":0.006399719777817463,"d":"0.6%"},{"v":-0.03026932090588728,"d":"-3.0%"},{"v":-0.020696672906533414,"d":"-2.1%"},{"v":0.014949027446868678,"d":"1.5%"},{"v":-0.0196681932079363,"d":"-2.0%"},null,{"v":-0.043732320523708686,"d":"-4.4%"},{"v":-0.0437323205237086,"d":"-4.4%"}]
[null,null,"KUJAWSKO-POMORSKIE",{"v":1.232035731929589E-5,"d":"0.0%"},{"v":-0.021366327773075396,"d":"-2.1%"},{"v":0.030746382203328152,"d":"3.1%"},{"v":-1.2786182756052212E-3,"d":"-0.1%"},{"v":-0.005787680152250031,"d":"-0.6%"},{"v":-7.6179237401498585E-3,"d":"-0.8%"},{"v":-0.009993626626047608,"d":"-1.0%"},{"v":-0.015285474006480667,"d":"-1.5%"},null,{"v":-0.05376736149231662,"d":"-5.4%"},{"v":-0.05376736149231655,"d":"-5.4%"}]
[null,null,"POMORSKIE",{"v":-0.013971250413504293,"d":"-1.4%"},{"v":-0.018358602638374372,"d":"-1.8%"},{"v":0.026826838844184155,"d":"2.7%"},{"v":0.010302001515299418,"d":"1.0%"},{"v":0.041906580700609534,"d":"4.2%"},{"v":0.014740174334085952,"d":"1.5%"},{"v":0.020084243733631324,"d":"2.0%"},{"v":0.08152998607593172,"d":"8.2%"},null,{"v":0.0849269819630417,"d":"8.5%"},{"v":0.08492698196304169,"d":"8.5%"}]
[null,null,"WARMIŃSKO-MAZURSKIE",{"v":-7.7370239833622232E-4,"d":"-0.1%"},{"v":-0.018213047910035696,"d":"-1.8%"},{"v":0.017282369367163018,"d":"1.7%"},{"v":-0.006710652020954086,"d":"-0.7%"},{"v":-0.014787310563967341,"d":"-1.5%"},{"v":-0.007330328216966352,"d":"-0.7%"},{"v":0.01733781510096425,"d":"1.7%"},{"v":-0.013194856642132428,"d":"-1.3%"},null,{"v":-0.07465875930529499,"d":"-7.5%"},{"v":-0.07465875930529486,"d":"-7.5%"}]
[{"$nulls":3},{"$f":"COUNTIF(D60:D75,\">0\")","v":7},2,10,7,6,5,8]
[]
[null,null,"Ppij/PPi","rolnictwo,leśnictwo, łowiectwo i rybactwo (sekcja A)","przemysł bez przetwórstwa przemsyłowego (sekcje B,D,E)","przetwórstwo przemysłowe (sekcja C)","budownictwo (sekcja F)","handel; naprawa pojazd_w samochodowych; transport i gospodarka magazynowa; zakwaterowanie i gastronomia; informacja i komunikacja  (sekcje G,H,I,J)","działalność finansowa i ubezpieczeniowa; obsługa rynku nieruchomości (sekcje K,L)","pozostałe usługi (sekcje M,N,O,P,Q,R,S,T)"]
[null,null,"ŁÓDZKIE",{"$f":"E136/$D136","v":0.21251098033973545},{"$f":"F136/$D136","v":0.034525675448477414},0.22004230797047072,0.049969616097363466,0.2206457347224839,0.02509111661736141,0.23721456880410757]
[null,null,"MAZOWIECKIE",{"$f":"E137/$D137","v":0.1550204509988697},0.02007030540092185,0.14531303417999283,0.06276999421873386,0.27928845658296675,0.04977145256726058,0.28776630605125436]
[null,null,"MAŁOPOLSKIE",0.22361533563522212,0.030455545822767948,0.16834367189614513,0.06406795591412094,0.23128344412120144,0.02273586389455133,0.25949818271599107]
[null,null,"ŚLĄSKIE",0.0606358759660882,0.1118148459357432,0.1971748036853362,0.07054229843737178,0.2650209413933019,0.02887884230998525,0.2659323922721735]
[null,null,"LUBELSKIE",0.37694067990269237,0.02286527961661464,0.12431497300017046,0.042433885844497324,0.18604089444374294,0.023339799671916336,0.22406448752036598]
[null,null,"PODKARPACKIE",0.2966283720669541,0.020368712882186696,0.19800514398986593,0.04483294606198973,0.19276957720457613,0.019400758080325462,0.22799448971410186]
[null,null,"PODLASKIE",0.33268576919493303,0.01708840811886167,0.1398754238737928,0.043296065393510254,0.20306334925042854,0.024551961665057513,0.23943902250341628]
[null,null,"ŚWIĘTOKRZYSKIE",0.33097389620399503,0.02550225839814985,0.15691530794191125,0.049361942993111765,0.19682589174441964,0.01762369238305036,0.22279701033536214]
[null,null,"LUBUSKIE",0.10494794410699038,0.02345513376492206,0.23238009094587636,0.051510379387772226,0.2717158039405725,0.031011720203488254,0.28497892765037813]
[null,null,"WIELKOPOLSKIE",0.17435388922987488,0.024895776206063366,0.233691614500212,0.058193629588148485,0.24506982143736128,0.026543702389952278,0.2372515666483877]
[null,null,"ZACHODNIOPOMORSKIE",0.09476024294900999,0.03145699703842124,0.18255825158172323,0.06901201560286264,0.2969091112859726,0.033283437837156815,0.29201994370485346]
[null,null,"DOLNOŚLĄSKIE",0.09124538004167367,0.05555539131486168,0.1968426380679124,0.06473798511357157,0.2584107288778094,0.032946084317852,0.30026179226631916]
[null,null,"OPOLSKIE",0.17011341947815822,0.030607860200377694,0.2104619599406941,0.06469200773782119,0.2217133054885879,0.024544956329486965,0.2778664908248738]
[null,null,"KUJAWSKO-POMORSKIE",0.17752605110159123,0.022969874522978807,0.2202673938798068,0.05819391761924634,0.24078352710403678,0.028358195505296682,0.25190104026704346]
[null,null,"POMORSKIE",0.0948578270561139,0.025072886680991897,0.2160501656631644,0.0679944643660395,0.27793545386425317,0.034876920988036894,0.2832122813814002]
[null,null,"WARMIŃSKO-MAZURSKIE",0.17287923332276242,0.02517465906697921,0.2057808045914282,0.05359684927466072,0.23377317399348865,0.028442046835560713,0.2803532329151201]
[null,null,"POLSKA",0.1774532154807127,0.03790928722411208,0.18718585893899556,0.05927599771578961,0.24529189908177462,0.03057927680861697,0.2623044647499985]
[]
[null,null,"WDBij/PPij","Ogółem","rolnictwo,leśnictwo, łowiectwo i rybactwo (sekcja A)","przemysł bez przetwórstwa przemsyłowego (sekcje B,D,E)","przetwórstwo przemysłowe (sekcja C)","budownictwo (sekcja F)","handel; naprawa pojazd_w samochodowych; transport i gospodarka magazynowa; zakwaterowanie i gastronomia; informacja i komunikacja  (sekcje G,H,I,J)","działalność finansowa i ubezpieczeniowa; obsługa rynku nieruchomości (sekcje K,L)","pozostałe usługi (sekcje M,N,O,P,Q,R,S,T)"]
[null,null,"ŁÓDZKIE",{"$f":"D117/D136*1000000","v":48385.81293794369},{"$f":"E117/E136*1000000","v":8730},78302.4826932628,43095,63525,65067,188489,50941]
[null,null,"MAZOWIECKIE",{"$f":"D118/D137*1000000","v":69300.03731352287},11404.000000000002,135656.89836483673,59262,62481,93052,172168,61573.00000000001]
[null,null,"MAŁOPOLSKIE",48967.77979646956,3663.9999999999995,71289.80071938685,47855.99999999999,66551,64263,217948,53329.99999999999]
[null,null,"ŚLĄSKIE",59721.73014280659,8685,71378.86199939012,54348,59925,67778.99999999999,190346,48173]
[null,null,"LUBELSKIE",40085.17872519409,4659,64279.833977993636,44847,65930.99999999999,66390,217222,49384]
[null,null,"PODKARPACKIE",41699.73088166234,2474.9999999999995,67458.43448025634,46145.00000000001,57026.99999999999,63788.000000000015,237061.99999999997,48257]
[null,null,"PODLASKIE",43667.90637767921,6973,67431.36308769792,50171.99999999999,73629,64120.00000000001,199929.99999999997,50372]
[null,null,"ŚWIĘTOKRZYSKIE",42643.904606444186,5458,74581.6266141349,46828,82285.00000000001,64302,245221.99999999997,47342]
[null,null,"LUBUSKIE",56026.57787666983,19528,110695.87471141793,45404,76427,61967.99999999999,182361,50530]
[null,null,"WIELKOPOLSKIE",53603.09608592836,15713.000000000002,75218.47484119181,50259,63569.000000000015,66334,185843,52084]
[null,null,"ZACHODNIOPOMORSKIE",58860.582027927216,22491,78971.26720582745,45444,69970,65498,164133,55510.99999999999]
[null,null,"DOLNOŚLĄSKIE",60426.67871481813,16027,74682.7636226022,58609,69089,65958,180145,52709.00000000001]
[null,null,"OPOLSKIE",52507.60473316028,12775,99550.4516773996,49561,61311.00000000001,63690,224856,47686]
[null,null,"KUJAWSKO-POMORSKIE",51956.59168945969,14091,59461.52275592803,50990,63991.00000000001,64066,172628.99999999997,50863]
[null,null,"POMORSKIE",59572.14528515108,12414.999999999998,78282.43166182472,54798.00000000001,65773,67167,181712,53368.99999999999]
[null,null,"WARMIŃSKO-MAZURSKIE",50809.46805218708,17764.000000000004,60643.574384704465,45176,67279.99999999999,60481,197673,48326.00000000001]
[null,null,"POLSKA",54908.898271994876,9288,78530.63179979619,51032.99999999999,64881.99999999999,70490,188328,52746]
[]
[null,null,"WDBi","Ogółem","rolnictwo,leśnictwo, łowiectwo i rybactwo (sekcja A)","przemysł bez przetwórstwa przemsyłowego (sekcje B,D,E)","przetwórstwo przemysłowe (sekcja C)","budownictwo (sekcja F)","handel; naprawa pojazd_w samochodowych; transport i gospodarka magazynowa; zakwaterowanie i gastronomia; informacja i komunikacja  (sekcje G,H,I,J)","działalność finansowa i ubezpieczeniowa; obsługa rynku nieruchomości (sekcje K,L)","pozostałe usługi (sekcje M,N,O,P,Q,R,S,T)"]
[null,null,"ŁÓDZKIE",44494,1706,2486,8720,2919,13202,4349,11112]
[null,null,"MAZOWIECKIE",145158,3703,5703,18038,8215,54436,17949,37114]
[null,null,"MAŁOPOLSKIE",53610,897,2377,8820,4668,16272,5425,15151]
[null,null,"ŚLĄSKIE",96281,849,12867,17276,6815,28959,8862,20653]
[null,null,"LUBELSKIE",29673,1300,1088,4127,2071,9143,3753,8191]
[null,null,"PODKARPACKIE",29195,514,962,6397,1790,8609,3220,7703]
[null,null,"PODLASKIE",17205,914,454,2765,1256,5130,1934,4752]
[null,null,"ŚWIĘTOKRZYSKIE",19192,813,856,3307,1828,5696,1945,4747]
[null,null,"LUBUSKIE",16594,607,769,3125,1166,4987,1675,4265]
[null,null,"WIELKOPOLSKIE",65350,3340,2283,14319,4510,19819,6014,15065]
[null,null,"ZACHODNIOPOMORSKIE",30352,1099,1281,4278,2490,10028,2817,8359]
[null,null,"DOLNOŚLĄSKIE",55824,1351,3833,10658,4132,15746,5483,14621]
[null,null,"OPOLSKIE",16164,669,938,3211,1221,4347,1699,4079]
[null,null,"KUJAWSKO-POMORSKIE",34769,1674,914,7516,2492,10323,3276,8574]
[null,null,"POMORSKIE",40974,810,1350,8143,3076,12840,4359,10396]
[null,null,"WARMIŃSKO-MAZURSKIE",20135,1217,605,3684,1429,5603,2228,5369]
[null,null,"POLSKA",714968,21461,38764,124385,50078,225141,74987,180152]
[]
[null,null,"PPi","Ogółem","rolnictwo,leśnictwo, łowiectwo i rybactwo (sekcja A)","przemysł bez przetwórstwa przemsyłowego (sekcje B,D,E)","przetwórstwo przemysłowe (sekcja C)","budownictwo (sekcja F)","handel; naprawa pojazd_w samochodowych; transport i gospodarka magazynowa; zakwaterowanie i gastronomia; informacja i komunikacja  (sekcje G,H,I,J)","działalność finansowa i ubezpieczeniowa; obsługa rynku nieruchomości (sekcje K,L)","pozostałe usługi (sekcje M,N,O,P,Q,R,S,T)"]
[null,null,"ŁÓDZKIE",919567.0651863376,195418.098510882,31748.67404573236,202343.65935723402,45950.413223140495,202898.5507246377,23072.964470075178,218134.70485463575]
[null,null,"MAZOWIECKIE",2094630.9068101263,324710.62784987723,42039.88200188911,304377.17255576927,131479.9699108529,585006.2330739802,104252.82282421821,602764.1985935393]
[null,null,"MAŁOPOLSKIE",1094801.525060467,244814.41048034935,33342.778013315285,184302.90872617855,70141.69584228637,253209.46734512862,24891.258465322004,284099.00618788676]
[null,null,"ŚLĄSKIE",1612160.2600891315,97754.74956822107,180263.45110559394,317877.38279237505,113725.49019607843,427256.22980569204,46557.32192953884,428725.63469163224]
[null,null,"LUBELSKIE",740248.6640617149,279029.8347284825,16925.992689596547,92023.99268624434,31411.62730733646,137716.52357282722,17277.25552660412,165863.4375506237]
[null,null,"PODKARPACKIE",700124.4224537344,207676.7676767677,14260.633342766901,138628.2370787734,31388.640468549987,134962.68890700443,13582.944546152485,159624.51043371946]
[null,null,"PODLASKIE",393996.4478991902,131077.01132941345,6732.77209908318,55110.42015466795,17058.495973054094,80006.23830318153,9673.385684989747,94338.12435480028]
[null,null,"ŚWIĘTOKRZYSKIE",450052.5966634814,148955.66141443752,11477.357612870415,70620.14179550696,22215.47062040469,88582.00367018134,7931.588519790232,100270.37303029023]
[null,null,"LUBUSKIE",296180.85967213695,31083.57230643179,6946.961682219582,68826.53510703903,15256.3884491083,80477.02039762458,9185.077949780929,84405.30377993271]
[null,null,"WIELKOPOLSKIE",1219145.9966275229,212562.84605104054,30351.58589455689,284904.19626335584,70946.53054161619,298775.8916995809,32360.64850438273,289244.2976729898]
[null,null,"ZACHODNIOPOMORSKIE",515659.189125909,48863.99004046063,16221.089585168418,94137.8399788751,35586.680005716735,153103.9115698189,17162.91056643088,150582.76737943833]
[null,null,"DOLNOŚLĄSKIE",923830.3541960276,84295.25176265053,51323.75683590758,181849.20404716,59806.91571740798,238727.67518724035,30436.592744733407,277390.9579009277]
[null,null,"OPOLSKIE",307841.1228648543,52367.906066536205,9422.358052574753,64788.84606848126,19914.860302392717,68252.47291568536,7555.94691713808,85538.73254204588]
[null,null,"KUJAWSKO-POMORSKIE",669193.2413082728,118799.23355333191,15371.284784476506,147401.4512649539,38942.976356050065,161130.70895638873,18977.11276784318,168570.47362522857]
[null,null,"POMORSKIE",687804.674548344,65243.65686669352,17245.24866360714,148600.3138800686,46766.91043437277,191165.30439054893,23988.509289425023,194794.73102362797]
[null,null,"WARMIŃSKO-MAZURSKIE",396284.4086326405,68509.34474217518,9976.324880886197,81547.72445546307,21239.59571938169,92640.66401018502,11271.139710532041,111099.61511401729]
[null,null,"POLSKA",13020986.078765567,2310615.8484065463,493616.3012010888,2437344.4633864365,771831.9410622361,3193942.403177756,398172.33762372035,3415462.7839077846]

{"sheet":"2012prac","index":5,"n_rows":151,"n_cols":15,"rows_kept":151,"hidden":true,"merged":[[0,1,0,7],[1,1,1,7]]}
[null,"Poddekompozycja różnic w udziale PRACUJĄCYCH wśród aktywnych zawodowo"]
[null,2012]
[]
[null,null,"Sekcje","wyższe","policealne oraz \nśrednie zawodowe","średnie \nogólnokształcące","zasadnicze \nzawodowe","gimnazjalne,\n podstawowe \ni niższe"]
[null,"ŁÓDZKIE","Różnice w efektywnosci rynku pracy",{"$f":"D41","v":{"v":-0.002348201477704643,"d":"-0.2%"}},{"$f":"E41","v":{"v":6.3622614302086137E-4,"d":"0.1%"}},{"$f":"F41","v":{"v":9.9492210705885687E-4,"d":"0.1%"}},{"$f":"G41","v":{"v":-5.162606608436383E-3,"d":"-0.5%"}},{"$f":"H41","v":{"v":-1.4189157053688328E-3,"d":"-0.1%"}}]
[null,null,"Profil wyksztalcenia",{"$f":"D59","v":{"v":-0.027236927440674134,"d":"-2.7%"}},{"$f":"E59","v":{"v":7.5828218163005836E-3,"d":"0.8%"}},{"$f":"F59","v":{"v":0.00977320732917155,"d":"1.0%"}},{"$f":"G59","v":{"v":-0.008984544482718284,"d":"-0.9%"}},{"$f":"H59","v":{"v":0.015597921346924492,"d":"1.6%"}}]
[null,"MAZOWIECKIE","Roznice w efektywnosci rynku pracy",{"$f":"D42","v":{"v":0.006979533947912926,"d":"0.7%"}},{"$f":"E42","v":{"v":0.004822904580748069,"d":"0.5%"}},{"$f":"F42","v":{"v":1.8967010410796045E-3,"d":"0.2%"}},{"$f":"G42","v":{"v":3.3968315117597686E-3,"d":"0.3%"}},{"$f":"H42","v":{"v":6.5413775345219186E-5,"d":"0.0%"}}]
[null,null,"Profil wyksztalcenia",{"$f":"D60","v":{"v":0.09020971026807935,"d":"9.0%"}},{"$f":"E60","v":{"v":-0.020044430677110193,"d":"-2.0%"}},{"$f":"F60","v":{"v":0.010816686158411287,"d":"1.1%"}},{"$f":"G60","v":{"v":-0.06415012869619656,"d":"-6.4%"}},{"$f":"H60","v":{"v":-0.010770820644560452,"d":"-1.1%"}}]
[null,"MAŁOPOLSKIE","Roznice w efektywnosci rynku pracy",{"$f":"D43","v":{"v":-0.002838673410530724,"d":"-0.3%"}},{"$f":"E43","v":{"v":-4.7986800849245505E-3,"d":"-0.5%"}},{"$f":"F43","v":{"v":-1.7036880573245926E-3,"d":"-0.2%"}},{"$f":"G43","v":{"v":2.2841370771024333E-3,"d":"0.2%"}},{"$f":"H43","v":{"v":0.002692907626944307,"d":"0.3%"}}]
[null,null,"Profil wyksztalcenia",{"$f":"D61","v":{"v":0.006578258260977397,"d":"0.7%"}},{"$f":"E61","v":{"v":-0.005760429133419661,"d":"-0.6%"}},{"$f":"F61","v":{"v":-0.008524092454948578,"d":"-0.9%"}},{"$f":"G61","v":{"v":0.01827436618179002,"d":"1.8%"}},{"$f":"H61","v":{"v":-0.00923602943790552,"d":"-0.9%"}}]
[null,"ŚLĄSKIE","Roznice w efektywnosci rynku pracy",{"$f":"D44","v":{"v":1.2181072412359797E-3,"d":"0.1%"}},{"$f":"E44","v":{"v":0.004393559248665474,"d":"0.4%"}},{"$f":"F44","v":{"v":9.12291899204227e-05,"d":"0.0%"}},{"$f":"G44","v":{"v":2.429820859717433E-4,"d":"0.0%"}},{"$f":"H44","v":{"v":-0.002919074500333943,"d":"-0.3%"}}]
[null,null,"Profil wyksztalcenia",{"$f":"D62","v":{"v":1.2054978000305488E-3,"d":"0.1%"}},{"$f":"E62","v":{"v":0.030482901459974156,"d":"3.0%"}},{"$f":"F62","v":{"v":-0.006125736642636839,"d":"-0.6%"}},{"$f":"G62","v":{"v":0.003742559936145161,"d":"0.4%"}},{"$f":"H62","v":{"v":-0.025721936521900086,"d":"-2.6%"}}]
[null,"LUBELSKIE","Roznice w efektywnosci rynku pracy",{"$f":"D45","v":{"v":-0.005503482549998861,"d":"-0.6%"}},{"$f":"E45","v":{"v":-2.6283098523041453E-3,"d":"-0.3%"}},{"$f":"F45","v":{"v":-3.3562747518075596E-3,"d":"-0.3%"}},{"$f":"G45","v":{"v":2.7579657054673558E-3,"d":"0.3%"}},{"$f":"H45","v":{"v":0.005301699301872133,"d":"0.5%"}}]
[null,null,"Profil wyksztalcenia",{"$f":"D63","v":{"v":-0.016201492518242596,"d":"-1.6%"}},{"$f":"E63","v":{"v":0.016455565098530085,"d":"1.6%"}},{"$f":"F63","v":{"v":-0.011496668482131255,"d":"-1.1%"}},{"$f":"G63","v":{"v":-0.010183256282238328,"d":"-1.0%"}},{"$f":"H63","v":{"v":0.019410022413078168,"d":"1.9%"}}]
[null,"PODKARPACKIE","Roznice w efektywnosci rynku pracy",{"$f":"D46","v":{"v":-0.008679952402921992,"d":"-0.9%"}},{"$f":"E46","v":{"v":-0.013899573457158391,"d":"-1.4%"}},{"$f":"F46","v":{"v":-0.005862771874812238,"d":"-0.6%"}},{"$f":"G46","v":{"v":-7.6225110248010425E-3,"d":"-0.8%"}},{"$f":"H46","v":{"v":0.004509811795862269,"d":"0.5%"}}]
[null,null,"Profil wyksztalcenia",{"$f":"D64","v":{"v":-0.03838607617849702,"d":"-3.8%"}},{"$f":"E64","v":{"v":0.007088365171153834,"d":"0.7%"}},{"$f":"F64","v":{"v":-0.013434961929429681,"d":"-1.3%"}},{"$f":"G64","v":{"v":0.026144362961712537,"d":"2.6%"}},{"$f":"H64","v":{"v":0.015228622909023297,"d":"1.5%"}}]
[null,"PODLASKIE","Roznice w efektywnosci rynku pracy",{"$f":"D47","v":{"v":0.001568460565882344,"d":"0.2%"}},{"$f":"E47","v":{"v":1.7799708702145544E-3,"d":"0.2%"}},{"$f":"F47","v":{"v":-0.002261328004759573,"d":"-0.2%"}},{"$f":"G47","v":{"v":0.002924249496792694,"d":"0.3%"}},{"$f":"H47","v":{"v":0.009286962575859115,"d":"0.9%"}}]
[null,null,"Profil wyksztalcenia",{"$f":"D65","v":{"v":-0.008874020831356641,"d":"-0.9%"}},{"$f":"E65","v":{"v":0.009643222632510697,"d":"1.0%"}},{"$f":"F65","v":{"v":-0.006924601171186695,"d":"-0.7%"}},{"$f":"G65","v":{"v":-0.021735559144209236,"d":"-2.2%"}},{"$f":"H65","v":{"v":0.025465252303123485,"d":"2.5%"}}]
[null,"ŚWIĘTOKRZYSKIE","Roznice w efektywnosci rynku pracy",{"$f":"D48","v":{"v":-0.011949417636828061,"d":"-1.2%"}},{"$f":"E48","v":{"v":-0.013507067126976923,"d":"-1.4%"}},{"$f":"F48","v":{"v":-3.5971568593901756E-3,"d":"-0.4%"}},{"$f":"G48","v":{"v":-0.00760062347207674,"d":"-0.8%"}},{"$f":"H48","v":{"v":0.005523413094915185,"d":"0.6%"}}]
[null,null,"Profil wyksztalcenia",{"$f":"D66","v":{"v":-0.022367541781151187,"d":"-2.2%"}},{"$f":"E66","v":{"v":0.006194011059831957,"d":"0.6%"}},{"$f":"F66","v":{"v":-0.018124394951636348,"d":"-1.8%"}},{"$f":"G66","v":{"v":0.015220633184639855,"d":"1.5%"}},{"$f":"H66","v":{"v":0.016745615740401884,"d":"1.7%"}}]
[null,"LUBUSKIE","Roznice w efektywnosci rynku pracy",{"$f":"D49","v":{"v":0.004249545360387366,"d":"0.4%"}},{"$f":"E49","v":{"v":0.001385270680324896,"d":"0.1%"}},{"$f":"F49","v":{"v":0.004209567264411838,"d":"0.4%"}},{"$f":"G49","v":{"v":0.005100319452520739,"d":"0.5%"}},{"$f":"H49","v":{"v":4.2156549220753389E-4,"d":"0.0%"}}]
[null,null,"Profil wyksztalcenia",{"$f":"D67","v":{"v":-0.05513168061704295,"d":"-5.5%"}},{"$f":"E67","v":{"v":0.016446970478684292,"d":"1.6%"}},{"$f":"F67","v":{"v":0.014492521739688041,"d":"1.4%"}},{"$f":"G67","v":{"v":0.025232651384154692,"d":"2.5%"}},{"$f":"H67","v":{"v":-0.004197872624167129,"d":"-0.4%"}}]
[null,"WIELKOPOLSKIE","Roznice w efektywnosci rynku pracy",{"$f":"D50","v":{"v":1.2465902405831646E-3,"d":"0.1%"}},{"$f":"E50","v":{"v":0.00517702072643359,"d":"0.5%"}},{"$f":"F50","v":{"v":1.9512793271131675E-3,"d":"0.2%"}},{"$f":"G50","v":{"v":0.007693525989329727,"d":"0.8%"}},{"$f":"H50","v":{"v":8.9212784873663484E-5,"d":"0.0%"}}]
[null,null,"Profil wyksztalcenia",{"$f":"D68","v":{"v":-0.024566746351679047,"d":"-2.5%"}},{"$f":"E68","v":{"v":1.3385686474421078E-3,"d":"0.1%"}},{"$f":"F68","v":{"v":-0.007508191407480482,"d":"-0.8%"}},{"$f":"G68","v":{"v":0.04306965373102004,"d":"4.3%"}},{"$f":"H68","v":{"v":-0.012571404660226661,"d":"-1.3%"}}]
[null,"ZACHODNIOPOMORSKIE","Roznice w efektywnosci rynku pracy",{"$f":"D51","v":{"v":8.821857894977061E-4,"d":"0.1%"}},{"$f":"E51","v":{"v":5.8318883105999372E-4,"d":"0.1%"}},{"$f":"F51","v":{"v":1.4410787998556883E-3,"d":"0.1%"}},{"$f":"G51","v":{"v":-0.004185640188335561,"d":"-0.4%"}},{"$f":"H51","v":{"v":-5.3089383074585205E-3,"d":"-0.5%"}}]
[null,null,"Profil wyksztalcenia",{"$f":"D69","v":{"v":-0.012920501608459882,"d":"-1.3%"}},{"$f":"E69","v":{"v":-0.020331263652965965,"d":"-2.0%"}},{"$f":"F69","v":{"v":0.007469848620683659,"d":"0.7%"}},{"$f":"G69","v":{"v":0.010591261863890804,"d":"1.1%"}},{"$f":"H69","v":{"v":0.012341725011072014,"d":"1.2%"}}]
[null,"DOLNOŚLĄSKIE","Roznice w efektywnosci rynku pracy",{"$f":"D52","v":{"v":1.0619135898876598E-3,"d":"0.1%"}},{"$f":"E52","v":{"v":-5.7831496411708144E-4,"d":"-0.1%"}},{"$f":"F52","v":{"v":4.52003968799364E-4,"d":"0.0%"}},{"$f":"G52","v":{"v":-0.007662506601485718,"d":"-0.8%"}},{"$f":"H52","v":{"v":-5.5175483538927724E-3,"d":"-0.6%"}}]
[null,null,"Profil wyksztalcenia",{"$f":"D70","v":{"v":-1.5643402035322906E-3,"d":"-0.2%"}},{"$f":"E70","v":{"v":0.003357696231087365,"d":"0.3%"}},{"$f":"F70","v":{"v":0.004144665049651434,"d":"0.4%"}},{"$f":"G70","v":{"v":-0.005454034993023961,"d":"-0.5%"}},{"$f":"H70","v":{"v":-5.4364079369238424E-4,"d":"-0.1%"}}]
[null,"OPOLSKIE","Roznice w efektywnosci rynku pracy",{"$f":"D53","v":{"v":3.9428994789896644E-4,"d":"0.0%"}},{"$f":"E53","v":{"v":1.8768815780124584E-3,"d":"0.2%"}},{"$f":"F53","v":{"v":2.3287746408703317E-3,"d":"0.2%"}},{"$f":"G53","v":{"v":0.006019527610159508,"d":"0.6%"}},{"$f":"H53","v":{"v":-1.1418342100071694E-3,"d":"-0.1%"}}]
[null,null,"Profil wyksztalcenia",{"$f":"D71","v":{"v":-0.05370053998708201,"d":"-5.4%"}},{"$f":"E71","v":{"v":-3.0053521676094387E-3,"d":"-0.3%"}},{"$f":"F71","v":{"v":-0.004973928992981143,"d":"-0.5%"}},{"$f":"G71","v":{"v":0.0619655206367807,"d":"6.2%"}},{"$f":"H71","v":{"v":-0.003505149807666424,"d":"-0.4%"}}]
[null,"KUJAWSKO-POMORSKIE","Roznice w efektywnosci rynku pracy",{"$f":"D54","v":{"v":-1.5655652710835166E-3,"d":"-0.2%"}},{"$f":"E54","v":{"v":-2.86070531137237E-3,"d":"-0.3%"}},{"$f":"F54","v":{"v":-2.3672246228911334E-3,"d":"-0.2%"}},{"$f":"G54","v":{"v":-0.005036873260866289,"d":"-0.5%"}},{"$f":"H54","v":{"v":-3.6707583862519194E-3,"d":"-0.4%"}}]
[null,null,"Profil wyksztalcenia",{"$f":"D72","v":{"v":-0.050260062528862184,"d":"-5.0%"}},{"$f":"E72","v":{"v":-0.01661258170147941,"d":"-1.7%"}},{"$f":"F72","v":{"v":0.004033567734722961,"d":"0.4%"}},{"$f":"G72","v":{"v":0.04877634433656396,"d":"4.9%"}},{"$f":"H72","v":{"v":0.009223616461102077,"d":"0.9%"}}]
[null,"POMORSKIE","Roznice w efektywnosci rynku pracy",{"$f":"D55","v":{"v":0.002450052830963886,"d":"0.2%"}},{"$f":"E55","v":{"v":-1.7412877873762911E-3,"d":"-0.2%"}},{"$f":"F55","v":{"v":2.5985237625866754E-3,"d":"0.3%"}},{"$f":"G55","v":{"v":1.6582683151321802E-3,"d":"0.2%"}},{"$f":"H55","v":{"v":4.2270537186197089E-5,"d":"0.0%"}}]
[null,null,"Profil wyksztalcenia",{"$f":"D73","v":{"v":0.022177113169318953,"d":"2.2%"}},{"$f":"E73","v":{"v":-0.033258278208293385,"d":"-3.3%"}},{"$f":"F73","v":{"v":0.014048425551170524,"d":"1.4%"}},{"$f":"G73","v":{"v":-0.008265250787224915,"d":"-0.8%"}},{"$f":"H73","v":{"v":4.877659204695543E-3,"d":"0.5%"}}]
[null,"WARMIŃSKO-MAZURSKIE","Roznice w efektywnosci rynku pracy",{"$f":"D56","v":{"v":-9.9951823380903747E-4,"d":"-0.1%"}},{"$f":"E56","v":{"v":-5.3551296622581609E-5,"d":"-0.0%"}},{"$f":"F56","v":{"v":-6.9807940240160311E-5,"d":"-0.0%"}},{"$f":"G56","v":{"v":-0.002397193647066886,"d":"-0.2%"}},{"$f":"H56","v":{"v":-0.002873059323618788,"d":"-0.3%"}}]
[null,null,"Profil wyksztalcenia",{"$f":"D74","v":{"v":-0.04852975482816997,"d":"-4.9%"}},{"$f":"E74","v":{"v":0.000526989230431234,"d":"0.1%"}},{"$f":"F74","v":{"v":0.007623961067427328,"d":"0.8%"}},{"$f":"G74","v":{"v":5.5028554524965906E-5,"d":"0.0%"}},{"$f":"H74","v":{"v":0.03380118141289136,"d":"3.4%"}}]
[]
[]
[]
[null,null,"Różnice w efektywności rynku pracy","wyższe","policealne oraz średnie zawodowe","średnie ogólnokształcące","zasadnicze zawodowe","gimnazjalne, podstawowe i niższe","SUMA (**)"]
[null,null,"ŁÓDZKIE",{"$f":"D78*(E97-E$113)/$D$113","v":{"v":-0.002348201477704643,"d":"-0.23%"}},{"v":6.3622614302086137E-4,"d":"0.06%"},{"v":9.9492210705885687E-4,"d":"0.10%"},{"v":-5.162606608436383E-3,"d":"-0.52%"},{"v":-1.4189157053688328E-3,"d":"-0.14%"},{"$f":"SUM(D41:H41)","v":{"v":-0.00729857554143014,"d":"-0.73%"}}]
[null,null,"MAZOWIECKIE",{"v":0.006979533947912926,"d":"0.70%"},{"v":0.004822904580748069,"d":"0.48%"},{"v":1.8967010410796045E-3,"d":"0.19%"},{"v":3.3968315117597686E-3,"d":"0.34%"},{"v":6.5413775345219186E-5,"d":"0.01%"},{"v":0.017161384856845586,"d":"1.72%"}]
[null,null,"MAŁOPOLSKIE",{"v":-0.002838673410530724,"d":"-0.28%"},{"v":-4.7986800849245505E-3,"d":"-0.48%"},{"v":-1.7036880573245926E-3,"d":"-0.17%"},{"v":2.2841370771024333E-3,"d":"0.23%"},{"v":0.002692907626944307,"d":"0.27%"},{"v":-4.3639968487331265E-3,"d":"-0.44%"}]
[null,null,"ŚLĄSKIE",{"v":1.2181072412359797E-3,"d":"0.12%"},{"v":0.004393559248665474,"d":"0.44%"},{"v":9.12291899204227e-05,"d":"0.01%"},{"v":2.429820859717433E-4,"d":"0.02%"},{"v":-0.002919074500333943,"d":"-0.29%"},{"v":3.026803265459677E-3,"d":"0.30%"}]
[null,null,"LUBELSKIE",{"v":-0.005503482549998861,"d":"-0.55%"},{"v":-2.6283098523041453E-3,"d":"-0.26%"},{"v":-3.3562747518075596E-3,"d":"-0.34%"},{"v":2.7579657054673558E-3,"d":"0.28%"},{"v":0.005301699301872133,"d":"0.53%"},{"v":-3.4284021467710767E-3,"d":"-0.34%"}]
[null,null,"PODKARPACKIE",{"v":-0.008679952402921992,"d":"-0.87%"},{"v":-0.013899573457158391,"d":"-1.39%"},{"v":-0.005862771874812238,"d":"-0.59%"},{"v":-7.6225110248010425E-3,"d":"-0.76%"},{"v":0.004509811795862269,"d":"0.45%"},{"v":-0.0315549969638314,"d":"-3.16%"}]
[null,null,"PODLASKIE",{"v":0.001568460565882344,"d":"0.16%"},{"v":1.7799708702145544E-3,"d":"0.18%"},{"v":-0.002261328004759573,"d":"-0.23%"},{"v":0.002924249496792694,"d":"0.29%"},{"v":0.009286962575859115,"d":"0.93%"},{"v":0.013298315503989135,"d":"1.33%"}]
[null,null,"ŚWIĘTOKRZYSKIE",{"v":-0.011949417636828061,"d":"-1.19%"},{"v":-0.013507067126976923,"d":"-1.35%"},{"v":-3.5971568593901756E-3,"d":"-0.36%"},{"v":-0.00760062347207674,"d":"-0.76%"},{"v":0.005523413094915185,"d":"0.55%"},{"v":-0.031130852000356715,"d":"-3.11%"}]
[null,null,"LUBUSKIE",{"v":0.004249545360387366,"d":"0.42%"},{"v":0.001385270680324896,"d":"0.14%"},{"v":0.004209567264411838,"d":"0.42%"},{"v":0.005100319452520739,"d":"0.51%"},{"v":4.2156549220753389E-4,"d":"0.04%"},{"v":0.015366268249852374,"d":"1.54%"}]
[null,null,"WIELKOPOLSKIE",{"v":1.2465902405831646E-3,"d":"0.12%"},{"v":0.00517702072643359,"d":"0.52%"},{"v":1.9512793271131675E-3,"d":"0.20%"},{"v":0.007693525989329727,"d":"0.77%"},{"v":8.9212784873663484E-5,"d":"0.01%"},{"v":0.01615762906833331,"d":"1.62%"}]
[null,null,"ZACHODNIOPOMORSKIE",{"$f":"D88*(E107-E$113)/$D$113","v":{"v":8.821857894977061E-4,"d":"0.09%"}},{"v":5.8318883105999372E-4,"d":"0.06%"},{"v":1.4410787998556883E-3,"d":"0.14%"},{"v":-0.004185640188335561,"d":"-0.42%"},{"v":-5.3089383074585205E-3,"d":"-0.53%"},{"v":-0.006588125075380693,"d":"-0.66%"}]
[null,null,"DOLNOŚLĄSKIE",{"v":1.0619135898876598E-3,"d":"0.11%"},{"v":-5.7831496411708144E-4,"d":"-0.06%"},{"v":4.52003968799364E-4,"d":"0.05%"},{"v":-0.007662506601485718,"d":"-0.77%"},{"v":-5.5175483538927724E-3,"d":"-0.55%"},{"v":-0.012244452360808549,"d":"-1.22%"}]
[null,null,"OPOLSKIE",{"v":3.9428994789896644E-4,"d":"0.04%"},{"v":1.8768815780124584E-3,"d":"0.19%"},{"v":2.3287746408703317E-3,"d":"0.23%"},{"v":0.006019527610159508,"d":"0.60%"},{"v":-1.1418342100071694E-3,"d":"-0.11%"},{"v":0.009477639566934096,"d":"0.95%"}]
[null,null,"KUJAWSKO-POMORSKIE",{"v":-1.5655652710835166E-3,"d":"-0.16%"},{"v":-2.86070531137237E-3,"d":"-0.29%"},{"v":-2.3672246228911334E-3,"d":"-0.24%"},{"v":-0.005036873260866289,"d":"-0.50%"},{"v":-3.6707583862519194E-3,"d":"-0.37%"},{"v":-0.015501126852465229,"d":"-1.55%"}]
[null,null,"POMORSKIE",{"v":0.002450052830963886,"d":"0.25%"},{"v":-1.7412877873762911E-3,"d":"-0.17%"},{"v":2.5985237625866754E-3,"d":"0.26%"},{"v":1.6582683151321802E-3,"d":"0.17%"},{"v":4.2270537186197089E-5,"d":"0.00%"},{"v":0.005007827658492648,"d":"0.50%"}]
[null,null,"WARMIŃSKO-MAZURSKIE",{"v":-9.9951823380903747E-4,"d":"-0.10%"},{"v":-5.3551296622581609E-5,"d":"-0.01%"},{"v":-6.9807940240160311E-5,"d":"-0.01%"},{"v":-0.002397193647066886,"d":"-0.24%"},{"v":-0.002873059323618788,"d":"-0.29%"},{"v":-0.006393130441357453,"d":"-0.64%"}]
[]
[null,null,"Profil wyksztalcenia","wyższe","policealne oraz średnie zawodowe","średnie ogólnokształcące","zasadnicze zawodowe","gimnazjalne, podstawowe i niższe","SUMA (**)",null,"(Pzi/AZi-PZ/AZ)/(PZ/AZ)","Weryfikacja",null,"(Pzi/AZi-PZ/AZ)/(PZ/AZ)","Weryfikacja"]
[null,null,"ŁÓDZKIE",{"$f":"E$113*(D78-D$94)/$D$113","v":{"v":-0.027236927440674134,"d":"-2.72%"}},{"v":7.5828218163005836E-3,"d":"0.76%"},{"v":0.00977320732917155,"d":"0.98%"},{"v":-0.008984544482718284,"d":"-0.90%"},{"v":0.015597921346924492,"d":"1.56%"},{"$f":"SUM(D59:H59)","v":{"v":-3.2675214309957953E-3,"d":"-0.33%"}},null,{"$f":"(D97-D$113)/D$113","v":{"v":-0.010566096972425778,"d":"-1.06%"}},{"$f":"I41+I59","v":{"v":-0.010566096972425935,"d":"-1.06%"}},null,{"$f":"('2012prac'!#REF!-'2012prac'!#REF!)/'2012prac'!#REF!","v":{"$error":"#REF!"}},{"$f":"#REF!+I59","v":{"$error":"#REF!"}}]
[null,null,"MAZOWIECKIE",{"v":0.09020971026807935,"d":"9.02%"},{"v":-0.020044430677110193,"d":"-2.00%"},{"v":0.010816686158411287,"d":"1.08%"},{"v":-0.06415012869619656,"d":"-6.42%"},{"v":-0.010770820644560452,"d":"-1.08%"},{"v":0.006061016408623438,"d":"0.61%"},null,{"v":0.023222401265469192,"d":"2.32%"},{"v":0.023222401265469025,"d":"2.32%"},null,{"$f":"('2012prac'!#REF!-'2012prac'!#REF!)/'2012prac'!#REF!","v":{"$error":"#REF!"}},{"$f":"#REF!+I60","v":{"$error":"#REF!"}}]
[null,null,"MAŁOPOLSKIE",{"v":0.006578258260977397,"d":"0.66%"},{"v":-0.005760429133419661,"d":"-0.58%"},{"v":-0.008524092454948578,"d":"-0.85%"},{"v":0.01827436618179002,"d":"1.83%"},{"v":-0.00923602943790552,"d":"-0.92%"},{"v":1.3320734164936586E-3,"d":"0.13%"},null,{"v":-3.0319234322393135E-3,"d":"-0.30%"},{"v":-0.003031923432239468,"d":"-0.30%"},null,{"$f":"('2012prac'!#REF!-'2012prac'!#REF!)/'2012prac'!#REF!","v":{"$error":"#REF!"}},{"$f":"#REF!+I61","v":{"$error":"#REF!"}}]
[null,null,"ŚLĄSKIE",{"v":1.2054978000305488E-3,"d":"0.12%"},{"v":0.030482901459974156,"d":"3.05%"},{"v":-0.006125736642636839,"d":"-0.61%"},{"v":0.003742559936145161,"d":"0.37%"},{"v":-0.025721936521900086,"d":"-2.57%"},{"v":3.5832860316129395E-3,"d":"0.36%"},null,{"v":0.006610089297072753,"d":"0.66%"},{"v":0.006610089297072616,"d":"0.66%"},null,{"$f":"('2012prac'!#REF!-'2012prac'!#REF!)/'2012prac'!#REF!","v":{"$error":"#REF!"}},{"$f":"#REF!+I62","v":{"$error":"#REF!"}}]
[null,null,"LUBELSKIE",{"v":-0.016201492518242596,"d":"-1.62%"},{"v":0.016455565098530085,"d":"1.65%"},{"v":-0.011496668482131255,"d":"-1.15%"},{"v":-0.010183256282238328,"d":"-1.02%"},{"v":0.019410022413078168,"d":"1.94%"},{"v":-0.002015829771003924,"d":"-0.20%"},null,{"v":-0.005444231917774899,"d":"-0.54%"},{"v":-0.005444231917775001,"d":"-0.54%"},null,{"$f":"('2012prac'!#REF!-'2012prac'!#REF!)/'2012prac'!#REF!","v":{"$error":"#REF!"}},{"$f":"#REF!+I63","v":{"$error":"#REF!"}}]
[null,null,"PODKARPACKIE",{"v":-0.03838607617849702,"d":"-3.84%"},{"v":0.007088365171153834,"d":"0.71%"},{"v":-0.013434961929429681,"d":"-1.34%"},{"v":0.026144362961712537,"d":"2.61%"},{"v":0.015228622909023297,"d":"1.52%"},{"v":-3.3596870660370353E-3,"d":"-0.34%"},null,{"v":-0.03491468402986824,"d":"-3.49%"},{"v":-0.034914684029868435,"d":"-3.49%"},null,{"$f":"('2012prac'!#REF!-'2012prac'!#REF!)/'2012prac'!#REF!","v":{"$error":"#REF!"}},{"$f":"#REF!+I64","v":{"$error":"#REF!"}}]
[null,null,"PODLASKIE",{"v":-0.008874020831356641,"d":"-0.89%"},{"v":0.009643222632510697,"d":"0.96%"},{"v":-0.006924601171186695,"d":"-0.69%"},{"v":-0.021735559144209236,"d":"-2.17%"},{"v":0.025465252303123485,"d":"2.55%"},{"v":-0.00242570621111839,"d":"-0.24%"},null,{"v":0.010872609292870877,"d":"1.09%"},{"v":0.010872609292870745,"d":"1.09%"},null,{"$f":"('2012prac'!#REF!-'2012prac'!#REF!)/'2012prac'!#REF!","v":{"$error":"#REF!"}},{"$f":"#REF!+I65","v":{"$error":"#REF!"}}]
[null,null,"ŚWIĘTOKRZYSKIE",{"v":-0.022367541781151187,"d":"-2.24%"},{"v":0.006194011059831957,"d":"0.62%"},{"v":-0.018124394951636348,"d":"-1.81%"},{"v":0.015220633184639855,"d":"1.52%"},{"v":0.016745615740401884,"d":"1.67%"},{"v":-0.002331676747913833,"d":"-0.23%"},null,{"v":-0.03346252874827045,"d":"-3.35%"},{"v":-0.03346252874827055,"d":"-3.35%"},null,{"$f":"('2012prac'!#REF!-'2012prac'!#REF!)/'2012prac'!#REF!","v":{"$error":"#REF!"}},{"$f":"#REF!+I66","v":{"$error":"#REF!"}}]
[null,null,"LUBUSKIE",{"v":-0.05513168061704295,"d":"-5.51%"},{"v":0.016446970478684292,"d":"1.64%"},{"v":0.014492521739688041,"d":"1.45%"},{"v":0.025232651384154692,"d":"2.52%"},{"v":-0.004197872624167129,"d":"-0.42%"},{"v":-0.00315740963868305,"d":"-0.32%"},null,{"v":0.01220885861116942,"d":"1.22%"},{"v":0.012208858611169323,"d":"1.22%"},null,{"$f":"('2012prac'!#REF!-'2012prac'!#REF!)/'2012prac'!#REF!","v":{"$error":"#REF!"}},{"$f":"#REF!+I67","v":{"$error":"#REF!"}}]
[null,null,"WIELKOPOLSKIE",{"v":-0.024566746351679047,"d":"-2.46%"},{"v":1.3385686474421078E-3,"d":"0.13%"},{"v":-0.007508191407480482,"d":"-0.75%"},{"v":0.04306965373102004,"d":"4.31%"},{"v":-0.012571404660226661,"d":"-1.26%"},{"v":-2.3812004092403811E-4,"d":"-0.02%"},null,{"v":0.01591950902740934,"d":"1.59%"},{"v":0.015919509027409275,"d":"1.59%"},null,{"$f":"('2012prac'!#REF!-'2012prac'!#REF!)/'2012prac'!#REF!","v":{"$error":"#REF!"}},{"$f":"#REF!+I68","v":{"$error":"#REF!"}}]
[null,null,"ZACHODNIOPOMORSKIE",{"$f":"E$113*(D88-D$94)/$D$113","v":{"v":-0.012920501608459882,"d":"-1.29%"}},{"v":-0.020331263652965965,"d":"-2.03%"},{"v":0.007469848620683659,"d":"0.75%"},{"v":0.010591261863890804,"d":"1.06%"},{"v":0.012341725011072014,"d":"1.23%"},{"v":-2.8489297657793723E-3,"d":"-0.28%"},null,{"v":-0.009437054841159987,"d":"-0.94%"},{"v":-0.009437054841160065,"d":"-0.94%"},null,{"$f":"('2012prac'!#REF!-'2012prac'!#REF!)/'2012prac'!#REF!","v":{"$error":"#REF!"}},{"$f":"#REF!+I69","v":{"$error":"#REF!"}}]
[null,null,"DOLNOŚLĄSKIE",{"v":-1.5643402035322906E-3,"d":"-0.16%"},{"v":0.003357696231087365,"d":"0.34%"},{"v":0.004144665049651434,"d":"0.41%"},{"v":-0.005454034993023961,"d":"-0.55%"},{"v":-5.4364079369238424E-4,"d":"-0.05%"},{"v":-5.9654709509837406E-5,"d":"-0.01%"},null,{"v":-0.012304107070318347,"d":"-1.23%"},{"v":-0.012304107070318386,"d":"-1.23%"},null,{"$f":"('2012prac'!#REF!-'2012prac'!#REF!)/'2012prac'!#REF!","v":{"$error":"#REF!"}},{"$f":"#REF!+I70","v":{"$error":"#REF!"}}]
[null,null,"OPOLSKIE",{"v":-0.05370053998708201,"d":"-5.37%"},{"v":-3.0053521676094387E-3,"d":"-0.30%"},{"v":-0.004973928992981143,"d":"-0.50%"},{"v":0.0619655206367807,"d":"6.20%"},{"v":-0.003505149807666424,"d":"-0.35%"},{"v":-3.2194503185583156E-3,"d":"-0.32%"},null,{"v":6.2581892483759526E-3,"d":"0.63%"},{"v":0.006258189248375781,"d":"0.63%"},null,{"$f":"('2012prac'!#REF!-'2012prac'!#REF!)/'2012prac'!#REF!","v":{"$error":"#REF!"}},{"$f":"#REF!+I71","v":{"$error":"#REF!"}}]
[null,null,"KUJAWSKO-POMORSKIE",{"v":-0.050260062528862184,"d":"-5.03%"},{"v":-0.01661258170147941,"d":"-1.66%"},{"v":0.004033567734722961,"d":"0.40%"},{"v":0.04877634433656396,"d":"4.88%"},{"v":0.009223616461102077,"d":"0.92%"},{"v":-0.004839115697952583,"d":"-0.48%"},null,{"v":-0.020340242550417713,"d":"-2.03%"},{"v":-0.02034024255041781,"d":"-2.03%"},null,{"$f":"('2012prac'!#REF!-'2012prac'!#REF!)/'2012prac'!#REF!","v":{"$error":"#REF!"}},{"$f":"#REF!+I72","v":{"$error":"#REF!"}}]
[null,null,"POMORSKIE",{"v":0.022177113169318953,"d":"2.22%"},{"v":-0.033258278208293385,"d":"-3.33%"},{"v":0.014048425551170524,"d":"1.40%"},{"v":-0.008265250787224915,"d":"-0.83%"},{"v":4.877659204695543E-3,"d":"0.49%"},{"v":-4.2033107033328035E-4,"d":"-0.04%"},null,{"v":0.004587496588159535,"d":"0.46%"},{"v":4.5874965881593675E-3,"d":"0.46%"},null,{"$f":"('2012prac'!#REF!-'2012prac'!#REF!)/'2012prac'!#REF!","v":{"$error":"#REF!"}},{"$f":"#REF!+I73","v":{"$error":"#REF!"}}]
[null,null,"WARMIŃSKO-MAZURSKIE",{"v":-0.04852975482816997,"d":"-4.85%"},{"v":0.000526989230431234,"d":"0.05%"},{"v":0.007623961067427328,"d":"0.76%"},{"v":5.5028554524965906E-5,"d":"0.01%"},{"v":0.03380118141289136,"d":"3.38%"},{"v":-0.006522594562895084,"d":"-0.65%"},null,{"v":-0.012915725004252398,"d":"-1.29%"},{"v":-0.012915725004252537,"d":"-1.29%"},null,{"$f":"('2012prac'!#REF!-'2012prac'!#REF!)/'2012prac'!#REF!","v":{"$error":"#REF!"}},{"$f":"#REF!+I74","v":{"$error":"#REF!"}}]
[]
[]
[null,null,"Azij/AZi","wyższe","policealne oraz średnie zawodowe","średnie ogólnokształcące","zasadnicze zawodowe","gimnazjalne, podstawowe i niższe"]
[null,null,"ŁÓDZKIE",{"$f":"E116/$D116","v":0.255779269202088},0.28113348247576436,0.10067114093959731,0.2684563758389262,0.09395973154362416]
[null,null,"MAZOWIECKIE",0.3676304919263988,0.25384904243334583,0.10176492677431469,0.21216672925272248,0.06458880961321818]
[null,null,"MAŁOPOLSKIE",0.2879834254143646,0.26795580110497236,0.08149171270718232,0.2962707182320442,0.06629834254143646]
[null,null,"ŚLĄSKIE",0.2828666350261035,0.30374940673943995,0.08400569530137636,0.28144280968201235,0.04793545325106787]
[null,null,"LUBELSKIE",0.26628895184135976,0.2898961284230406,0.07837582625118036,0.267233238904627,0.09820585457979225]
[null,null,"PODKARPACKIE",0.24516129032258063,0.2806451612903226,0.07634408602150537,0.3043010752688172,0.0935483870967742]
[null,null,"PODLASKIE",0.2732673267326733,0.28316831683168314,0.08316831683168317,0.25544554455445545,0.10495049504950495]
[null,null,"ŚWIĘTOKRZYSKIE",0.2604166666666667,0.27976190476190477,0.07142857142857142,0.2931547619047619,0.09523809523809523]
[null,null,"LUBUSKIE",0.2292134831460674,0.2898876404494382,0.10561797752808989,0.30337078651685395,0.07191011235955057]
[null,null,"WIELKOPOLSKIE",0.2583222370173103,0.27496671105193077,0.08255659121171771,0.3215712383488682,0.06258322237017311]
[null,null,"ZACHODNIOPOMORSKIE",{"$f":"E126/$D126","v":0.2694136291600634},0.25356576862123614,0.098256735340729,0.2884310618066561,0.09033280507131537]
[null,null,"DOLNOŚLĄSKIE",0.28022875816993464,0.2769607843137255,0.09477124183006536,0.27205882352941174,0.07598039215686274]
[null,null,"OPOLSKIE",0.23057644110275688,0.2706766917293233,0.08521303258145363,0.3408521303258145,0.07268170426065163]
[null,null,"KUJAWSKO-POMORSKIE",0.23385300668151449,0.2572383073496659,0.09465478841870824,0.3273942093541203,0.08685968819599109]
[null,null,"POMORSKIE",0.3028391167192429,0.24079915878023134,0.10515247108307045,0.26919032597266035,0.08201892744479496]
[null,null,"WARMIŃSKO-MAZURSKIE",0.23550087873462214,0.2741652021089631,0.0984182776801406,0.27768014059753954,0.11423550087873462]
[null,null,"POLSKA",0.2817185697808535,0.27364475201845445,0.09042675893886967,0.2776239907727797,0.07658592848904268]
[]
[null,null,"Pzij/AZij","Ogółem","wyższe","policealne oraz średnie zawodowe","średnie ogólnokształcące","zasadnicze zawodowe","gimnazjalne, podstawowe i niższe"]
[null,null,"ŁÓDZKIE",{"$f":"D135/D116","v":0.889634601043997},0.9358600583090378,0.9124668435013262,0.8666666666666667,0.8638888888888889,0.7936507936507936]
[null,null,"MAZOWIECKIE",0.9200150206533985,0.9611848825331971,0.9275147928994083,0.8745387453874539,0.8955752212389381,0.8081395348837209]
[null,null,"MAŁOPOLSKIE",0.8964088397790055,0.935251798561151,0.8943298969072165,0.8389830508474576,0.8881118881118881,0.84375]
[null,null,"ŚLĄSKIE",0.9050783103939251,0.947986577181208,0.9234375,0.8587570621468926,0.8819561551433389,0.7524752475247525]
[null,null,"LUBELSKIE",0.8942398489140698,0.925531914893617,0.9022801302931596,0.8192771084337349,0.8904593639575972,0.8557692307692307]
[null,null,"PODKARPACKIE",0.867741935483871,0.9122807017543859,0.8659003831417624,0.7887323943661971,0.8586572438162544,0.8505747126436781]
[null,null,"PODLASKIE",0.9089108910891089,0.9492753623188406,0.916083916083916,0.8333333333333334,0.8914728682170543,0.8867924528301887]
[null,null,"ŚWIĘTOKRZYSKIE",0.8690476190476191,0.9028571428571428,0.8670212765957447,0.8125,0.8578680203045685,0.859375]
[null,null,"LUBUSKIE",0.9101123595505618,0.9607843137254902,0.9147286821705426,0.8936170212765957,0.8962962962962963,0.8125]
[null,null,"WIELKOPOLSKIE",0.9134487350199734,0.9484536082474226,0.927360774818402,0.8790322580645161,0.9026915113871635,0.8085106382978723]
[null,null,"ZACHODNIOPOMORSKIE",{"$f":"D145/D126","v":0.8906497622820919},0.9470588235294117,0.9125,0.8709677419354839,0.8681318681318682,0.7543859649122807]
[null,null,"DOLNOŚLĄSKIE",0.8880718954248366,0.9475218658892128,0.9085545722713865,0.8620689655172413,0.8558558558558559,0.7419354838709677]
[null,null,"OPOLSKIE",0.9047619047619048,0.9456521739130435,0.9166666666666666,0.8823529411764706,0.8970588235294118,0.7931034482758621]
[null,null,"KUJAWSKO-POMORSKIE",0.8808463251670379,0.9380952380952381,0.9004329004329005,0.8352941176470589,0.8673469387755102,0.7692307692307693]
[null,null,"POMORSKIE",0.9032597266035752,0.9513888888888888,0.9039301310043668,0.88,0.88671875,0.8076923076923077]
[null,null,"WARMIŃSKO-MAZURSKIE",0.8875219683655536,0.9402985074626866,0.9102564102564102,0.8571428571428571,0.8734177215189873,0.7846153846153846]
[null,null,"POLSKA",0.8991349480968858,0.944114636642784,0.9104320337197049,0.857780612244898,0.88117989198172,0.8072289156626506]
[]
[null,null,"AZij","Ogółem","wyższe","policealne oraz średnie zawodowe","średnie ogólnokształcące","zasadnicze zawodowe","gimnazjalne, podstawowe i niższe"]
[null,null,"ŁÓDZKIE",1341,343,377,135,360,126]
[null,null,"MAZOWIECKIE",2663,979,676,271,565,172]
[null,null,"MAŁOPOLSKIE",1448,417,388,118,429,96]
[null,null,"ŚLĄSKIE",2107,596,640,177,593,101]
[null,null,"LUBELSKIE",1059,282,307,83,283,104]
[null,null,"PODKARPACKIE",930,228,261,71,283,87]
[null,null,"PODLASKIE",505,138,143,42,129,53]
[null,null,"ŚWIĘTOKRZYSKIE",672,175,188,48,197,64]
[null,null,"LUBUSKIE",445,102,129,47,135,32]
[null,null,"WIELKOPOLSKIE",1502,388,413,124,483,94]
[null,null,"ZACHODNIOPOMORSKIE",631,170,160,62,182,57]
[null,null,"DOLNOŚLĄSKIE",1224,343,339,116,333,93]
[null,null,"OPOLSKIE",399,92,108,34,136,29]
[null,null,"KUJAWSKO-POMORSKIE",898,210,231,85,294,78]
[null,null,"POMORSKIE",951,288,229,100,256,78]
[null,null,"WARMIŃSKO-MAZURSKIE",569,134,156,56,158,65]
[null,null,"POLSKA",17340,4885,4745,1568,4814,1328]
[]
[null,null,"Pzij","Ogółem","wyższe","policealne oraz średnie zawodowe","średnie ogólnokształcące","zasadnicze zawodowe","gimnazjalne, podstawowe i niższe"]
[null,null,"ŁÓDZKIE",1193,321,344,117,311,100]
[null,null,"MAZOWIECKIE",2450,941,627,237,506,139]
[null,null,"MAŁOPOLSKIE",1298,390,347,99,381,81]
[null,null,"ŚLĄSKIE",1907,565,591,152,523,76]
[null,null,"LUBELSKIE",947,261,277,68,252,89]
[null,null,"PODKARPACKIE",807,208,226,56,243,74]
[null,null,"PODLASKIE",459,131,131,35,115,47]
[null,null,"ŚWIĘTOKRZYSKIE",584,158,163,39,169,55]
[null,null,"LUBUSKIE",405,98,118,42,121,26]
[null,null,"WIELKOPOLSKIE",1372,368,383,109,436,76]
[null,null,"ZACHODNIOPOMORSKIE",562,161,146,54,158,43]
[null,null,"DOLNOŚLĄSKIE",1087,325,308,100,285,69]
[null,null,"OPOLSKIE",361,87,99,30,122,23]
[null,null,"KUJAWSKO-POMORSKIE",791,197,208,71,255,60]
[null,null,"POMORSKIE",859,274,207,88,227,63]
[null,null,"WARMIŃSKO-MAZURSKIE",505,126,142,48,138,51]
[null,null,"POLSKA",15591,4612,4320,1345,4242,1072]

{"sheet":"2007prac","index":6,"n_rows":151,"n_cols":15,"rows_kept":151,"hidden":true,"merged":[[0,1,0,7],[1,1,1,7]]}
[null,"Poddekompozycja różnic w udziale PRACUJĄCYCH wśród aktywnych zawodowo"]
[null,2007]
[]
[null,null,"Sekcje","wyższe","policealne oraz średnie zawodowe","średnie ogólnokształcące","zasadnicze zawodowe","gimnazjalne, podstawowe i niższe"]
[null,"ŁÓDZKIE","Roznice w efektywnosci rynku pracy",{"$f":"D41","v":{"v":3.3760022499812361E-4,"d":"0.0%"}},{"$f":"E41","v":{"v":-0.001996178334695921,"d":"-0.2%"}},{"$f":"F41","v":{"v":3.0956964826462587E-3,"d":"0.3%"}},{"$f":"G41","v":{"v":0.002584667773087043,"d":"0.3%"}},{"$f":"H41","v":{"v":1.7857410457224504E-4,"d":"0.0%"}}]
[null,null,"Profil wyksztalcenia",{"$f":"D59","v":{"v":-3.736061465553428E-3,"d":"-0.4%"}},{"$f":"E59","v":{"v":-0.00881813139959674,"d":"-0.9%"}},{"$f":"F59","v":{"v":6.8915252570760045E-3,"d":"0.7%"}},{"$f":"G59","v":{"v":-0.011248194036102542,"d":"-1.1%"}},{"$f":"H59","v":{"v":0.015512468076148579,"d":"1.6%"}}]
[null,"MAZOWIECKIE","Roznice w efektywnosci rynku pracy",{"$f":"D42","v":{"v":0.000328248137509662,"d":"0.0%"}},{"$f":"E42","v":{"v":1.3190847475344025E-3,"d":"0.1%"}},{"$f":"F42","v":{"v":6.7637300479249374E-4,"d":"0.1%"}},{"$f":"G42","v":{"v":-2.0248975472246704E-3,"d":"-0.2%"}},{"$f":"H42","v":{"v":-1.2757285503128424E-3,"d":"-0.1%"}}]
[null,null,"Profil wyksztalcenia",{"$f":"D60","v":{"v":0.08731552793077559,"d":"8.7%"}},{"$f":"E60","v":{"v":-0.003354768407362692,"d":"-0.3%"}},{"$f":"F60","v":{"v":0.01124165887679198,"d":"1.1%"}},{"$f":"G60","v":{"v":-0.07474756350729118,"d":"-7.5%"}},{"$f":"H60","v":{"v":-0.013811029412008173,"d":"-1.4%"}}]
[null,"MAŁOPOLSKIE","Roznice w efektywnosci rynku pracy",{"$f":"D43","v":{"v":-0.001313875501053938,"d":"-0.1%"}},{"$f":"E43","v":{"v":2.2740316879221543E-3,"d":"0.2%"}},{"$f":"F43","v":{"v":-0.002115396206785025,"d":"-0.2%"}},{"$f":"G43","v":{"v":7.400099465964852E-3,"d":"0.7%"}},{"$f":"H43","v":{"v":0.004083366828433256,"d":"0.4%"}}]
[null,null,"Profil wyksztalcenia",{"$f":"D61","v":{"v":0.007224608433630891,"d":"0.7%"}},{"$f":"E61","v":{"v":-0.011222563659060152,"d":"-1.1%"}},{"$f":"F61","v":{"v":2.4406579684196497E-3,"d":"0.2%"}},{"$f":"G61","v":{"v":0.014962387481231243,"d":"1.5%"}},{"$f":"H61","v":{"v":-0.012659599906825346,"d":"-1.3%"}}]
[null,"ŚLĄSKIE","Roznice w efektywnosci rynku pracy",{"$f":"D44","v":{"v":9.7457466457632276E-4,"d":"0.1%"}},{"$f":"E44","v":{"v":0.006037258602780169,"d":"0.6%"}},{"$f":"F44","v":{"v":3.2111164232999285E-3,"d":"0.3%"}},{"$f":"G44","v":{"v":0.009004409563091686,"d":"0.9%"}},{"$f":"H44","v":{"v":-5.238174388184056E-3,"d":"-0.5%"}}]
[null,null,"Profil wyksztalcenia",{"$f":"D62","v":{"v":-5.3464091066661844E-3,"d":"-0.5%"}},{"$f":"E62","v":{"v":0.040086978145086063,"d":"4.0%"}},{"$f":"F62","v":{"v":-0.01186437007372533,"d":"-1.2%"}},{"$f":"G62","v":{"v":0.019208354185010865,"d":"1.9%"}},{"$f":"H62","v":{"v":-0.039098969569810266,"d":"-3.9%"}}]
[null,"LUBELSKIE","Roznice w efektywnosci rynku pracy",{"$f":"D45","v":{"v":-2.2589969639066274E-3,"d":"-0.2%"}},{"$f":"E45","v":{"v":0.002768946040070989,"d":"0.3%"}},{"$f":"F45","v":{"v":-0.004023934593208102,"d":"-0.4%"}},{"$f":"G45","v":{"v":-6.98458562616799e-05,"d":"-0.0%"}},{"$f":"H45","v":{"v":0.00934608218906733,"d":"0.9%"}}]
[null,null,"Profil wyksztalcenia",{"$f":"D63","v":{"v":-0.018777454910177602,"d":"-1.9%"}},{"$f":"E63","v":{"v":-0.006700817091138317,"d":"-0.7%"}},{"$f":"F63","v":{"v":-0.009840534002457891,"d":"-1.0%"}},{"$f":"G63","v":{"v":-0.013469902145881105,"d":"-1.3%"}},{"$f":"H63","v":{"v":0.04513182091088301,"d":"4.5%"}}]
[null,"PODKARPACKIE","Roznice w efektywnosci rynku pracy",{"$f":"D46","v":{"v":-1.6584268716588252E-3,"d":"-0.2%"}},{"$f":"E46","v":{"v":-0.003664782231816909,"d":"-0.4%"}},{"$f":"F46","v":{"v":-1.3925846567846292E-3,"d":"-0.1%"}},{"$f":"G46","v":{"v":-4.0781587047085471E-5,"d":"-0.0%"}},{"$f":"H46","v":{"v":0.012135280551231748,"d":"1.2%"}}]
[null,null,"Profil wyksztalcenia",{"$f":"D64","v":{"v":-0.03614066616158031,"d":"-3.6%"}},{"$f":"E64","v":{"v":0.008749111701610144,"d":"0.9%"}},{"$f":"F64","v":{"v":-0.01597447470228835,"d":"-1.6%"}},{"$f":"G64","v":{"v":0.009722248406987708,"d":"1.0%"}},{"$f":"H64","v":{"v":0.030068277017244516,"d":"3.0%"}}]
[null,"PODLASKIE","Roznice w efektywnosci rynku pracy",{"$f":"D47","v":{"v":0.002107612842155487,"d":"0.2%"}},{"$f":"E47","v":{"v":-1.0975655491987384E-3,"d":"-0.1%"}},{"$f":"F47","v":{"v":5.2198499849030354E-4,"d":"0.1%"}},{"$f":"G47","v":{"v":-1.8959830732656713E-3,"d":"-0.2%"}},{"$f":"H47","v":{"v":0.009185596769934653,"d":"0.9%"}}]
[null,null,"Profil wyksztalcenia",{"$f":"D65","v":{"v":-9.9778163117711371E-4,"d":"-0.1%"}},{"$f":"E65","v":{"v":0.006744029079934808,"d":"0.7%"}},{"$f":"F65","v":{"v":-1.4362807816576915E-3,"d":"-0.1%"}},{"$f":"G65","v":{"v":-0.05764291098782238,"d":"-5.8%"}},{"$f":"H65","v":{"v":0.05098434942166112,"d":"5.1%"}}]
[null,"ŚWIĘTOKRZYSKIE","Roznice w efektywnosci rynku pracy",{"$f":"D48","v":{"v":-0.008925532762980184,"d":"-0.9%"}},{"$f":"E48","v":{"v":-0.004290033417369738,"d":"-0.4%"}},{"$f":"F48","v":{"v":-3.8094918765200878E-3,"d":"-0.4%"}},{"$f":"G48","v":{"v":-0.009204286865582018,"d":"-0.9%"}},{"$f":"H48","v":{"v":0.006784622290832218,"d":"0.7%"}}]
[null,null,"Profil wyksztalcenia",{"$f":"D66","v":{"v":-0.030010358229369174,"d":"-3.0%"}},{"$f":"E66","v":{"v":-0.030439401998947884,"d":"-3.0%"}},{"$f":"F66","v":{"v":-0.015244309908895038,"d":"-1.5%"}},{"$f":"G66","v":{"v":0.019046307942734608,"d":"1.9%"}},{"$f":"H66","v":{"v":0.05119200696029864,"d":"5.1%"}}]
[null,"LUBUSKIE","Roznice w efektywnosci rynku pracy",{"$f":"D49","v":{"v":0.004629124471958114,"d":"0.5%"}},{"$f":"E49","v":{"v":-0.009147102366163134,"d":"-0.9%"}},{"$f":"F49","v":{"v":3.9697377839731755E-3,"d":"0.4%"}},{"$f":"G49","v":{"v":0.005727912783626905,"d":"0.6%"}},{"$f":"H49","v":{"v":-0.004202051089751413,"d":"-0.4%"}}]
[null,null,"Profil wyksztalcenia",{"$f":"D67","v":{"v":-0.03758353435460707,"d":"-3.8%"}},{"$f":"E67","v":{"v":3.4983637270881284E-3,"d":"0.3%"}},{"$f":"F67","v":{"v":-0.006913139228627308,"d":"-0.7%"}},{"$f":"G67","v":{"v":0.04507440169978991,"d":"4.5%"}},{"$f":"H67","v":{"v":-0.006243627962763719,"d":"-0.6%"}}]
[null,"WIELKOPOLSKIE","Roznice w efektywnosci rynku pracy",{"$f":"D50","v":{"v":1.6406274198822739E-3,"d":"0.2%"}},{"$f":"E50","v":{"v":8.0135862751509615E-4,"d":"0.1%"}},{"$f":"F50","v":{"v":0.002573975896119425,"d":"0.3%"}},{"$f":"G50","v":{"v":0.008151708979035777,"d":"0.8%"}},{"$f":"H50","v":{"v":3.4482958594365108E-3,"d":"0.3%"}}]
[null,null,"Profil wyksztalcenia",{"$f":"D68","v":{"v":-0.03406316658361887,"d":"-3.4%"}},{"$f":"E68","v":{"v":-0.016911818614565907,"d":"-1.7%"}},{"$f":"F68","v":{"v":0.005706212874833468,"d":"0.6%"}},{"$f":"G68","v":{"v":0.05631952325949203,"d":"5.6%"}},{"$f":"H68","v":{"v":-0.013425992567683414,"d":"-1.3%"}}]
[null,"ZACHODNIOPOMORSKIE","Roznice w efektywnosci rynku pracy",{"$f":"D51","v":{"v":-2.7484336146444831E-4,"d":"-0.0%"}},{"$f":"E51","v":{"v":-8.6834536265623075E-4,"d":"-0.1%"}},{"$f":"F51","v":{"v":-0.005678812094505459,"d":"-0.6%"}},{"$f":"G51","v":{"v":-6.668848193029573E-3,"d":"-0.7%"}},{"$f":"H51","v":{"v":-0.010892975029584502,"d":"-1.1%"}}]
[null,null,"Profil wyksztalcenia",{"$f":"D69","v":{"v":0.0274956454920301,"d":"2.7%"}},{"$f":"E69","v":{"v":-0.02929193945492264,"d":"-2.9%"}},{"$f":"F69","v":{"v":0.016579549828552972,"d":"1.7%"}},{"$f":"G69","v":{"v":-0.01660038834000574,"d":"-1.7%"}},{"$f":"H69","v":{"v":2.5017319284468577E-3,"d":"0.3%"}}]
[null,"DOLNOŚLĄSKIE","Roznice w efektywnosci rynku pracy",{"$f":"D52","v":{"v":-1.4588834842068712E-3,"d":"-0.1%"}},{"$f":"E52","v":{"v":-0.00955644008888572,"d":"-1.0%"}},{"$f":"F52","v":{"v":7.2793202088322143E-5,"d":"0.0%"}},{"$f":"G52","v":{"v":-0.017194776268943876,"d":"-1.7%"}},{"$f":"H52","v":{"v":-0.007731018697727298,"d":"-0.8%"}}]
[null,null,"Profil wyksztalcenia",{"$f":"D70","v":{"v":0.004799205886435321,"d":"0.5%"}},{"$f":"E70","v":{"v":0.02532760087769519,"d":"2.5%"}},{"$f":"F70","v":{"v":9.0874358857146993E-4,"d":"0.1%"}},{"$f":"G70","v":{"v":-0.006792160708761492,"d":"-0.7%"}},{"$f":"H70","v":{"v":-0.022010084066726002,"d":"-2.2%"}}]
[null,"OPOLSKIE","Roznice w efektywnosci rynku pracy",{"$f":"D53","v":{"v":0.000909454918289125,"d":"0.1%"}},{"$f":"E53","v":{"v":-7.7778645134066941E-4,"d":"-0.1%"}},{"$f":"F53","v":{"v":-3.0415473857438344E-5,"d":"-0.0%"}},{"$f":"G53","v":{"v":0.006972958722690576,"d":"0.7%"}},{"$f":"H53","v":{"v":-2.548125045416579E-3,"d":"-0.3%"}}]
[null,null,"Profil wyksztalcenia",{"$f":"D71","v":{"v":-0.038735666468148126,"d":"-3.9%"}},{"$f":"E71","v":{"v":-0.004632750010757905,"d":"-0.5%"}},{"$f":"F71","v":{"v":-0.006049314634320729,"d":"-0.6%"}},{"$f":"G71","v":{"v":0.051440482463166175,"d":"5.1%"}},{"$f":"H71","v":{"v":-0.004625109813873665,"d":"-0.5%"}}]
[null,"KUJAWSKO-POMORSKIE","Roznice w efektywnosci rynku pracy",{"$f":"D54","v":{"v":9.7557955087636977E-4,"d":"0.1%"}},{"$f":"E54","v":{"v":0.002343834542665041,"d":"0.2%"}},{"$f":"F54","v":{"v":-1.191287885310506E-3,"d":"-0.1%"}},{"$f":"G54","v":{"v":-0.013508295142143833,"d":"-1.4%"}},{"$f":"H54","v":{"v":-1.8942091855498947E-3,"d":"-0.2%"}}]
[null,null,"Profil wyksztalcenia",{"$f":"D72","v":{"v":-0.07074028524854932,"d":"-7.1%"}},{"$f":"E72","v":{"v":-0.010157884700270868,"d":"-1.0%"}},{"$f":"F72","v":{"v":1.6161488028154313E-3,"d":"0.2%"}},{"$f":"G72","v":{"v":0.0563711340576143,"d":"5.6%"}},{"$f":"H72","v":{"v":0.016710497849227686,"d":"1.7%"}}]
[null,"POMORSKIE","Roznice w efektywnosci rynku pracy",{"$f":"D55","v":{"v":1.8016304690130233E-3,"d":"0.2%"}},{"$f":"E55","v":{"v":6.9691446590491174E-4,"d":"0.1%"}},{"$f":"F55","v":{"v":-3.8050334392319605E-3,"d":"-0.4%"}},{"$f":"G55","v":{"v":2.771678342483271E-3,"d":"0.3%"}},{"$f":"H55","v":{"v":-4.2416346266515356E-4,"d":"-0.0%"}}]
[null,null,"Profil wyksztalcenia",{"$f":"D73","v":{"v":-9.7022521220568381E-4,"d":"-0.1%"}},{"$f":"E73","v":{"v":-2.0452463687298033E-3,"d":"-0.2%"}},{"$f":"F73","v":{"v":0.009993226147370929,"d":"1.0%"}},{"$f":"G73","v":{"v":0.005373201059439839,"d":"0.5%"}},{"$f":"H73","v":{"v":-0.012014651205643495,"d":"-1.2%"}}]
[null,"WARMIŃSKO-MAZURSKIE","Roznice w efektywnosci rynku pracy",{"$f":"D56","v":{"v":1.8381371600100463E-3,"d":"0.2%"}},{"$f":"E56","v":{"v":0.005890256352980442,"d":"0.6%"}},{"$f":"F56","v":{"v":-4.9029743858194951E-4,"d":"-0.0%"}},{"$f":"G56","v":{"v":6.5976873403273241E-4,"d":"0.1%"}},{"$f":"H56","v":{"v":-9.649711133047148E-3,"d":"-1.0%"}}]
[null,null,"Profil wyksztalcenia",{"$f":"D74","v":{"v":-0.037321951683194673,"d":"-3.7%"}},{"$f":"E74","v":{"v":-0.010060969388850894,"d":"-1.0%"}},{"$f":"F74","v":{"v":-0.008700428720648157,"d":"-0.9%"}},{"$f":"G74","v":{"v":0.018966871685914766,"d":"1.9%"}},{"$f":"H74","v":{"v":0.03263483799218975,"d":"3.3%"}}]
[]
[]
[]
[null,null,"Różnice w efektywności rynku pracy","wyższe","policealne oraz średnie zawodowe","średnie ogólnokształcące","zasadnicze zawodowe","gimnazjalne, podstawowe i niższe","SUMA (**)"]
[null,null,"ŁÓDZKIE",{"$f":"D78*(E97-E$113)/$D$113","v":{"v":3.3760022499812361E-4,"d":"0.03%"}},{"v":-0.001996178334695921,"d":"-0.20%"},{"v":3.0956964826462587E-3,"d":"0.31%"},{"v":0.002584667773087043,"d":"0.26%"},{"v":1.7857410457224504E-4,"d":"0.02%"},{"$f":"SUM(D41:H41)","v":{"v":0.004200360250607749,"d":"0.42%"}}]
[null,null,"MAZOWIECKIE",{"v":0.000328248137509662,"d":"0.03%"},{"v":1.3190847475344025E-3,"d":"0.13%"},{"v":6.7637300479249374E-4,"d":"0.07%"},{"v":-2.0248975472246704E-3,"d":"-0.20%"},{"v":-1.2757285503128424E-3,"d":"-0.13%"},{"v":-9.7692020770095457E-4,"d":"-0.10%"}]
[null,null,"MAŁOPOLSKIE",{"v":-0.001313875501053938,"d":"-0.13%"},{"v":2.2740316879221543E-3,"d":"0.23%"},{"v":-0.002115396206785025,"d":"-0.21%"},{"v":7.400099465964852E-3,"d":"0.74%"},{"v":0.004083366828433256,"d":"0.41%"},{"v":0.010328226274481298,"d":"1.03%"}]
[null,null,"ŚLĄSKIE",{"v":9.7457466457632276E-4,"d":"0.10%"},{"v":0.006037258602780169,"d":"0.60%"},{"v":3.2111164232999285E-3,"d":"0.32%"},{"v":0.009004409563091686,"d":"0.90%"},{"v":-5.238174388184056E-3,"d":"-0.52%"},{"v":0.01398918486556405,"d":"1.40%"}]
[null,null,"LUBELSKIE",{"v":-2.2589969639066274E-3,"d":"-0.23%"},{"v":0.002768946040070989,"d":"0.28%"},{"v":-0.004023934593208102,"d":"-0.40%"},{"v":-6.98458562616799e-05,"d":"-0.01%"},{"v":0.00934608218906733,"d":"0.93%"},{"v":0.005762250815761909,"d":"0.58%"}]
[null,null,"PODKARPACKIE",{"v":-1.6584268716588252E-3,"d":"-0.17%"},{"v":-0.003664782231816909,"d":"-0.37%"},{"v":-1.3925846567846292E-3,"d":"-0.14%"},{"v":-4.0781587047085471E-5,"d":"-0.00%"},{"v":0.012135280551231748,"d":"1.21%"},{"v":5.3787052039242994E-3,"d":"0.54%"}]
[null,null,"PODLASKIE",{"v":0.002107612842155487,"d":"0.21%"},{"v":-1.0975655491987384E-3,"d":"-0.11%"},{"v":5.2198499849030354E-4,"d":"0.05%"},{"v":-1.8959830732656713E-3,"d":"-0.19%"},{"v":0.009185596769934653,"d":"0.92%"},{"v":0.008821645988116035,"d":"0.88%"}]
[null,null,"ŚWIĘTOKRZYSKIE",{"v":-0.008925532762980184,"d":"-0.89%"},{"v":-0.004290033417369738,"d":"-0.43%"},{"v":-3.8094918765200878E-3,"d":"-0.38%"},{"v":-0.009204286865582018,"d":"-0.92%"},{"v":0.006784622290832218,"d":"0.68%"},{"v":-0.01944472263161981,"d":"-1.94%"}]
[null,null,"LUBUSKIE",{"v":0.004629124471958114,"d":"0.46%"},{"v":-0.009147102366163134,"d":"-0.91%"},{"v":3.9697377839731755E-3,"d":"0.40%"},{"v":0.005727912783626905,"d":"0.57%"},{"v":-0.004202051089751413,"d":"-0.42%"},{"v":9.7762158364364787E-4,"d":"0.10%"}]
[null,null,"WIELKOPOLSKIE",{"v":1.6406274198822739E-3,"d":"0.16%"},{"v":8.0135862751509615E-4,"d":"0.08%"},{"v":0.002573975896119425,"d":"0.26%"},{"v":0.008151708979035777,"d":"0.82%"},{"v":3.4482958594365108E-3,"d":"0.34%"},{"v":0.016615966781989084,"d":"1.66%"}]
[null,null,"ZACHODNIOPOMORSKIE",{"$f":"D88*(E107-E$113)/$D$113","v":{"v":-2.7484336146444831E-4,"d":"-0.03%"}},{"v":-8.6834536265623075E-4,"d":"-0.09%"},{"v":-0.005678812094505459,"d":"-0.57%"},{"v":-6.668848193029573E-3,"d":"-0.67%"},{"v":-0.010892975029584502,"d":"-1.09%"},{"v":-0.02438382404124021,"d":"-2.44%"}]
[null,null,"DOLNOŚLĄSKIE",{"v":-1.4588834842068712E-3,"d":"-0.15%"},{"v":-0.00955644008888572,"d":"-0.96%"},{"v":7.2793202088322143E-5,"d":"0.01%"},{"v":-0.017194776268943876,"d":"-1.72%"},{"v":-0.007731018697727298,"d":"-0.77%"},{"v":-0.03586832533767544,"d":"-3.59%"}]
[null,null,"OPOLSKIE",{"v":0.000909454918289125,"d":"0.09%"},{"v":-7.7778645134066941E-4,"d":"-0.08%"},{"v":-3.0415473857438344E-5,"d":"-0.00%"},{"v":0.006972958722690576,"d":"0.70%"},{"v":-2.548125045416579E-3,"d":"-0.25%"},{"v":0.004526086670365014,"d":"0.45%"}]
[null,null,"KUJAWSKO-POMORSKIE",{"v":9.7557955087636977E-4,"d":"0.10%"},{"v":0.002343834542665041,"d":"0.23%"},{"v":-1.191287885310506E-3,"d":"-0.12%"},{"v":-0.013508295142143833,"d":"-1.35%"},{"v":-1.8942091855498947E-3,"d":"-0.19%"},{"v":-0.013274378119462823,"d":"-1.33%"}]
[null,null,"POMORSKIE",{"v":1.8016304690130233E-3,"d":"0.18%"},{"v":6.9691446590491174E-4,"d":"0.07%"},{"v":-3.8050334392319605E-3,"d":"-0.38%"},{"v":2.771678342483271E-3,"d":"0.28%"},{"v":-4.2416346266515356E-4,"d":"-0.04%"},{"v":1.0410263755040918E-3,"d":"0.10%"}]
[null,null,"WARMIŃSKO-MAZURSKIE",{"v":1.8381371600100463E-3,"d":"0.18%"},{"v":0.005890256352980442,"d":"0.59%"},{"v":-4.9029743858194951E-4,"d":"-0.05%"},{"v":6.5976873403273241E-4,"d":"0.07%"},{"v":-9.649711133047148E-3,"d":"-0.96%"},{"v":-1.7518463246058765E-3,"d":"-0.18%"}]
[]
[null,null,"Profil wyksztalcenia","wyższe","policealne oraz średnie zawodowe","średnie ogólnokształcące","zasadnicze zawodowe","gimnazjalne, podstawowe i niższe","SUMA (**)",null,"(Pzi/AZi-PZ/AZ)/(PZ/AZ)","Weryfikacja",null,"(Pzi/AZi-PZ/AZ)/(PZ/AZ)","Weryfikacja"]
[null,null,"ŁÓDZKIE",{"$f":"E$113*(D78-D$94)/$D$113","v":{"v":-3.736061465553428E-3,"d":"-0.37%"}},{"v":-0.00881813139959674,"d":"-0.88%"},{"v":6.8915252570760045E-3,"d":"0.69%"},{"v":-0.011248194036102542,"d":"-1.12%"},{"v":0.015512468076148579,"d":"1.55%"},{"$f":"SUM(D59:H59)","v":{"v":-1.3983935680281258E-3,"d":"-0.14%"}},null,{"$f":"(D97-D$113)/D$113","v":{"v":0.002801966682579572,"d":"0.28%"}},{"$f":"I41+I59","v":{"v":2.8019666825796234E-3,"d":"0.28%"}},null,{"$f":"('2007prac'!#REF!-'2007prac'!#REF!)/'2007prac'!#REF!","v":{"$error":"#REF!"}},{"$f":"#REF!+I59","v":{"$error":"#REF!"}}]
[null,null,"MAZOWIECKIE",{"v":0.08731552793077559,"d":"8.73%"},{"v":-0.003354768407362692,"d":"-0.34%"},{"v":0.01124165887679198,"d":"1.12%"},{"v":-0.07474756350729118,"d":"-7.47%"},{"v":-0.013811029412008173,"d":"-1.38%"},{"v":0.006643825480905509,"d":"0.66%"},null,{"v":0.005666905273204402,"d":"0.57%"},{"v":0.005666905273204554,"d":"0.57%"},null,{"$f":"('2007prac'!#REF!-'2007prac'!#REF!)/'2007prac'!#REF!","v":{"$error":"#REF!"}},{"$f":"#REF!+I60","v":{"$error":"#REF!"}}]
[null,null,"MAŁOPOLSKIE",{"v":0.007224608433630891,"d":"0.72%"},{"v":-0.011222563659060152,"d":"-1.12%"},{"v":2.4406579684196497E-3,"d":"0.24%"},{"v":0.014962387481231243,"d":"1.50%"},{"v":-0.012659599906825346,"d":"-1.27%"},{"v":0.000745490317396286,"d":"0.07%"},null,{"v":0.011073716591877539,"d":"1.11%"},{"v":0.011073716591877584,"d":"1.11%"},null,{"$f":"('2007prac'!#REF!-'2007prac'!#REF!)/'2007prac'!#REF!","v":{"$error":"#REF!"}},{"$f":"#REF!+I61","v":{"$error":"#REF!"}}]
[null,null,"ŚLĄSKIE",{"v":-5.3464091066661844E-3,"d":"-0.53%"},{"v":0.040086978145086063,"d":"4.01%"},{"v":-0.01186437007372533,"d":"-1.19%"},{"v":0.019208354185010865,"d":"1.92%"},{"v":-0.039098969569810266,"d":"-3.91%"},{"v":2.9855835798951458E-3,"d":"0.30%"},null,{"v":0.016974768445459056,"d":"1.70%"},{"v":0.016974768445459195,"d":"1.70%"},null,{"$f":"('2007prac'!#REF!-'2007prac'!#REF!)/'2007prac'!#REF!","v":{"$error":"#REF!"}},{"$f":"#REF!+I62","v":{"$error":"#REF!"}}]
[null,null,"LUBELSKIE",{"v":-0.018777454910177602,"d":"-1.88%"},{"v":-0.006700817091138317,"d":"-0.67%"},{"v":-0.009840534002457891,"d":"-0.98%"},{"v":-0.013469902145881105,"d":"-1.35%"},{"v":0.04513182091088301,"d":"4.51%"},{"v":-3.6568872387719026E-3,"d":"-0.37%"},null,{"v":2.105363576989859E-3,"d":"0.21%"},{"v":0.002105363576990007,"d":"0.21%"},null,{"$f":"('2007prac'!#REF!-'2007prac'!#REF!)/'2007prac'!#REF!","v":{"$error":"#REF!"}},{"$f":"#REF!+I63","v":{"$error":"#REF!"}}]
[null,null,"PODKARPACKIE",{"v":-0.03614066616158031,"d":"-3.61%"},{"v":0.008749111701610144,"d":"0.87%"},{"v":-0.01597447470228835,"d":"-1.60%"},{"v":0.009722248406987708,"d":"0.97%"},{"v":0.030068277017244516,"d":"3.01%"},{"v":-3.5755037380262866E-3,"d":"-0.36%"},null,{"v":1.8032014658979803E-3,"d":"0.18%"},{"v":1.8032014658980128E-3,"d":"0.18%"},null,{"$f":"('2007prac'!#REF!-'2007prac'!#REF!)/'2007prac'!#REF!","v":{"$error":"#REF!"}},{"$f":"#REF!+I64","v":{"$error":"#REF!"}}]
[null,null,"PODLASKIE",{"v":-9.9778163117711371E-4,"d":"-0.10%"},{"v":0.006744029079934808,"d":"0.67%"},{"v":-1.4362807816576915E-3,"d":"-0.14%"},{"v":-0.05764291098782238,"d":"-5.76%"},{"v":0.05098434942166112,"d":"5.10%"},{"v":-2.3485948990612515E-3,"d":"-0.23%"},null,{"v":0.006473051089054722,"d":"0.65%"},{"v":0.006473051089054783,"d":"0.65%"},null,{"$f":"('2007prac'!#REF!-'2007prac'!#REF!)/'2007prac'!#REF!","v":{"$error":"#REF!"}},{"$f":"#REF!+I65","v":{"$error":"#REF!"}}]
[null,null,"ŚWIĘTOKRZYSKIE",{"v":-0.030010358229369174,"d":"-3.00%"},{"v":-0.030439401998947884,"d":"-3.04%"},{"v":-0.015244309908895038,"d":"-1.52%"},{"v":0.019046307942734608,"d":"1.90%"},{"v":0.05119200696029864,"d":"5.12%"},{"v":-0.005455755234178843,"d":"-0.55%"},null,{"v":-0.024900477865798788,"d":"-2.49%"},{"v":-0.024900477865798652,"d":"-2.49%"},null,{"$f":"('2007prac'!#REF!-'2007prac'!#REF!)/'2007prac'!#REF!","v":{"$error":"#REF!"}},{"$f":"#REF!+I66","v":{"$error":"#REF!"}}]
[null,null,"LUBUSKIE",{"v":-0.03758353435460707,"d":"-3.76%"},{"v":3.4983637270881284E-3,"d":"0.35%"},{"v":-0.006913139228627308,"d":"-0.69%"},{"v":0.04507440169978991,"d":"4.51%"},{"v":-0.006243627962763719,"d":"-0.62%"},{"v":-2.1675361191200605E-3,"d":"-0.22%"},null,{"v":-1.1899145354764538E-3,"d":"-0.12%"},{"v":-1.1899145354764126E-3,"d":"-0.12%"},null,{"$f":"('2007prac'!#REF!-'2007prac'!#REF!)/'2007prac'!#REF!","v":{"$error":"#REF!"}},{"$f":"#REF!+I67","v":{"$error":"#REF!"}}]
[null,null,"WIELKOPOLSKIE",{"v":-0.03406316658361887,"d":"-3.41%"},{"v":-0.016911818614565907,"d":"-1.69%"},{"v":0.005706212874833468,"d":"0.57%"},{"v":0.05631952325949203,"d":"5.63%"},{"v":-0.013425992567683414,"d":"-1.34%"},{"v":-0.002375241631542688,"d":"-0.24%"},null,{"v":0.014240725150446323,"d":"1.42%"},{"v":0.014240725150446396,"d":"1.42%"},null,{"$f":"('2007prac'!#REF!-'2007prac'!#REF!)/'2007prac'!#REF!","v":{"$error":"#REF!"}},{"$f":"#REF!+I68","v":{"$error":"#REF!"}}]
[null,null,"ZACHODNIOPOMORSKIE",{"$f":"E$113*(D88-D$94)/$D$113","v":{"v":0.0274956454920301,"d":"2.75%"}},{"v":-0.02929193945492264,"d":"-2.93%"},{"v":0.016579549828552972,"d":"1.66%"},{"v":-0.01660038834000574,"d":"-1.66%"},{"v":2.5017319284468577E-3,"d":"0.25%"},{"v":0.000684599454101549,"d":"0.07%"},null,{"v":-0.02369922458713875,"d":"-2.37%"},{"v":-0.023699224587138662,"d":"-2.37%"},null,{"$f":"('2007prac'!#REF!-'2007prac'!#REF!)/'2007prac'!#REF!","v":{"$error":"#REF!"}},{"$f":"#REF!+I69","v":{"$error":"#REF!"}}]
[null,null,"DOLNOŚLĄSKIE",{"v":0.004799205886435321,"d":"0.48%"},{"v":0.02532760087769519,"d":"2.53%"},{"v":9.0874358857146993E-4,"d":"0.09%"},{"v":-0.006792160708761492,"d":"-0.68%"},{"v":-0.022010084066726002,"d":"-2.20%"},{"v":0.002233305577214486,"d":"0.22%"},null,{"v":-0.03363501976046098,"d":"-3.36%"},{"v":-0.03363501976046096,"d":"-3.36%"},null,{"$f":"('2007prac'!#REF!-'2007prac'!#REF!)/'2007prac'!#REF!","v":{"$error":"#REF!"}},{"$f":"#REF!+I70","v":{"$error":"#REF!"}}]
[null,null,"OPOLSKIE",{"v":-0.038735666468148126,"d":"-3.87%"},{"v":-0.004632750010757905,"d":"-0.46%"},{"v":-0.006049314634320729,"d":"-0.60%"},{"v":0.051440482463166175,"d":"5.14%"},{"v":-0.004625109813873665,"d":"-0.46%"},{"v":-0.002602358463934251,"d":"-0.26%"},null,{"v":1.9237282064307193E-3,"d":"0.19%"},{"v":1.9237282064307627E-3,"d":"0.19%"},null,{"$f":"('2007prac'!#REF!-'2007prac'!#REF!)/'2007prac'!#REF!","v":{"$error":"#REF!"}},{"$f":"#REF!+I71","v":{"$error":"#REF!"}}]
[null,null,"KUJAWSKO-POMORSKIE",{"v":-0.07074028524854932,"d":"-7.07%"},{"v":-0.010157884700270868,"d":"-1.02%"},{"v":1.6161488028154313E-3,"d":"0.16%"},{"v":0.0563711340576143,"d":"5.64%"},{"v":0.016710497849227686,"d":"1.67%"},{"v":-0.00620038923916276,"d":"-0.62%"},null,{"v":-0.01947476735862569,"d":"-1.95%"},{"v":-0.019474767358625585,"d":"-1.95%"},null,{"$f":"('2007prac'!#REF!-'2007prac'!#REF!)/'2007prac'!#REF!","v":{"$error":"#REF!"}},{"$f":"#REF!+I72","v":{"$error":"#REF!"}}]
[null,null,"POMORSKIE",{"v":-9.7022521220568381E-4,"d":"-0.10%"},{"v":-2.0452463687298033E-3,"d":"-0.20%"},{"v":0.009993226147370929,"d":"1.00%"},{"v":0.005373201059439839,"d":"0.54%"},{"v":-0.012014651205643495,"d":"-1.20%"},{"v":3.3630442023178421E-4,"d":"0.03%"},null,{"v":1.3773307957358131E-3,"d":"0.14%"},{"v":1.377330795735876E-3,"d":"0.14%"},null,{"$f":"('2007prac'!#REF!-'2007prac'!#REF!)/'2007prac'!#REF!","v":{"$error":"#REF!"}},{"$f":"#REF!+I73","v":{"$error":"#REF!"}}]
[null,null,"WARMIŃSKO-MAZURSKIE",{"v":-0.037321951683194673,"d":"-3.73%"},{"v":-0.010060969388850894,"d":"-1.01%"},{"v":-0.008700428720648157,"d":"-0.87%"},{"v":0.018966871685914766,"d":"1.90%"},{"v":0.03263483799218975,"d":"3.26%"},{"v":-0.004481640114589208,"d":"-0.45%"},null,{"v":-0.006233486439195169,"d":"-0.62%"},{"v":-0.006233486439195085,"d":"-0.62%"},null,{"$f":"('2007prac'!#REF!-'2007prac'!#REF!)/'2007prac'!#REF!","v":{"$error":"#REF!"}},{"$f":"#REF!+I74","v":{"$error":"#REF!"}}]
[]
[]
[null,null,"Azij/AZi","wyższe","policealne oraz średnie zawodowe","średnie ogólnokształcące","zasadnicze zawodowe","gimnazjalne, podstawowe i niższe"]
[null,null,"ŁÓDZKIE",{"$f":"E116/$D116","v":0.21183345507669832},0.28122717311906503,0.09276844411979547,0.295836376917458,0.1183345507669832]
[null,null,"MAZOWIECKIE",0.2981341802302501,0.2866216752679635,0.09726081778483525,0.23104406510520048,0.0869392616117507]
[null,null,"MAŁOPOLSKIE",0.2222222222222222,0.27885304659498206,0.08817204301075268,0.3225806451612903,0.08817204301075268]
[null,null,"ŚLĄSKIE",0.21030713170223841,0.3295158771473191,0.07339927121290994,0.3269130661114003,0.05986465382613222]
[null,null,"LUBELSKIE",0.19757688723205966,0.2833178005591799,0.0754892823858341,0.293569431500466,0.1500465983224604]
[null,null,"PODKARPACKIE",0.18111964873765093,0.29857299670691545,0.06915477497255763,0.3172338090010977,0.13391877058177826]
[null,null,"PODLASKIE",0.21442885771543085,0.2965931863727455,0.0841683366733467,0.24849699398797595,0.156312625250501]
[null,null,"ŚWIĘTOKRZYSKIE",0.18693009118541035,0.25987841945288753,0.06990881458966565,0.32674772036474165,0.15653495440729484]
[null,null,"LUBUSKIE",0.1797520661157025,0.29338842975206614,0.07851239669421488,0.35330578512396693,0.09504132231404959]
[null,null,"WIELKOPOLSKIE",0.18308874912648498,0.273235499650594,0.09154437456324249,0.36477987421383645,0.08735150244584207]
[null,null,"ZACHODNIOPOMORSKIE",{"$f":"E126/$D126","v":0.24143556280587275},0.26101141924959215,0.10277324632952692,0.2903752039151713,0.10440456769983687]
[null,null,"DOLNOŚLĄSKIE",0.21992337164750958,0.31494252873563217,0.08659003831417625,0.3003831417624521,0.07816091954022988]
[null,null,"OPOLSKIE",0.17866004962779156,0.2853598014888337,0.0794044665012407,0.3598014888337469,0.0967741935483871]
[null,null,"KUJAWSKO-POMORSKIE",0.14832535885167464,0.2799043062200957,0.08732057416267942,0.36483253588516745,0.11961722488038277]
[null,null,"POMORSKIE",0.21445497630331753,0.28791469194312796,0.09597156398104266,0.3127962085308057,0.08886255924170616]
[null,null,"WARMIŃSKO-MAZURSKIE",0.18,0.28,0.07666666666666666,0.32666666666666666,0.13666666666666666]
[null,null,"POLSKA",0.21537457737706864,0.28993415979595466,0.08565158075805208,0.3073136010439528,0.10172608102497183]
[]
[null,null,"Pzij/AZij","Ogółem","wyższe","policealne oraz średnie zawodowe","średnie ogólnokształcące","zasadnicze zawodowe","gimnazjalne, podstawowe i niższe"]
[null,null,"ŁÓDZKIE",{"$f":"D135/D116","v":0.9065010956902849},0.9551724137931035,0.9090909090909091,0.905511811023622,0.8938271604938272,0.845679012345679]
[null,null,"MAZOWIECKIE",0.9090909090909091,0.9547270306258322,0.9196675900277008,0.8816326530612245,0.8780068728522337,0.8310502283105022]
[null,null,"MAŁOPOLSKIE",0.9139784946236559,0.9483870967741935,0.922879177377892,0.8536585365853658,0.9066666666666666,0.8861788617886179]
[null,null,"ŚLĄSKIE",0.9193128578865174,0.9579207920792079,0.9320695102685624,0.9148936170212766,0.910828025477707,0.7652173913043478]
[null,null,"LUBELSKIE",0.9058713886300093,0.9433962264150944,0.9243421052631579,0.8271604938271605,0.8857142857142857,0.9006211180124224]
[null,null,"PODKARPACKIE",0.9055982436882547,0.9454545454545454,0.9044117647058824,0.8571428571428571,0.8858131487889274,0.9262295081967213]
[null,null,"PODLASKIE",0.9098196392785571,0.9626168224299065,0.9121621621621622,0.8809523809523809,0.8790322580645161,0.8974358974358975]
[null,null,"ŚWIĘTOKRZYSKIE",0.8814589665653495,0.9105691056910569,0.9005847953216374,0.8260869565217391,0.8604651162790697,0.883495145631068]
[null,null,"LUBUSKIE",0.9028925619834711,0.9770114942528736,0.8873239436619719,0.9210526315789473,0.9005847953216374,0.8043478260869565]
[null,null,"WIELKOPOLSKIE",0.9168413696715584,0.9618320610687023,0.9181585677749361,0.9007633587786259,0.9061302681992337,0.88]
[null,null,"ZACHODNIOPOMORSKIE",{"$f":"D145/D126","v":0.8825448613376835},0.9527027027027027,0.9125,0.8253968253968254,0.8651685393258427,0.75]
[null,null,"DOLNOŚLĄSKIE",0.8735632183908046,0.9477351916376306,0.8880778588807786,0.8761061946902655,0.8341836734693877,0.7549019607843137]
[null,null,"OPOLSKIE",0.9057071960297767,0.9583333333333334,0.9130434782608695,0.875,0.903448275862069,0.8205128205128205]
[null,null,"KUJAWSKO-POMORSKIE",0.8863636363636364,0.9596774193548387,0.9230769230769231,0.863013698630137,0.8524590163934426,0.83]
[null,null,"POMORSKIE",0.9052132701421801,0.9613259668508287,0.9176954732510288,0.8395061728395061,0.8939393939393939,0.84]
[null,null,"WARMIŃSKO-MAZURSKIE",0.8983333333333333,0.9629629629629629,0.9345238095238095,0.8695652173913043,0.8877551020408163,0.7804878048780488]
[null,null,"POLSKA",0.903968206892461,0.953731754337648,0.91550736497545,0.8753462603878116,0.8859293572669369,0.8443148688046648]
[]
[null,null,"AZij","Ogółem","wyższe","policealne oraz średnie zawodowe","średnie ogólnokształcące","zasadnicze zawodowe","gimnazjalne, podstawowe i niższe"]
[null,null,"ŁÓDZKIE",1369,290,385,127,405,162]
[null,null,"MAZOWIECKIE",2519,751,722,245,582,219]
[null,null,"MAŁOPOLSKIE",1395,310,389,123,450,123]
[null,null,"ŚLĄSKIE",1921,404,633,141,628,115]
[null,null,"LUBELSKIE",1073,212,304,81,315,161]
[null,null,"PODKARPACKIE",911,165,272,63,289,122]
[null,null,"PODLASKIE",499,107,148,42,124,78]
[null,null,"ŚWIĘTOKRZYSKIE",658,123,171,46,215,103]
[null,null,"LUBUSKIE",484,87,142,38,171,46]
[null,null,"WIELKOPOLSKIE",1431,262,391,131,522,125]
[null,null,"ZACHODNIOPOMORSKIE",613,148,160,63,178,64]
[null,null,"DOLNOŚLĄSKIE",1305,287,411,113,392,102]
[null,null,"OPOLSKIE",403,72,115,32,145,39]
[null,null,"KUJAWSKO-POMORSKIE",836,124,234,73,305,100]
[null,null,"POMORSKIE",844,181,243,81,264,75]
[null,null,"WARMIŃSKO-MAZURSKIE",600,108,168,46,196,82]
[null,null,"POLSKA",16859,3631,4888,1444,5181,1715]
[]
[null,null,"Pzij","Ogółem","wyższe","policealne oraz średnie zawodowe","średnie ogólnokształcące","zasadnicze zawodowe","gimnazjalne, podstawowe i niższe"]
[null,null,"ŁÓDZKIE",1241,277,350,115,362,137]
[null,null,"MAZOWIECKIE",2290,717,664,216,511,182]
[null,null,"MAŁOPOLSKIE",1275,294,359,105,408,109]
[null,null,"ŚLĄSKIE",1766,387,590,129,572,88]
[null,null,"LUBELSKIE",972,200,281,67,279,145]
[null,null,"PODKARPACKIE",825,156,246,54,256,113]
[null,null,"PODLASKIE",454,103,135,37,109,70]
[null,null,"ŚWIĘTOKRZYSKIE",580,112,154,38,185,91]
[null,null,"LUBUSKIE",437,85,126,35,154,37]
[null,null,"WIELKOPOLSKIE",1312,252,359,118,473,110]
[null,null,"ZACHODNIOPOMORSKIE",541,141,146,52,154,48]
[null,null,"DOLNOŚLĄSKIE",1140,272,365,99,327,77]
[null,null,"OPOLSKIE",365,69,105,28,131,32]
[null,null,"KUJAWSKO-POMORSKIE",741,119,216,63,260,83]
[null,null,"POMORSKIE",764,174,223,68,236,63]
[null,null,"WARMIŃSKO-MAZURSKIE",539,104,157,40,174,64]
[null,null,"POLSKA",15240,3463,4475,1264,4590,1448]

{"sheet":"2002prac","index":7,"n_rows":151,"n_cols":15,"rows_kept":151,"hidden":true,"merged":[[0,1,0,7],[1,1,1,7]]}
[null,"Poddekompozycja różnic w udziale PRACUJĄCYCH wśród aktywnych zawodowo"]
[null,2002]
[]
[null,null,"Sekcje","wyższe","policealne oraz średnie zawodowe","średnie ogólnokształcące","zasadnicze zawodowe","gimnazjalne, podstawowe i niższe"]
[null,"ŁÓDZKIE","Roznice w efektywnosci rynku pracy",{"$f":"D41","v":{"v":-0.007049141156277306,"d":"-0.7%"}},{"$f":"E41","v":{"v":-1.9438940781098203E-4,"d":"-0.0%"}},{"$f":"F41","v":{"v":-1.4122813063139348E-3,"d":"-0.1%"}},{"$f":"G41","v":{"v":3.705141603257731E-3,"d":"0.4%"}},{"$f":"H41","v":{"v":-6.8803322601920227E-4,"d":"-0.1%"}}]
[null,null,"Profil wyksztalcenia",{"$f":"D59","v":{"v":0.006573284271426006,"d":"0.7%"}},{"$f":"E59","v":{"v":-5.2871950966236515E-3,"d":"-0.5%"}},{"$f":"F59","v":{"v":0.011051205832297753,"d":"1.1%"}},{"$f":"G59","v":{"v":-0.04319002612408757,"d":"-4.3%"}},{"$f":"H59","v":{"v":0.03122870253560989,"d":"3.1%"}}]
[null,"MAZOWIECKIE","Roznice w efektywnosci rynku pracy",{"$f":"D42","v":{"v":2.1046007892738614E-3,"d":"0.2%"}},{"$f":"E42","v":{"v":0.008318752191812745,"d":"0.8%"}},{"$f":"F42","v":{"v":0.004925126750180047,"d":"0.5%"}},{"$f":"G42","v":{"v":0.00417684038426953,"d":"0.4%"}},{"$f":"H42","v":{"v":0.007288825285234726,"d":"0.7%"}}]
[null,null,"Profil wyksztalcenia",{"$f":"D60","v":{"v":0.042341110498668705,"d":"4.2%"}},{"$f":"E60","v":{"v":0.011359847331982644,"d":"1.1%"}},{"$f":"F60","v":{"v":0.018479454400569566,"d":"1.8%"}},{"$f":"G60","v":{"v":-0.06404530346404404,"d":"-6.4%"}},{"$f":"H60","v":{"v":9.3338296231453943E-4,"d":"0.1%"}}]
[null,"MAŁOPOLSKIE","Roznice w efektywnosci rynku pracy",{"$f":"D43","v":{"v":0.000868600856037137,"d":"0.1%"}},{"$f":"E43","v":{"v":0.006940015618112544,"d":"0.7%"}},{"$f":"F43","v":{"v":-8.7854288620197937E-4,"d":"-0.1%"}},{"$f":"G43","v":{"v":0.022061910990148474,"d":"2.2%"}},{"$f":"H43","v":{"v":0.017837973844989054,"d":"1.8%"}}]
[null,null,"Profil wyksztalcenia",{"$f":"D61","v":{"v":0.011762835319382912,"d":"1.2%"}},{"$f":"E61","v":{"v":-0.01823131920872151,"d":"-1.8%"}},{"$f":"F61","v":{"v":-0.005352984725656276,"d":"-0.5%"}},{"$f":"G61","v":{"v":0.021843928445450817,"d":"2.2%"}},{"$f":"H61","v":{"v":-0.009402577155964114,"d":"-0.9%"}}]
[null,"ŚLĄSKIE","Roznice w efektywnosci rynku pracy",{"$f":"D44","v":{"v":0.003479668933111741,"d":"0.3%"}},{"$f":"E44","v":{"v":0.004158632065913583,"d":"0.4%"}},{"$f":"F44","v":{"v":0.00238390194927669,"d":"0.2%"}},{"$f":"G44","v":{"v":-1.6194234692076892E-3,"d":"-0.2%"}},{"$f":"H44","v":{"v":-0.011526891490208626,"d":"-1.2%"}}]
[null,null,"Profil wyksztalcenia",{"$f":"D62","v":{"v":-9.752741921885924E-3,"d":"-1.0%"}},{"$f":"E62","v":{"v":0.020808712872686003,"d":"2.1%"}},{"$f":"F62","v":{"v":0.009638924525983824,"d":"1.0%"}},{"$f":"G62","v":{"v":0.035872960606686606,"d":"3.6%"}},{"$f":"H62","v":{"v":-0.05545570076152017,"d":"-5.5%"}}]
[null,"LUBELSKIE","Roznice w efektywnosci rynku pracy",{"$f":"D45","v":{"v":-3.43302973650672E-3,"d":"-0.3%"}},{"$f":"E45","v":{"v":-4.4312290969306094E-3,"d":"-0.4%"}},{"$f":"F45","v":{"v":-7.1133123975352188E-4,"d":"-0.1%"}},{"$f":"G45","v":{"v":0.01736626503169537,"d":"1.7%"}},{"$f":"H45","v":{"v":0.03412758553089722,"d":"3.4%"}}]
[null,null,"Profil wyksztalcenia",{"$f":"D63","v":{"v":0.009122927100287455,"d":"0.9%"}},{"$f":"E63","v":{"v":-0.015717627873218124,"d":"-1.6%"}},{"$f":"F63","v":{"v":-3.6278835007744906E-3,"d":"-0.4%"}},{"$f":"G63","v":{"v":-0.042293210719376834,"d":"-4.2%"}},{"$f":"H63","v":{"v":0.051884993174097005,"d":"5.2%"}}]
[null,"PODKARPACKIE","Roznice w efektywnosci rynku pracy",{"$f":"D46","v":{"v":-2.7901818554145886E-3,"d":"-0.3%"}},{"$f":"E46","v":{"v":-0.007932858840706056,"d":"-0.8%"}},{"$f":"F46","v":{"v":1.037407070076748E-3,"d":"0.1%"}},{"$f":"G46","v":{"v":9.932286508326128E-3,"d":"1.0%"}},{"$f":"H46","v":{"v":0.025729092034330023,"d":"2.6%"}}]
[null,null,"Profil wyksztalcenia",{"$f":"D64","v":{"v":-0.024909128548832444,"d":"-2.5%"}},{"$f":"E64","v":{"v":0.01032862275026317,"d":"1.0%"}},{"$f":"F64","v":{"v":-0.013890936718323333,"d":"-1.4%"}},{"$f":"G64","v":{"v":-0.005698585854923115,"d":"-0.6%"}},{"$f":"H64","v":{"v":0.029814724204697985,"d":"3.0%"}}]
[null,"PODLASKIE","Roznice w efektywnosci rynku pracy",{"$f":"D47","v":{"v":1.4052372331425705E-3,"d":"0.1%"}},{"$f":"E47","v":{"v":-0.004366440940435739,"d":"-0.4%"}},{"$f":"F47","v":{"v":-0.0026212486854387,"d":"-0.3%"}},{"$f":"G47","v":{"v":0.012296227570558673,"d":"1.2%"}},{"$f":"H47","v":{"v":0.030598872911025705,"d":"3.1%"}}]
[null,null,"Profil wyksztalcenia",{"$f":"D65","v":{"v":0.003461013431976201,"d":"0.3%"}},{"$f":"E65","v":{"v":-0.006273040508797527,"d":"-0.6%"}},{"$f":"F65","v":{"v":-0.007716443527162826,"d":"-0.8%"}},{"$f":"G65","v":{"v":-0.05837175818752018,"d":"-5.8%"}},{"$f":"H65","v":{"v":0.06775176694665236,"d":"6.8%"}}]
[null,"ŚWIĘTOKRZYSKIE","Roznice w efektywnosci rynku pracy",{"$f":"D48","v":{"v":-0.007890991741619478,"d":"-0.8%"}},{"$f":"E48","v":{"v":-9.9284871309981157E-4,"d":"-0.1%"}},{"$f":"F48","v":{"v":-0.004418610602319837,"d":"-0.4%"}},{"$f":"G48","v":{"v":-1.0626308530658922E-3,"d":"-0.1%"}},{"$f":"H48","v":{"v":0.026563898785145545,"d":"2.7%"}}]
[null,null,"Profil wyksztalcenia",{"$f":"D66","v":{"v":1.5726343196161574E-3,"d":"0.2%"}},{"$f":"E66","v":{"v":0.007544524138517051,"d":"0.8%"}},{"$f":"F66","v":{"v":-0.01475630281492135,"d":"-1.5%"}},{"$f":"G66","v":{"v":-1.7588444146241207E-3,"d":"-0.2%"}},{"$f":"H66","v":{"v":0.00802757089687054,"d":"0.8%"}}]
[null,"LUBUSKIE","Roznice w efektywnosci rynku pracy",{"$f":"D49","v":{"v":3.3600130420835344E-3,"d":"0.3%"}},{"$f":"E49","v":{"v":-0.020573841367455128,"d":"-2.1%"}},{"$f":"F49","v":{"v":8.637260740400833E-4,"d":"0.1%"}},{"$f":"G49","v":{"v":-0.036720933858773126,"d":"-3.7%"}},{"$f":"H49","v":{"v":-0.020495744101703017,"d":"-2.0%"}}]
[null,null,"Profil wyksztalcenia",{"$f":"D67","v":{"v":-0.019914169013158917,"d":"-2.0%"}},{"$f":"E67","v":{"v":-0.009413104140276109,"d":"-0.9%"}},{"$f":"F67","v":{"v":4.364844958836391E-3,"d":"0.4%"}},{"$f":"G67","v":{"v":0.05023290539419933,"d":"5.0%"}},{"$f":"H67","v":{"v":-0.029244249912980868,"d":"-2.9%"}}]
[null,"WIELKOPOLSKIE","Roznice w efektywnosci rynku pracy",{"$f":"D50","v":{"v":0.000206076810425124,"d":"0.0%"}},{"$f":"E50","v":{"v":0.003719019532231693,"d":"0.4%"}},{"$f":"F50","v":{"v":0.002215308848173937,"d":"0.2%"}},{"$f":"G50","v":{"v":0.015792400652081536,"d":"1.6%"}},{"$f":"H50","v":{"v":0.005470247093514209,"d":"0.5%"}}]
[null,null,"Profil wyksztalcenia",{"$f":"D68","v":{"v":-0.024895288095334245,"d":"-2.5%"}},{"$f":"E68","v":{"v":-0.009954899246680207,"d":"-1.0%"}},{"$f":"F68","v":{"v":-0.009233039562021561,"d":"-0.9%"}},{"$f":"G68","v":{"v":0.05216794337554209,"d":"5.2%"}},{"$f":"H68","v":{"v":-0.013473943475980734,"d":"-1.3%"}}]
[null,"ZACHODNIOPOMORSKIE","Roznice w efektywnosci rynku pracy",{"$f":"D51","v":{"v":-1.4533489797923848E-5,"d":"-0.0%"}},{"$f":"E51","v":{"v":-0.011419386750028859,"d":"-1.1%"}},{"$f":"F51","v":{"v":-0.002660874360717906,"d":"-0.3%"}},{"$f":"G51","v":{"v":-0.025555938053541186,"d":"-2.6%"}},{"$f":"H51","v":{"v":-0.035091209708210586,"d":"-3.5%"}}]
[null,null,"Profil wyksztalcenia",{"$f":"D69","v":{"v":-0.013634466605078702,"d":"-1.4%"}},{"$f":"E69","v":{"v":3.9186112319085516E-4,"d":"0.0%"}},{"$f":"F69","v":{"v":0.00905219780485207,"d":"0.9%"}},{"$f":"G69","v":{"v":0.007287160449220817,"d":"0.7%"}},{"$f":"H69","v":{"v":-5.364016535866622E-3,"d":"-0.5%"}}]
[null,"DOLNOŚLĄSKIE","Roznice w efektywnosci rynku pracy",{"$f":"D52","v":{"v":3.8248565547716686E-4,"d":"0.0%"}},{"$f":"E52","v":{"v":-0.011955798012188625,"d":"-1.2%"}},{"$f":"F52","v":{"v":-0.005262609253374365,"d":"-0.5%"}},{"$f":"G52","v":{"v":-0.02960553058222849,"d":"-3.0%"}},{"$f":"H52","v":{"v":-0.030693493459564885,"d":"-3.1%"}}]
[null,null,"Profil wyksztalcenia",{"$f":"D70","v":{"v":-3.1587503392077852E-3,"d":"-0.3%"}},{"$f":"E70","v":{"v":0.01861253551035126,"d":"1.9%"}},{"$f":"F70","v":{"v":-0.006482914734015211,"d":"-0.6%"}},{"$f":"G70","v":{"v":0.009373768973876127,"d":"0.9%"}},{"$f":"H70","v":{"v":-0.017068693023259075,"d":"-1.7%"}}]
[null,"OPOLSKIE","Roznice w efektywnosci rynku pracy",{"$f":"D53","v":{"v":-0.002909112914397696,"d":"-0.3%"}},{"$f":"E53","v":{"v":0.004385362665693911,"d":"0.4%"}},{"$f":"F53","v":{"v":-1.3649703858600753E-3,"d":"-0.1%"}},{"$f":"G53","v":{"v":0.005705127863760257,"d":"0.6%"}},{"$f":"H53","v":{"v":-0.001162504706689626,"d":"-0.1%"}}]
[null,null,"Profil wyksztalcenia",{"$f":"D71","v":{"v":-0.012504196438976024,"d":"-1.3%"}},{"$f":"E71","v":{"v":-0.022727177006566162,"d":"-2.3%"}},{"$f":"F71","v":{"v":-0.012309316103288287,"d":"-1.2%"}},{"$f":"G71","v":{"v":0.054454120002903554,"d":"5.4%"}},{"$f":"H71","v":{"v":-0.011239035910556422,"d":"-1.1%"}}]
[null,"KUJAWSKO-POMORSKIE","Roznice w efektywnosci rynku pracy",{"$f":"D54","v":{"v":3.2101611224663305E-3,"d":"0.3%"}},{"$f":"E54","v":{"v":5.9823665200677105E-3,"d":"0.6%"}},{"$f":"F54","v":{"v":-8.2520508956856751E-5,"d":"-0.0%"}},{"$f":"G54","v":{"v":-0.009179903108834212,"d":"-0.9%"}},{"$f":"H54","v":{"v":-0.011592715553974441,"d":"-1.2%"}}]
[null,null,"Profil wyksztalcenia",{"$f":"D72","v":{"v":-0.026235842484763766,"d":"-2.6%"}},{"$f":"E72","v":{"v":-6.0179625683454635E-3,"d":"-0.6%"}},{"$f":"F72","v":{"v":-0.014362859260608003,"d":"-1.4%"}},{"$f":"G72","v":{"v":0.044687356777521135,"d":"4.5%"}},{"$f":"H72","v":{"v":-0.003588819258457379,"d":"-0.4%"}}]
[null,"POMORSKIE","Roznice w efektywnosci rynku pracy",{"$f":"D55","v":{"v":0.003602075718140263,"d":"0.4%"}},{"$f":"E55","v":{"v":0.005326299950021168,"d":"0.5%"}},{"$f":"F55","v":{"v":1.3325787045179156E-3,"d":"0.1%"}},{"$f":"G55","v":{"v":-0.006558283669502025,"d":"-0.7%"}},{"$f":"H55","v":{"v":-0.022696781798886484,"d":"-2.3%"}}]
[null,null,"Profil wyksztalcenia",{"$f":"D73","v":{"v":0.007053999663159796,"d":"0.7%"}},{"$f":"E73","v":{"v":-0.026166901137288163,"d":"-2.6%"}},{"$f":"F73","v":{"v":0.00628124910236331,"d":"0.6%"}},{"$f":"G73","v":{"v":0.016987153523420964,"d":"1.7%"}},{"$f":"H73","v":{"v":-0.005026777388113341,"d":"-0.5%"}}]
[null,"WARMIŃSKO-MAZURSKIE","Roznice w efektywnosci rynku pracy",{"$f":"D56","v":{"v":0.004853862780893907,"d":"0.5%"}},{"$f":"E56","v":{"v":-0.010771621156168669,"d":"-1.1%"}},{"$f":"F56","v":{"v":-0.009150569088429386,"d":"-0.9%"}},{"$f":"G56","v":{"v":-0.029697131073705783,"d":"-3.0%"}},{"$f":"H56","v":{"v":-0.02788603637934085,"d":"-2.8%"}}]
[null,null,"Profil wyksztalcenia",{"$f":"D74","v":{"v":-0.01982548708611061,"d":"-2.0%"}},{"$f":"E74","v":{"v":0.014661287572533179,"d":"1.5%"}},{"$f":"F74","v":{"v":-0.01565418061427593,"d":"-1.6%"}},{"$f":"G74","v":{"v":-0.021718171835740402,"d":"-2.2%"}},{"$f":"H74","v":{"v":0.03932567313928161,"d":"3.9%"}}]
[]
[]
[]
[null,null,"Różnice w efektywności rynku pracy","wyższe","policealne oraz średnie zawodowe","średnie ogólnokształcące","zasadnicze zawodowe","gimnazjalne, podstawowe i niższe","SUMA (**)"]
[null,null,"ŁÓDZKIE",{"$f":"D78*(E97-E$113)/$D$113","v":{"v":-0.007049141156277306,"d":"-0.70%"}},{"v":-1.9438940781098203E-4,"d":"-0.02%"},{"v":-1.4122813063139348E-3,"d":"-0.14%"},{"v":3.705141603257731E-3,"d":"0.37%"},{"v":-6.8803322601920227E-4,"d":"-0.07%"},{"$f":"SUM(D41:H41)","v":{"v":-5.638703493163694E-3,"d":"-0.56%"}}]
[null,null,"MAZOWIECKIE",{"v":2.1046007892738614E-3,"d":"0.21%"},{"v":0.008318752191812745,"d":"0.83%"},{"v":0.004925126750180047,"d":"0.49%"},{"v":0.00417684038426953,"d":"0.42%"},{"v":0.007288825285234726,"d":"0.73%"},{"v":0.02681414540077091,"d":"2.68%"}]
[null,null,"MAŁOPOLSKIE",{"v":0.000868600856037137,"d":"0.09%"},{"v":0.006940015618112544,"d":"0.69%"},{"v":-8.7854288620197937E-4,"d":"-0.09%"},{"v":0.022061910990148474,"d":"2.21%"},{"v":0.017837973844989054,"d":"1.78%"},{"v":0.046829958423085224,"d":"4.68%"}]
[null,null,"ŚLĄSKIE",{"v":0.003479668933111741,"d":"0.35%"},{"v":0.004158632065913583,"d":"0.42%"},{"v":0.00238390194927669,"d":"0.24%"},{"v":-1.6194234692076892E-3,"d":"-0.16%"},{"v":-0.011526891490208626,"d":"-1.15%"},{"v":-3.1241120111143005E-3,"d":"-0.31%"}]
[null,null,"LUBELSKIE",{"v":-3.43302973650672E-3,"d":"-0.34%"},{"v":-4.4312290969306094E-3,"d":"-0.44%"},{"v":-7.1133123975352188E-4,"d":"-0.07%"},{"v":0.01736626503169537,"d":"1.74%"},{"v":0.03412758553089722,"d":"3.41%"},{"v":0.04291826048940174,"d":"4.29%"}]
[null,null,"PODKARPACKIE",{"v":-2.7901818554145886E-3,"d":"-0.28%"},{"v":-0.007932858840706056,"d":"-0.79%"},{"v":1.037407070076748E-3,"d":"0.10%"},{"v":9.932286508326128E-3,"d":"0.99%"},{"v":0.025729092034330023,"d":"2.57%"},{"v":0.025975744916612253,"d":"2.60%"}]
[null,null,"PODLASKIE",{"v":1.4052372331425705E-3,"d":"0.14%"},{"v":-0.004366440940435739,"d":"-0.44%"},{"v":-0.0026212486854387,"d":"-0.26%"},{"v":0.012296227570558673,"d":"1.23%"},{"v":0.030598872911025705,"d":"3.06%"},{"v":0.03731264808885251,"d":"3.73%"}]
[null,null,"ŚWIĘTOKRZYSKIE",{"v":-0.007890991741619478,"d":"-0.79%"},{"v":-9.9284871309981157E-4,"d":"-0.10%"},{"v":-0.004418610602319837,"d":"-0.44%"},{"v":-1.0626308530658922E-3,"d":"-0.11%"},{"v":0.026563898785145545,"d":"2.66%"},{"v":0.012198816875040526,"d":"1.22%"}]
[null,null,"LUBUSKIE",{"v":3.3600130420835344E-3,"d":"0.34%"},{"v":-0.020573841367455128,"d":"-2.06%"},{"v":8.637260740400833E-4,"d":"0.09%"},{"v":-0.036720933858773126,"d":"-3.67%"},{"v":-0.020495744101703017,"d":"-2.05%"},{"v":-0.07356678021180765,"d":"-7.36%"}]
[null,null,"WIELKOPOLSKIE",{"v":0.000206076810425124,"d":"0.02%"},{"v":0.003719019532231693,"d":"0.37%"},{"v":0.002215308848173937,"d":"0.22%"},{"v":0.015792400652081536,"d":"1.58%"},{"v":0.005470247093514209,"d":"0.55%"},{"v":0.027403052936426496,"d":"2.74%"}]
[null,null,"ZACHODNIOPOMORSKIE",{"$f":"D88*(E107-E$113)/$D$113","v":{"v":-1.4533489797923848E-5,"d":"-0.00%"}},{"v":-0.011419386750028859,"d":"-1.14%"},{"v":-0.002660874360717906,"d":"-0.27%"},{"v":-0.025555938053541186,"d":"-2.56%"},{"v":-0.035091209708210586,"d":"-3.51%"},{"v":-0.07474194236229646,"d":"-7.47%"}]
[null,null,"DOLNOŚLĄSKIE",{"v":3.8248565547716686E-4,"d":"0.04%"},{"v":-0.011955798012188625,"d":"-1.20%"},{"v":-0.005262609253374365,"d":"-0.53%"},{"v":-0.02960553058222849,"d":"-2.96%"},{"v":-0.030693493459564885,"d":"-3.07%"},{"v":-0.0771349456518792,"d":"-7.71%"}]
[null,null,"OPOLSKIE",{"v":-0.002909112914397696,"d":"-0.29%"},{"v":0.004385362665693911,"d":"0.44%"},{"v":-1.3649703858600753E-3,"d":"-0.14%"},{"v":0.005705127863760257,"d":"0.57%"},{"v":-0.001162504706689626,"d":"-0.12%"},{"v":0.00465390252250677,"d":"0.47%"}]
[null,null,"KUJAWSKO-POMORSKIE",{"v":3.2101611224663305E-3,"d":"0.32%"},{"v":5.9823665200677105E-3,"d":"0.60%"},{"v":-8.2520508956856751E-5,"d":"-0.01%"},{"v":-0.009179903108834212,"d":"-0.92%"},{"v":-0.011592715553974441,"d":"-1.16%"},{"v":-0.01166261152923147,"d":"-1.17%"}]
[null,null,"POMORSKIE",{"v":0.003602075718140263,"d":"0.36%"},{"v":0.005326299950021168,"d":"0.53%"},{"v":1.3325787045179156E-3,"d":"0.13%"},{"v":-0.006558283669502025,"d":"-0.66%"},{"v":-0.022696781798886484,"d":"-2.27%"},{"v":-0.018994111095709164,"d":"-1.90%"}]
[null,null,"WARMIŃSKO-MAZURSKIE",{"v":0.004853862780893907,"d":"0.49%"},{"v":-0.010771621156168669,"d":"-1.08%"},{"v":-0.009150569088429386,"d":"-0.92%"},{"v":-0.029697131073705783,"d":"-2.97%"},{"v":-0.02788603637934085,"d":"-2.79%"},{"v":-0.07265149491675078,"d":"-7.27%"}]
[]
[null,null,"Profil wyksztalcenia","wyższe","policealne oraz średnie zawodowe","średnie ogólnokształcące","zasadnicze zawodowe","gimnazjalne, podstawowe i niższe","SUMA (**)",null,"(Pzi/AZi-PZ/AZ)/(PZ/AZ)","Weryfikacja",null,"(Pzi/AZi-PZ/AZ)/(PZ/AZ)","Weryfikacja"]
[null,null,"ŁÓDZKIE",{"$f":"E$113*(D78-D$94)/$D$113","v":{"v":0.006573284271426006,"d":"0.66%"}},{"v":-5.2871950966236515E-3,"d":"-0.53%"},{"v":0.011051205832297753,"d":"1.11%"},{"v":-0.04319002612408757,"d":"-4.32%"},{"v":0.03122870253560989,"d":"3.12%"},{"$f":"SUM(D59:H59)","v":{"v":3.7597141862242417E-4,"d":"0.04%"}},null,{"$f":"(D97-D$113)/D$113","v":{"v":-0.005262732074541203,"d":"-0.53%"}},{"$f":"I41+I59","v":{"v":-0.00526273207454127,"d":"-0.53%"}},null,{"$f":"('2002prac'!#REF!-'2002prac'!#REF!)/'2002prac'!#REF!","v":{"$error":"#REF!"}},{"$f":"#REF!+I59","v":{"$error":"#REF!"}}]
[null,null,"MAZOWIECKIE",{"v":0.042341110498668705,"d":"4.23%"},{"v":0.011359847331982644,"d":"1.14%"},{"v":0.018479454400569566,"d":"1.85%"},{"v":-0.06404530346404404,"d":"-6.40%"},{"v":9.3338296231453943E-4,"d":"0.09%"},{"v":0.009068491729491418,"d":"0.91%"},null,{"v":0.03588263713026231,"d":"3.59%"},{"v":0.03588263713026233,"d":"3.59%"},null,{"$f":"('2002prac'!#REF!-'2002prac'!#REF!)/'2002prac'!#REF!","v":{"$error":"#REF!"}},{"$f":"#REF!+I60","v":{"$error":"#REF!"}}]
[null,null,"MAŁOPOLSKIE",{"v":0.011762835319382912,"d":"1.18%"},{"v":-0.01823131920872151,"d":"-1.82%"},{"v":-0.005352984725656276,"d":"-0.54%"},{"v":0.021843928445450817,"d":"2.18%"},{"v":-0.009402577155964114,"d":"-0.94%"},{"v":6.1988267449182739E-4,"d":"0.06%"},null,{"v":0.04744984109757705,"d":"4.74%"},{"v":0.04744984109757705,"d":"4.74%"},null,{"$f":"('2002prac'!#REF!-'2002prac'!#REF!)/'2002prac'!#REF!","v":{"$error":"#REF!"}},{"$f":"#REF!+I61","v":{"$error":"#REF!"}}]
[null,null,"ŚLĄSKIE",{"v":-9.752741921885924E-3,"d":"-0.98%"},{"v":0.020808712872686003,"d":"2.08%"},{"v":0.009638924525983824,"d":"0.96%"},{"v":0.035872960606686606,"d":"3.59%"},{"v":-0.05545570076152017,"d":"-5.55%"},{"v":1.112155321950338E-3,"d":"0.11%"},null,{"v":-2.0119566891639387E-3,"d":"-0.20%"},{"v":-2.0119566891639625E-3,"d":"-0.20%"},null,{"$f":"('2002prac'!#REF!-'2002prac'!#REF!)/'2002prac'!#REF!","v":{"$error":"#REF!"}},{"$f":"#REF!+I62","v":{"$error":"#REF!"}}]
[null,null,"LUBELSKIE",{"v":0.009122927100287455,"d":"0.91%"},{"v":-0.015717627873218124,"d":"-1.57%"},{"v":-3.6278835007744906E-3,"d":"-0.36%"},{"v":-0.042293210719376834,"d":"-4.23%"},{"v":0.051884993174097005,"d":"5.19%"},{"v":-6.3080181898499121E-4,"d":"-0.06%"},null,{"v":0.04228745867041679,"d":"4.23%"},{"v":0.04228745867041675,"d":"4.23%"},null,{"$f":"('2002prac'!#REF!-'2002prac'!#REF!)/'2002prac'!#REF!","v":{"$error":"#REF!"}},{"$f":"#REF!+I63","v":{"$error":"#REF!"}}]
[null,null,"PODKARPACKIE",{"v":-0.024909128548832444,"d":"-2.49%"},{"v":0.01032862275026317,"d":"1.03%"},{"v":-0.013890936718323333,"d":"-1.39%"},{"v":-0.005698585854923115,"d":"-0.57%"},{"v":0.029814724204697985,"d":"2.98%"},{"v":-0.004355304167117737,"d":"-0.44%"},null,{"v":0.021620440749494624,"d":"2.16%"},{"v":0.021620440749494516,"d":"2.16%"},null,{"$f":"('2002prac'!#REF!-'2002prac'!#REF!)/'2002prac'!#REF!","v":{"$error":"#REF!"}},{"$f":"#REF!+I64","v":{"$error":"#REF!"}}]
[null,null,"PODLASKIE",{"v":0.003461013431976201,"d":"0.35%"},{"v":-0.006273040508797527,"d":"-0.63%"},{"v":-0.007716443527162826,"d":"-0.77%"},{"v":-0.05837175818752018,"d":"-5.84%"},{"v":0.06775176694665236,"d":"6.78%"},{"v":-1.1484618448519834E-3,"d":"-0.11%"},null,{"v":0.03616418624400049,"d":"3.62%"},{"v":0.03616418624400053,"d":"3.62%"},null,{"$f":"('2002prac'!#REF!-'2002prac'!#REF!)/'2002prac'!#REF!","v":{"$error":"#REF!"}},{"$f":"#REF!+I65","v":{"$error":"#REF!"}}]
[null,null,"ŚWIĘTOKRZYSKIE",{"v":1.5726343196161574E-3,"d":"0.16%"},{"v":0.007544524138517051,"d":"0.75%"},{"v":-0.01475630281492135,"d":"-1.48%"},{"v":-1.7588444146241207E-3,"d":"-0.18%"},{"v":0.00802757089687054,"d":"0.80%"},{"v":6.2958212545827751E-4,"d":"0.06%"},null,{"v":0.01282839900049887,"d":"1.28%"},{"v":0.012828399000498803,"d":"1.28%"},null,{"$f":"('2002prac'!#REF!-'2002prac'!#REF!)/'2002prac'!#REF!","v":{"$error":"#REF!"}},{"$f":"#REF!+I66","v":{"$error":"#REF!"}}]
[null,null,"LUBUSKIE",{"v":-0.019914169013158917,"d":"-1.99%"},{"v":-0.009413104140276109,"d":"-0.94%"},{"v":4.364844958836391E-3,"d":"0.44%"},{"v":0.05023290539419933,"d":"5.02%"},{"v":-0.029244249912980868,"d":"-2.92%"},{"v":-0.003973772713380175,"d":"-0.40%"},null,{"v":-0.07754055292518769,"d":"-7.75%"},{"v":-0.07754055292518783,"d":"-7.75%"},null,{"$f":"('2002prac'!#REF!-'2002prac'!#REF!)/'2002prac'!#REF!","v":{"$error":"#REF!"}},{"$f":"#REF!+I67","v":{"$error":"#REF!"}}]
[null,null,"WIELKOPOLSKIE",{"v":-0.024895288095334245,"d":"-2.49%"},{"v":-0.009954899246680207,"d":"-1.00%"},{"v":-0.009233039562021561,"d":"-0.92%"},{"v":0.05216794337554209,"d":"5.22%"},{"v":-0.013473943475980734,"d":"-1.35%"},{"v":-5.3892270044746515E-3,"d":"-0.54%"},null,{"v":0.022013825931951884,"d":"2.20%"},{"v":0.022013825931951843,"d":"2.20%"},null,{"$f":"('2002prac'!#REF!-'2002prac'!#REF!)/'2002prac'!#REF!","v":{"$error":"#REF!"}},{"$f":"#REF!+I68","v":{"$error":"#REF!"}}]
[null,null,"ZACHODNIOPOMORSKIE",{"$f":"E$113*(D88-D$94)/$D$113","v":{"v":-0.013634466605078702,"d":"-1.36%"}},{"v":3.9186112319085516E-4,"d":"0.04%"},{"v":0.00905219780485207,"d":"0.91%"},{"v":0.007287160449220817,"d":"0.73%"},{"v":-5.364016535866622E-3,"d":"-0.54%"},{"v":-2.2672637636815818E-3,"d":"-0.23%"},null,{"v":-0.07700920612597797,"d":"-7.70%"},{"v":-0.07700920612597804,"d":"-7.70%"},null,{"$f":"('2002prac'!#REF!-'2002prac'!#REF!)/'2002prac'!#REF!","v":{"$error":"#REF!"}},{"$f":"#REF!+I69","v":{"$error":"#REF!"}}]
[null,null,"DOLNOŚLĄSKIE",{"v":-3.1587503392077852E-3,"d":"-0.32%"},{"v":0.01861253551035126,"d":"1.86%"},{"v":-0.006482914734015211,"d":"-0.65%"},{"v":0.009373768973876127,"d":"0.94%"},{"v":-0.017068693023259075,"d":"-1.71%"},{"v":1.2759463877453185E-3,"d":"0.13%"},null,{"v":-0.0758589992641339,"d":"-7.59%"},{"v":-0.07585899926413388,"d":"-7.59%"},null,{"$f":"('2002prac'!#REF!-'2002prac'!#REF!)/'2002prac'!#REF!","v":{"$error":"#REF!"}},{"$f":"#REF!+I70","v":{"$error":"#REF!"}}]
[null,null,"OPOLSKIE",{"v":-0.012504196438976024,"d":"-1.25%"},{"v":-0.022727177006566162,"d":"-2.27%"},{"v":-0.012309316103288287,"d":"-1.23%"},{"v":0.054454120002903554,"d":"5.45%"},{"v":-0.011239035910556422,"d":"-1.12%"},{"v":-0.004325605456483339,"d":"-0.43%"},null,{"v":3.28297066023417E-4,"d":"0.03%"},{"v":3.2829706602343148E-4,"d":"0.03%"},null,{"$f":"('2002prac'!#REF!-'2002prac'!#REF!)/'2002prac'!#REF!","v":{"$error":"#REF!"}},{"$f":"#REF!+I71","v":{"$error":"#REF!"}}]
[null,null,"KUJAWSKO-POMORSKIE",{"v":-0.026235842484763766,"d":"-2.62%"},{"v":-6.0179625683454635E-3,"d":"-0.60%"},{"v":-0.014362859260608003,"d":"-1.44%"},{"v":0.044687356777521135,"d":"4.47%"},{"v":-0.003588819258457379,"d":"-0.36%"},{"v":-0.005518126794653478,"d":"-0.55%"},null,{"v":-0.017180738323884937,"d":"-1.72%"},{"v":-0.017180738323884948,"d":"-1.72%"},null,{"$f":"('2002prac'!#REF!-'2002prac'!#REF!)/'2002prac'!#REF!","v":{"$error":"#REF!"}},{"$f":"#REF!+I72","v":{"$error":"#REF!"}}]
[null,null,"POMORSKIE",{"v":0.007053999663159796,"d":"0.71%"},{"v":-0.026166901137288163,"d":"-2.62%"},{"v":0.00628124910236331,"d":"0.63%"},{"v":0.016987153523420964,"d":"1.70%"},{"v":-0.005026777388113341,"d":"-0.50%"},{"v":-8.7127623645743332E-4,"d":"-0.09%"},null,{"v":-0.019865387332166598,"d":"-1.99%"},{"v":-0.019865387332166598,"d":"-1.99%"},null,{"$f":"('2002prac'!#REF!-'2002prac'!#REF!)/'2002prac'!#REF!","v":{"$error":"#REF!"}},{"$f":"#REF!+I73","v":{"$error":"#REF!"}}]
[null,null,"WARMIŃSKO-MAZURSKIE",{"v":-0.01982548708611061,"d":"-1.98%"},{"v":0.014661287572533179,"d":"1.47%"},{"v":-0.01565418061427593,"d":"-1.57%"},{"v":-0.021718171835740402,"d":"-2.17%"},{"v":0.03932567313928161,"d":"3.93%"},{"v":-3.2108788243121536E-3,"d":"-0.32%"},null,{"v":-0.07586237374106293,"d":"-7.59%"},{"v":-0.07586237374106294,"d":"-7.59%"},null,{"$f":"('2002prac'!#REF!-'2002prac'!#REF!)/'2002prac'!#REF!","v":{"$error":"#REF!"}},{"$f":"#REF!+I74","v":{"$error":"#REF!"}}]
[]
[]
[null,null,"Azij/AZi","wyższe","policealne oraz średnie zawodowe","średnie ogólnokształcące","zasadnicze zawodowe","gimnazjalne, podstawowe i niższe"]
[null,null,"ŁÓDZKIE",{"$f":"E116/$D116","v":0.14528023598820058},0.2861356932153392,0.08997050147492626,0.2994100294985251,0.17920353982300885]
[null,null,"MAZOWIECKIE",0.17616802400342907,0.30218602657522503,0.0977282468924132,0.2773253321903129,0.1465923703386198]
[null,null,"MAŁOPOLSKIE",0.14976174268209666,0.27365554799183117,0.07283866575901975,0.3682777399591559,0.13546630360789652]
[null,null,"ŚLĄSKIE",0.13118167621030713,0.3112961998958876,0.08849557522123894,0.3831337844872462,0.08589276418532014]
[null,null,"LUBELSKIE",0.1474820143884892,0.2760791366906475,0.07464028776978417,0.30035971223021585,0.2014388489208633]
[null,null,"PODKARPACKIE",0.1180931744312026,0.30119176598049835,0.06392199349945829,0.3391115926327194,0.17768147345612134]
[null,null,"PODLASKIE",0.1425925925925926,0.2851851851851852,0.07037037037037037,0.2833333333333333,0.21851851851851853]
[null,null,"ŚWIĘTOKRZYSKIE",0.14096185737976782,0.29850746268656714,0.06301824212271974,0.34328358208955223,0.15422885572139303]
[null,null,"LUBUSKIE",0.12240663900414937,0.2821576763485477,0.08298755186721991,0.3983402489626556,0.11410788381742738]
[null,null,"WIELKOPOLSKIE",0.11810512654120701,0.28163530175210905,0.06878650227125244,0.40038935756002597,0.13108371187540557]
[null,null,"ZACHODNIOPOMORSKIE",{"$f":"E126/$D126","v":0.1278295605858855},0.29161118508655126,0.08788282290279627,0.35286284953395475,0.13981358189081225]
[null,null,"DOLNOŚLĄSKIE",0.13687600644122383,0.30917874396135264,0.071658615136876,0.35507246376811596,0.12721417069243157]
[null,null,"OPOLSKIE",0.1288056206088993,0.2693208430913349,0.06557377049180328,0.4028103044496487,0.13348946135831383]
[null,null,"KUJAWSKO-POMORSKIE",0.11694747274529237,0.28543111992071357,0.06342913776015857,0.3924677898909812,0.14172447968285432]
[null,null,"POMORSKIE",0.1456953642384106,0.26600441501103755,0.08498896247240618,0.3631346578366446,0.1401766004415011]
[null,null,"WARMIŃSKO-MAZURSKIE",0.12248322147651007,0.3053691275167785,0.06208053691275168,0.3221476510067114,0.18791946308724833]
[null,null,"POLSKA",0.13960378783477603,0.29123337012722944,0.07842909428920003,0.3451461104978795,0.145587637250915]
[]
[null,null,"Pzij/AZij","Ogółem","wyższe","policealne oraz średnie zawodowe","średnie ogólnokształcące","zasadnicze zawodowe","gimnazjalne, podstawowe i niższe"]
[null,null,"ŁÓDZKIE",{"$f":"D135/D116","v":0.7964601769911505},0.8883248730964467,0.8298969072164949,0.7540983606557377,0.7660098522167488,0.7407407407407407]
[null,null,"MAZOWIECKIE",0.8294042006000857,0.9367396593673966,0.8524822695035461,0.8070175438596491,0.768160741885626,0.783625730994152]
[null,null,"MAŁOPOLSKIE",0.8386657590197413,0.9318181818181818,0.8507462686567164,0.7570093457943925,0.8040665434380776,0.8492462311557789]
[null,null,"ŚLĄSKIE",0.7990629880270692,0.9484126984126984,0.8411371237458194,0.788235294117647,0.7527173913043478,0.6363636363636364]
[null,null,"LUBELSKIE",0.8345323741007195,0.9085365853658537,0.8175895765472313,0.7590361445783133,0.8023952095808383,0.8794642857142857]
[null,null,"PODKARPACKIE",0.8179848320693391,0.908256880733945,0.8093525179856115,0.7796610169491526,0.7795527156549521,0.8597560975609756]
[null,null,"PODLASKIE",0.8296296296296296,0.935064935064935,0.8181818181818182,0.7368421052631579,0.7908496732026143,0.8559322033898306]
[null,null,"ŚWIĘTOKRZYSKIE",0.8109452736318408,0.8823529411764706,0.8277777777777777,0.7105263157894737,0.7536231884057971,0.8817204301075269]
[null,null,"LUBUSKIE",0.7385892116182573,0.9491525423728814,0.7720588235294118,0.775,0.6822916666666666,0.6]
[null,null,"WIELKOPOLSKIE",0.81829980532122,0.9285714285714286,0.8410138248847926,0.7924528301886793,0.7876823338735819,0.7772277227722773]
[null,null,"ZACHODNIOPOMORSKIE",{"$f":"D145/D126","v":0.7390146471371505},0.9270833333333334,0.7990867579908676,0.7424242424242424,0.6981132075471698,0.5428571428571428]
[null,null,"DOLNOŚLĄSKIE",0.7399355877616747,0.9294117647058824,0.7994791666666666,0.7078651685393258,0.6893424036281179,0.5506329113924051]
[null,null,"OPOLSKIE",0.8009367681498829,0.9090909090909091,0.8434782608695652,0.75,0.7674418604651163,0.7368421052631579]
[null,null,"KUJAWSKO-POMORSKIE",0.7869177403369673,0.9491525423728814,0.8472222222222222,0.765625,0.7373737373737373,0.6783216783216783]
[null,null,"POMORSKIE",0.7847682119205298,0.946969696969697,0.8464730290456431,0.7792207792207793,0.7416413373860182,0.6141732283464567]
[null,null,"WARMIŃSKO-MAZURSKIE",0.7399328859060402,0.958904109589041,0.8021978021978022,0.6486486486486487,0.6822916666666666,0.625]
[null,null,"POLSKA",0.8006739092546331,0.9271743653766126,0.8304408537801715,0.7666666666666667,0.7561016663861303,0.7438148443735035]
[]
[null,null,"AZij","Ogółem","wyższe","policealne oraz średnie zawodowe","średnie ogólnokształcące","zasadnicze zawodowe","gimnazjalne, podstawowe i niższe"]
[null,null,"ŁÓDZKIE",1356,197,388,122,406,243]
[null,null,"MAZOWIECKIE",2333,411,705,228,647,342]
[null,null,"MAŁOPOLSKIE",1469,220,402,107,541,199]
[null,null,"ŚLĄSKIE",1921,252,598,170,736,165]
[null,null,"LUBELSKIE",1112,164,307,83,334,224]
[null,null,"PODKARPACKIE",923,109,278,59,313,164]
[null,null,"PODLASKIE",540,77,154,38,153,118]
[null,null,"ŚWIĘTOKRZYSKIE",603,85,180,38,207,93]
[null,null,"LUBUSKIE",482,59,136,40,192,55]
[null,null,"WIELKOPOLSKIE",1541,182,434,106,617,202]
[null,null,"ZACHODNIOPOMORSKIE",751,96,219,66,265,105]
[null,null,"DOLNOŚLĄSKIE",1242,170,384,89,441,158]
[null,null,"OPOLSKIE",427,55,115,28,172,57]
[null,null,"KUJAWSKO-POMORSKIE",1009,118,288,64,396,143]
[null,null,"POMORSKIE",906,132,241,77,329,127]
[null,null,"WARMIŃSKO-MAZURSKIE",596,73,182,37,192,112]
[null,null,"POLSKA",17213,2403,5013,1350,5941,2506]
[]
[null,null,"Pzij","Ogółem","wyższe","policealne oraz średnie zawodowe","średnie ogólnokształcące","zasadnicze zawodowe","gimnazjalne, podstawowe i niższe"]
[null,null,"ŁÓDZKIE",1080,175,322,92,311,180]
[null,null,"MAZOWIECKIE",1935,385,601,184,497,268]
[null,null,"MAŁOPOLSKIE",1232,205,342,81,435,169]
[null,null,"ŚLĄSKIE",1535,239,503,134,554,105]
[null,null,"LUBELSKIE",928,149,251,63,268,197]
[null,null,"PODKARPACKIE",755,99,225,46,244,141]
[null,null,"PODLASKIE",448,72,126,28,121,101]
[null,null,"ŚWIĘTOKRZYSKIE",489,75,149,27,156,82]
[null,null,"LUBUSKIE",356,56,105,31,131,33]
[null,null,"WIELKOPOLSKIE",1261,169,365,84,486,157]
[null,null,"ZACHODNIOPOMORSKIE",555,89,175,49,185,57]
[null,null,"DOLNOŚLĄSKIE",919,158,307,63,304,87]
[null,null,"OPOLSKIE",342,50,97,21,132,42]
[null,null,"KUJAWSKO-POMORSKIE",794,112,244,49,292,97]
[null,null,"POMORSKIE",711,125,204,60,244,78]
[null,null,"WARMIŃSKO-MAZURSKIE",441,70,146,24,131,70]
[null,null,"POLSKA",13782,2228,4163,1035,4492,1864]

{"sheet":"2012akt","index":8,"n_rows":153,"n_cols":8,"rows_kept":153,"hidden":true,"merged":[[0,1,0,7],[1,1,1,7]]}
[null,"Poddekompozycja różnic we współczynniku AKTYWNOŚCI ZAWODOWEJ"]
[null,2012]
[]
[null,null,"Sekcje","15-29","30-39","40-49","50 i więcej"]
[null,"ŁÓDZKIE","Poziom uczestnictwa w rynku pracy",{"$f":"D41","v":{"v":2.5777694699195388E-3,"d":"0.3%"}},{"$f":"E41","v":{"v":0.008083648088748245,"d":"0.8%"}},{"$f":"F41","v":{"v":0.007365247087665728,"d":"0.7%"}},{"$f":"G41","v":{"v":2.4609824855167726E-3,"d":"0.2%"}}]
[null,null,"Profil struktury wiekowej",{"$f":"D61","v":{"v":-0.013229619462403742,"d":"-1.3%"}},{"$f":"E61","v":{"v":-0.00868099968972059,"d":"-0.9%"}},{"$f":"F61","v":{"v":1.8892637572855693E-3,"d":"0.2%"}},{"$f":"G61","v":{"v":0.011154810421568415,"d":"1.1%"}}]
[null,"MAZOWIECKIE","Poziom uczestnictwa w rynku pracy",{"$f":"D42","v":{"v":0.010450946742015655,"d":"1.0%"}},{"$f":"E42","v":{"v":0.00888704545865752,"d":"0.9%"}},{"$f":"F42","v":{"v":0.0095732043981977,"d":"1.0%"}},{"$f":"G42","v":{"v":0.032481397647982,"d":"3.2%"}}]
[null,null,"Profil struktury wiekowej",{"$f":"D62","v":{"v":-0.004748414997350834,"d":"-0.5%"}},{"$f":"E62","v":{"v":0.03197826739525702,"d":"3.2%"}},{"$f":"F62","v":{"v":-1.2729596263469612E-3,"d":"-0.1%"}},{"$f":"G62","v":{"v":-0.00891558324662919,"d":"-0.9%"}}]
[null,"MAŁOPOLSKIE","Poziom uczestnictwa w rynku pracy",{"$f":"D43","v":{"v":-0.008522080541064063,"d":"-0.9%"}},{"$f":"E43","v":{"v":2.0634164482007103E-4,"d":"0.0%"}},{"$f":"F43","v":{"v":0.000780685406316351,"d":"0.1%"}},{"$f":"G43","v":{"v":-0.006217992111850631,"d":"-0.6%"}}]
[null,null,"Profil struktury wiekowej",{"$f":"D63","v":{"v":0.027619521043982756,"d":"2.8%"}},{"$f":"E63","v":{"v":-0.013075232353326196,"d":"-1.3%"}},{"$f":"F63","v":{"v":0.003024706530431412,"d":"0.3%"}},{"$f":"G63","v":{"v":-0.013869437561410649,"d":"-1.4%"}}]
[null,"ŚLĄSKIE","Poziom uczestnictwa w rynku pracy",{"$f":"D44","v":{"v":0.008790871200809822,"d":"0.9%"}},{"$f":"E44","v":{"v":-2.2932718841564143E-3,"d":"-0.2%"}},{"$f":"F44","v":{"v":-6.7800923586394295E-3,"d":"-0.7%"}},{"$f":"G44","v":{"v":-0.03647681504797037,"d":"-3.6%"}}]
[null,null,"Profil struktury wiekowej",{"$f":"D64","v":{"v":-0.015311430454669674,"d":"-1.5%"}},{"$f":"E64","v":{"v":-0.004440754661666445,"d":"-0.4%"}},{"$f":"F64","v":{"v":2.047307037882291E-3,"d":"0.2%"}},{"$f":"G64","v":{"v":0.010778186835861401,"d":"1.1%"}}]
[null,"LUBELSKIE","Poziom uczestnictwa w rynku pracy",{"$f":"D45","v":{"v":-0.013160479726271592,"d":"-1.3%"}},{"$f":"E45","v":{"v":0.007173196593485966,"d":"0.7%"}},{"$f":"F45","v":{"v":0.005987918010317735,"d":"0.6%"}},{"$f":"G45","v":{"v":0.012206441795320397,"d":"1.2%"}}]
[null,null,"Profil struktury wiekowej",{"$f":"D65","v":{"v":3.6142089275757626E-3,"d":"0.4%"}},{"$f":"E65","v":{"v":-0.002760337665527664,"d":"-0.3%"}},{"$f":"F65","v":{"v":6.039223602505771E-4,"d":"0.1%"}},{"$f":"G65","v":{"v":-1.4877505712280025E-3,"d":"-0.1%"}}]
[null,"PODKARPACKIE","Poziom uczestnictwa w rynku pracy",{"$f":"D46","v":{"v":-0.018220095025990812,"d":"-1.8%"}},{"$f":"E46","v":{"v":1.4916918221829982E-4,"d":"0.0%"}},{"$f":"F46","v":{"v":8.902267158627741E-5,"d":"0.0%"}},{"$f":"G46","v":{"v":0.017959380741989137,"d":"1.8%"}}]
[null,null,"Profil struktury wiekowej",{"$f":"D66","v":{"v":0.015898157644451637,"d":"1.6%"}},{"$f":"E66","v":{"v":-0.005949863455233017,"d":"-0.6%"}},{"$f":"F66","v":{"v":0.009116649781618623,"d":"0.9%"}},{"$f":"G66","v":{"v":-0.011510507715290753,"d":"-1.2%"}}]
[null,"PODLASKIE","Poziom uczestnictwa w rynku pracy",{"$f":"D47","v":{"v":-0.017361776009190196,"d":"-1.7%"}},{"$f":"E47","v":{"v":0.004229638167655388,"d":"0.4%"}},{"$f":"F47","v":{"v":7.675252377403359E-3,"d":"0.8%"}},{"$f":"G47","v":{"v":0.005765248902436989,"d":"0.6%"}}]
[null,null,"Profil struktury wiekowej",{"$f":"D67","v":{"v":-1.0583931480375698E-3,"d":"-0.1%"}},{"$f":"E67","v":{"v":-0.022434513995669963,"d":"-2.2%"}},{"$f":"F67","v":{"v":0.01713587318832978,"d":"1.7%"}},{"$f":"G67","v":{"v":2.6666704636621303E-3,"d":"0.3%"}}]
[null,"ŚWIĘTOKRZYSKIE","Poziom uczestnictwa w rynku pracy",{"$f":"D48","v":{"v":3.595455237715311E-3,"d":"0.4%"}},{"$f":"E48","v":{"v":4.424915955015876E-3,"d":"0.4%"}},{"$f":"F48","v":{"v":6.8193010540972335E-3,"d":"0.7%"}},{"$f":"G48","v":{"v":0.019853061079521495,"d":"2.0%"}}]
[null,null,"Profil struktury wiekowej",{"$f":"D68","v":{"v":-1.8241584837196223E-3,"d":"-0.2%"}},{"$f":"E68","v":{"v":-0.011131127851539184,"d":"-1.1%"}},{"$f":"F68","v":{"v":-0.00478230978700218,"d":"-0.5%"}},{"$f":"G68","v":{"v":7.4043124581288445E-3,"d":"0.7%"}}]
[null,"LUBUSKIE","Poziom uczestnictwa w rynku pracy",{"$f":"D49","v":{"v":-3.4043047612405193E-3,"d":"-0.3%"}},{"$f":"E49","v":{"v":-0.012080199338422479,"d":"-1.2%"}},{"$f":"F49","v":{"v":-0.008948674113162657,"d":"-0.9%"}},{"$f":"G49","v":{"v":-0.013347170809152705,"d":"-1.3%"}}]
[null,null,"Profil struktury wiekowej",{"$f":"D69","v":{"v":-0.008365403830913585,"d":"-0.8%"}},{"$f":"E69","v":{"v":0.005285963571826668,"d":"0.5%"}},{"$f":"F69","v":{"v":-0.001033260545888745,"d":"-0.1%"}},{"$f":"G69","v":{"v":0.003729878108940117,"d":"0.4%"}}]
[null,"WIELKOPOLSKIE","Poziom uczestnictwa w rynku pracy",{"$f":"D50","v":{"v":0.014256850884023974,"d":"1.4%"}},{"$f":"E50","v":{"v":-7.080772062855153E-5,"d":"-0.0%"}},{"$f":"F50","v":{"v":-5.0642387610984295E-3,"d":"-0.5%"}},{"$f":"G50","v":{"v":0.004278306860225987,"d":"0.4%"}}]
[null,null,"Profil struktury wiekowej",{"$f":"D70","v":{"v":0.017237710420047493,"d":"1.7%"}},{"$f":"E70","v":{"v":0.00849124078166375,"d":"0.8%"}},{"$f":"F70","v":{"v":7.5661718811102807E-4,"d":"0.1%"}},{"$f":"G70","v":{"v":-0.014705039375211617,"d":"-1.5%"}}]
[null,"ZACHODNIOPOMORSKIE","Poziom uczestnictwa w rynku pracy",{"$f":"D51","v":{"v":-0.014541048537315927,"d":"-1.5%"}},{"$f":"E51","v":{"v":-0.013778067003124186,"d":"-1.4%"}},{"$f":"F51","v":{"v":-0.006847024761556576,"d":"-0.7%"}},{"$f":"G51","v":{"v":-0.011678546674783734,"d":"-1.2%"}}]
[null,null,"Profil struktury wiekowej",{"$f":"D71","v":{"v":-0.016652193611390014,"d":"-1.7%"}},{"$f":"E71","v":{"v":-4.063514730679333E-4,"d":"-0.0%"}},{"$f":"F71","v":{"v":-0.02107790962615268,"d":"-2.1%"}},{"$f":"G71","v":{"v":0.019197987088520427,"d":"1.9%"}}]
[null,"DOLNOŚLĄSKIE","Poziom uczestnictwa w rynku pracy",{"$f":"D52","v":{"v":1.8170490471677977E-4,"d":"0.0%"}},{"$f":"E52","v":{"v":-3.1433555488460854E-3,"d":"-0.3%"}},{"$f":"F52","v":{"v":-1.231297218614334E-3,"d":"-0.1%"}},{"$f":"G52","v":{"v":-0.004234017184270988,"d":"-0.4%"}}]
[null,null,"Profil struktury wiekowej",{"$f":"D72","v":{"v":-0.00857902316773522,"d":"-0.9%"}},{"$f":"E72","v":{"v":-0.016992496401743263,"d":"-1.7%"}},{"$f":"F72","v":{"v":-0.02426970249836076,"d":"-2.4%"}},{"$f":"G72","v":{"v":0.021732411854881756,"d":"2.2%"}}]
[null,"OPOLSKIE","Poziom uczestnictwa w rynku pracy",{"$f":"D53","v":{"v":6.719310614747516E-3,"d":"0.7%"}},{"$f":"E53","v":{"v":-0.006237580843591061,"d":"-0.6%"}},{"$f":"F53","v":{"v":-3.3959048900510103E-3,"d":"-0.3%"}},{"$f":"G53","v":{"v":-0.009756772358312463,"d":"-1.0%"}}]
[null,null,"Profil struktury wiekowej",{"$f":"D73","v":{"v":-0.016826039634292564,"d":"-1.7%"}},{"$f":"E73","v":{"v":-0.02326249615467097,"d":"-2.3%"}},{"$f":"F73","v":{"v":9.708819541406016E-3,"d":"1.0%"}},{"$f":"G73","v":{"v":0.016070001288288064,"d":"1.6%"}}]
[null,"KUJAWSKO-POMORSKIE","Poziom uczestnictwa w rynku pracy",{"$f":"D54","v":{"v":-4.990362574846148E-4,"d":"-0.0%"}},{"$f":"E54","v":{"v":-0.002829425087382343,"d":"-0.3%"}},{"$f":"F54","v":{"v":2.4731785136198817E-4,"d":"0.0%"}},{"$f":"G54","v":{"v":2.289370222544042E-3,"d":"0.2%"}}]
[null,null,"Profil struktury wiekowej",{"$f":"D74","v":{"v":0.006583686602962955,"d":"0.7%"}},{"$f":"E74","v":{"v":-8.514596201752888E-3,"d":"-0.9%"}},{"$f":"F74","v":{"v":0.018847460019218307,"d":"1.9%"}},{"$f":"G74","v":{"v":-8.35742458793764E-3,"d":"-0.8%"}}]
[null,"POMORSKIE","Poziom uczestnictwa w rynku pracy",{"$f":"D55","v":{"v":5.089724177051262E-3,"d":"0.5%"}},{"$f":"E55","v":{"v":-0.004331243913993411,"d":"-0.4%"}},{"$f":"F55","v":{"v":-5.398991443576708E-3,"d":"-0.5%"}},{"$f":"G55","v":{"v":-0.010101276846932131,"d":"-1.0%"}}]
[null,null,"Profil struktury wiekowej",{"$f":"D75","v":{"v":3.8480669121557396E-3,"d":"0.4%"}},{"$f":"E75","v":{"v":0.018665489318415697,"d":"1.9%"}},{"$f":"F75","v":{"v":-0.006890778866857798,"d":"-0.7%"}},{"$f":"G75","v":{"v":-0.007036963604128467,"d":"-0.7%"}}]
[null,"WARMIŃSKO-MAZURSKIE","Poziom uczestnictwa w rynku pracy",{"$f":"D56","v":{"v":-0.028198445341433582,"d":"-2.8%"}},{"$f":"E56","v":{"v":-0.017210080632225698,"d":"-1.7%"}},{"$f":"F56","v":{"v":-0.014973357993736272,"d":"-1.5%"}},{"$f":"G56","v":{"v":-0.020929889361330105,"d":"-2.1%"}}]
[null,null,"Profil struktury wiekowej",{"$f":"D76","v":{"v":0.005958078340227961,"d":"0.6%"}},{"$f":"E76","v":{"v":-0.010769429510931919,"d":"-1.1%"}},{"$f":"F76","v":{"v":0.012339424995463769,"d":"1.2%"}},{"$f":"G76","v":{"v":-0.004505611429350836,"d":"-0.5%"}}]
[]
[]
[]
[null,null,"Poziom uczestnictwa w rynku pracy","15-29","30-39","40-49","50 i więcej","SUMA (*)"]
[null,null,"ŁÓDZKIE",{"$f":"D80*(E99-E$115)/$D$115","v":{"v":2.5777694699195388E-3,"d":"0.26%"}},{"v":0.008083648088748245,"d":"0.81%"},{"v":0.007365247087665728,"d":"0.74%"},{"v":2.4609824855167726E-3,"d":"0.25%"},{"$f":"SUM(D41:G41)","v":{"v":0.020487647131850285,"d":"2.05%"}}]
[null,null,"MAZOWIECKIE",{"v":0.010450946742015655,"d":"1.05%"},{"v":0.00888704545865752,"d":"0.89%"},{"v":0.0095732043981977,"d":"0.96%"},{"v":0.032481397647982,"d":"3.25%"},{"v":0.06139259424685287,"d":"6.14%"}]
[null,null,"MAŁOPOLSKIE",{"v":-0.008522080541064063,"d":"-0.85%"},{"v":2.0634164482007103E-4,"d":"0.02%"},{"v":0.000780685406316351,"d":"0.08%"},{"v":-0.006217992111850631,"d":"-0.62%"},{"v":-0.013753045601778272,"d":"-1.38%"}]
[null,null,"ŚLĄSKIE",{"v":0.008790871200809822,"d":"0.88%"},{"v":-2.2932718841564143E-3,"d":"-0.23%"},{"v":-6.7800923586394295E-3,"d":"-0.68%"},{"v":-0.03647681504797037,"d":"-3.65%"},{"v":-0.036759308089956394,"d":"-3.68%"}]
[null,null,"LUBELSKIE",{"v":-0.013160479726271592,"d":"-1.32%"},{"v":0.007173196593485966,"d":"0.72%"},{"v":0.005987918010317735,"d":"0.60%"},{"v":0.012206441795320397,"d":"1.22%"},{"v":0.012207076672852504,"d":"1.22%"}]
[null,null,"PODKARPACKIE",{"v":-0.018220095025990812,"d":"-1.82%"},{"v":1.4916918221829982E-4,"d":"0.01%"},{"v":8.902267158627741E-5,"d":"0.01%"},{"v":0.017959380741989137,"d":"1.80%"},{"v":-2.252243019709721E-5,"d":"-0.00%"}]
[null,null,"PODLASKIE",{"v":-0.017361776009190196,"d":"-1.74%"},{"v":0.004229638167655388,"d":"0.42%"},{"v":7.675252377403359E-3,"d":"0.77%"},{"v":0.005765248902436989,"d":"0.58%"},{"v":3.0836343830553843E-4,"d":"0.03%"}]
[null,null,"ŚWIĘTOKRZYSKIE",{"v":3.595455237715311E-3,"d":"0.36%"},{"v":4.424915955015876E-3,"d":"0.44%"},{"v":6.8193010540972335E-3,"d":"0.68%"},{"v":0.019853061079521495,"d":"1.99%"},{"v":0.034692733326349916,"d":"3.47%"}]
[null,null,"LUBUSKIE",{"v":-3.4043047612405193E-3,"d":"-0.34%"},{"v":-0.012080199338422479,"d":"-1.21%"},{"v":-0.008948674113162657,"d":"-0.89%"},{"v":-0.013347170809152705,"d":"-1.33%"},{"v":-0.037780349021978354,"d":"-3.78%"}]
[null,null,"WIELKOPOLSKIE",{"v":0.014256850884023974,"d":"1.43%"},{"v":-7.080772062855153E-5,"d":"-0.01%"},{"v":-5.0642387610984295E-3,"d":"-0.51%"},{"v":0.004278306860225987,"d":"0.43%"},{"v":0.01340011126252298,"d":"1.34%"}]
[null,null,"ZACHODNIOPOMORSKIE",{"v":-0.014541048537315927,"d":"-1.45%"},{"v":-0.013778067003124186,"d":"-1.38%"},{"v":-0.006847024761556576,"d":"-0.68%"},{"v":-0.011678546674783734,"d":"-1.17%"},{"v":-0.046844686976780424,"d":"-4.68%"}]
[null,null,"DOLNOŚLĄSKIE",{"v":1.8170490471677977E-4,"d":"0.02%"},{"v":-3.1433555488460854E-3,"d":"-0.31%"},{"v":-1.231297218614334E-3,"d":"-0.12%"},{"v":-0.004234017184270988,"d":"-0.42%"},{"v":-0.008426965047014626,"d":"-0.84%"}]
[null,null,"OPOLSKIE",{"v":6.719310614747516E-3,"d":"0.67%"},{"v":-0.006237580843591061,"d":"-0.62%"},{"v":-3.3959048900510103E-3,"d":"-0.34%"},{"v":-0.009756772358312463,"d":"-0.98%"},{"v":-0.012670947477207019,"d":"-1.27%"}]
[null,null,"KUJAWSKO-POMORSKIE",{"v":-4.990362574846148E-4,"d":"-0.05%"},{"v":-0.002829425087382343,"d":"-0.28%"},{"v":2.4731785136198817E-4,"d":"0.02%"},{"v":2.289370222544042E-3,"d":"0.23%"},{"v":-7.917732709609277E-4,"d":"-0.08%"}]
[null,null,"POMORSKIE",{"v":5.089724177051262E-3,"d":"0.51%"},{"v":-0.004331243913993411,"d":"-0.43%"},{"v":-5.398991443576708E-3,"d":"-0.54%"},{"v":-0.010101276846932131,"d":"-1.01%"},{"v":-0.014741788027450988,"d":"-1.47%"}]
[null,null,"WARMIŃSKO-MAZURSKIE",{"v":-0.028198445341433582,"d":"-2.82%"},{"v":-0.017210080632225698,"d":"-1.72%"},{"v":-0.014973357993736272,"d":"-1.50%"},{"v":-0.020929889361330105,"d":"-2.09%"},{"v":-0.08131177332872566,"d":"-8.13%"}]
[]
[]
[]
[null,null,"Profil struktury wiekowej","15-29","30-39","40-49","50 i więcej","SUMA (**)"]
[null,null,"ŁÓDZKIE",{"$f":"E$115*(D80-D$96)/$D$115","v":{"v":-0.013229619462403742,"d":"-1.32%"}},{"v":-0.00868099968972059,"d":"-0.87%"},{"v":1.8892637572855693E-3,"d":"0.19%"},{"v":0.011154810421568415,"d":"1.12%"},{"$f":"SUM(D61:G61)","v":{"v":-0.008866544973270349,"d":"-0.89%"}}]
[null,null,"MAZOWIECKIE",{"v":-0.004748414997350834,"d":"-0.47%"},{"v":0.03197826739525702,"d":"3.20%"},{"v":-1.2729596263469612E-3,"d":"-0.13%"},{"v":-0.00891558324662919,"d":"-0.89%"},{"v":0.017041309524930034,"d":"1.70%"}]
[null,null,"MAŁOPOLSKIE",{"v":0.027619521043982756,"d":"2.76%"},{"v":-0.013075232353326196,"d":"-1.31%"},{"v":0.003024706530431412,"d":"0.30%"},{"v":-0.013869437561410649,"d":"-1.39%"},{"v":3.6995576596773223E-3,"d":"0.37%"}]
[null,null,"ŚLĄSKIE",{"v":-0.015311430454669674,"d":"-1.53%"},{"v":-0.004440754661666445,"d":"-0.44%"},{"v":2.047307037882291E-3,"d":"0.20%"},{"v":0.010778186835861401,"d":"1.08%"},{"v":-0.006926691242592426,"d":"-0.69%"}]
[null,null,"LUBELSKIE",{"v":3.6142089275757626E-3,"d":"0.36%"},{"v":-0.002760337665527664,"d":"-0.28%"},{"v":6.039223602505771E-4,"d":"0.06%"},{"v":-1.4877505712280025E-3,"d":"-0.15%"},{"v":-2.9956948929327079E-5,"d":"-0.00%"}]
[null,null,"PODKARPACKIE",{"v":0.015898157644451637,"d":"1.59%"},{"v":-0.005949863455233017,"d":"-0.59%"},{"v":0.009116649781618623,"d":"0.91%"},{"v":-0.011510507715290753,"d":"-1.15%"},{"v":0.007554436255546491,"d":"0.76%"}]
[null,null,"PODLASKIE",{"v":-1.0583931480375698E-3,"d":"-0.11%"},{"v":-0.022434513995669963,"d":"-2.24%"},{"v":0.01713587318832978,"d":"1.71%"},{"v":2.6666704636621303E-3,"d":"0.27%"},{"v":-3.6903634917156204E-3,"d":"-0.37%"}]
[null,null,"ŚWIĘTOKRZYSKIE",{"v":-1.8241584837196223E-3,"d":"-0.18%"},{"v":-0.011131127851539184,"d":"-1.11%"},{"v":-0.00478230978700218,"d":"-0.48%"},{"v":7.4043124581288445E-3,"d":"0.74%"},{"v":-0.010333283664132144,"d":"-1.03%"}]
[null,null,"LUBUSKIE",{"v":-0.008365403830913585,"d":"-0.84%"},{"v":0.005285963571826668,"d":"0.53%"},{"v":-0.001033260545888745,"d":"-0.10%"},{"v":0.003729878108940117,"d":"0.37%"},{"v":-3.8282269603554485E-4,"d":"-0.04%"}]
[null,null,"WIELKOPOLSKIE",{"v":0.017237710420047493,"d":"1.72%"},{"v":0.00849124078166375,"d":"0.85%"},{"v":7.5661718811102807E-4,"d":"0.08%"},{"v":-0.014705039375211617,"d":"-1.47%"},{"v":0.011780529014610656,"d":"1.18%"}]
[null,null,"ZACHODNIOPOMORSKIE",{"v":-0.016652193611390014,"d":"-1.67%"},{"v":-4.063514730679333E-4,"d":"-0.04%"},{"v":-0.02107790962615268,"d":"-2.11%"},{"v":0.019197987088520427,"d":"1.92%"},{"v":-0.0189384676220902,"d":"-1.89%"}]
[null,null,"DOLNOŚLĄSKIE",{"v":-0.00857902316773522,"d":"-0.86%"},{"v":-0.016992496401743263,"d":"-1.70%"},{"v":-0.02426970249836076,"d":"-2.43%"},{"v":0.021732411854881756,"d":"2.17%"},{"v":-0.028108810212957483,"d":"-2.81%"}]
[null,null,"OPOLSKIE",{"v":-0.016826039634292564,"d":"-1.68%"},{"v":-0.02326249615467097,"d":"-2.33%"},{"v":9.708819541406016E-3,"d":"0.97%"},{"v":0.016070001288288064,"d":"1.61%"},{"v":-0.014309714959269453,"d":"-1.43%"}]
[null,null,"KUJAWSKO-POMORSKIE",{"v":0.006583686602962955,"d":"0.66%"},{"v":-8.514596201752888E-3,"d":"-0.85%"},{"v":0.018847460019218307,"d":"1.88%"},{"v":-8.35742458793764E-3,"d":"-0.84%"},{"v":0.008559125832490735,"d":"0.86%"}]
[null,null,"POMORSKIE",{"v":3.8480669121557396E-3,"d":"0.38%"},{"v":0.018665489318415697,"d":"1.87%"},{"v":-0.006890778866857798,"d":"-0.69%"},{"v":-0.007036963604128467,"d":"-0.70%"},{"v":0.008585813759585174,"d":"0.86%"}]
[null,null,"WARMIŃSKO-MAZURSKIE",{"v":0.005958078340227961,"d":"0.60%"},{"v":-0.010769429510931919,"d":"-1.08%"},{"v":0.012339424995463769,"d":"1.23%"},{"v":-0.004505611429350836,"d":"-0.45%"},{"v":3.0224623954089747E-3,"d":"0.30%"}]
[]
[]
[null,null,"Nij/Ni(15+)","15-29","30-39","40-49","50 i więcej"]
[null,null,"ŁÓDZKIE",{"$f":"E137/$D137","v":0.22859552931252636},0.17418810628426823,0.14888232813159005,0.44833403627161533]
[null,null,"MAZOWIECKIE",0.23755656108597284,0.2002262443438914,0.14683257918552037,0.4153846153846154]
[null,null,"MAŁOPOLSKIE",0.2717557251908397,0.1713740458015267,0.14961832061068703,0.4072519083969466]
[null,null,"ŚLĄSKIE",0.2263959390862944,0.1769035532994924,0.14898477157360407,0.44771573604060916]
[null,null,"LUBELSKIE",0.24639230358097275,0.17797969000534475,0.14804917156600747,0.42757883484767506]
[null,null,"PODKARPACKIE",0.2593712212817412,0.1759371221281741,0.15356711003627568,0.4111245465538089]
[null,null,"PODLASKIE",0.2414553472987872,0.16538037486218302,0.1587651598676957,0.43439911797133407]
[null,null,"ŚWIĘTOKRZYSKIE",0.24064625850340135,0.17261904761904762,0.1445578231292517,0.4421768707482993]
[null,null,"LUBUSKIE",0.23373493975903614,0.18313253012048192,0.14698795180722893,0.43614457831325304]
[null,null,"WIELKOPOLSKIE",0.2607865597556319,0.18518518518518517,0.14814814814814814,0.40588010691103477]
[null,null,"ZACHODNIOPOMORSKIE",0.22497932175351532,0.1794871794871795,0.13399503722084366,0.46153846153846156]
[null,null,"DOLNOŚLĄSKIE",0.23350923482849603,0.16886543535620052,0.13192612137203166,0.4656992084432718]
[null,null,"OPOLSKIE",0.22479564032697547,0.164850136239782,0.1539509536784741,0.4564032697547684]
[null,null,"KUJAWSKO-POMORSKIE",0.2495297805642633,0.174294670846395,0.15987460815047022,0.41630094043887145]
[null,null,"POMORSKIE",0.24663939216832262,0.19170075978959672,0.14319111630625364,0.418468731735827]
[null,null,"WARMIŃSKO-MAZURSKIE",0.248868778280543,0.17285067873303167,0.15565610859728507,0.42262443438914027]
[null,null,"POLSKA",0.2425736194342419,0.17974740640505188,0.14765770990398866,0.43002126425671755]
[]
[null,null,"Azij/Nij","Ogółem","15-29","30-39","40-49","50 i więcej"]
[null,null,"ŁÓDZKIE",{"$f":"D118/D137","v":0.5651623787431463},0.5350553505535055,0.8983050847457628,0.8895184135977338,0.3433678269049859]
[null,null,"MAZOWIECKIE",0.6024886877828054,0.5533333333333333,0.8971751412429378,0.8983050847457628,0.3839869281045752]
[null,null,"MAŁOPOLSKIE",0.5530534351145038,0.5112359550561798,0.8730512249443207,0.8647959183673469,0.33177132146204313]
[null,null,"ŚLĄSKIE",0.5342639593908629,0.5504484304932735,0.8651362984218077,0.8364565587734242,0.2947845804988662]
[null,null,"LUBELSKIE",0.5654730090860502,0.49891540130151846,0.8948948948948949,0.8844765342960289,0.35625]
[null,null,"PODKARPACKIE",0.5628778718258767,0.48951048951048953,0.872852233676976,0.8622047244094488,0.36470588235294116]
[null,null,"PODLASKIE",0.5567805953693495,0.4885844748858447,0.8866666666666667,0.8888888888888888,0.3477157360406091]
[null,null,"ŚWIĘTOKRZYSKIE",0.5722789115646258,0.5371024734982333,0.8866995073891626,0.888235294117647,0.36538461538461536]
[null,null,"LUBUSKIE",0.5373493975903615,0.520618556701031,0.8355263157894737,0.8278688524590164,0.32320441988950277]
[null,null,"WIELKOPOLSKIE",0.572737686139748,0.5592972181551976,0.8721649484536083,0.8427835051546392,0.34619002822201317]
[null,null,"ZACHODNIOPOMORSKIE",{"$f":"D128/D147","v":0.52191894127378},0.49264705882352944,0.8294930875576036,0.8333333333333334,0.32616487455197135]
[null,null,"DOLNOŚLĄSKIE",0.5382585751978892,0.5291902071563088,0.8619791666666666,0.8566666666666667,0.3352219074598678]
[null,null,"OPOLSKIE",0.5435967302452316,0.5454545454545454,0.8512396694214877,0.8495575221238938,0.3283582089552239]
[null,null,"KUJAWSKO-POMORSKIE",0.5630094043887147,0.5276381909547738,0.8633093525179856,0.8627450980392157,0.3433734939759036]
[null,null,"POMORSKIE",0.5552308591466978,0.5402843601895735,0.8597560975609756,0.8408163265306122,0.3268156424581006]
[null,null,"WARMIŃSKO-MAZURSKIE",0.5149321266968325,0.46545454545454545,0.8167539267015707,0.8081395348837209,0.31263383297644537]
[null,null,"POLSKA",0.5586700173980282,0.5287554788152478,0.8723785624663918,0.8618808640628409,0.3403011912789391]
[]
[null,null,"Azi","Ogółem","15-29","30-39","40-49","50 i więcej"]
[null,null,"ŁÓDZKIE",1340,290,371,314,365]
[null,null,"MAZOWIECKIE",2663,581,794,583,705]
[null,null,"MAŁOPOLSKIE",1449,364,392,339,354]
[null,null,"ŚLĄSKIE",2105,491,603,491,520]
[null,null,"LUBELSKIE",1058,230,298,245,285]
[null,null,"PODKARPACKIE",931,210,254,219,248]
[null,null,"PODLASKIE",505,107,133,128,137]
[null,null,"ŚWIĘTOKRZYSKIE",673,152,180,151,190]
[null,null,"LUBUSKIE",446,101,127,101,117]
[null,null,"WIELKOPOLSKIE",1500,382,423,327,368]
[null,null,"ZACHODNIOPOMORSKIE",631,134,180,135,182]
[null,null,"DOLNOŚLĄSKIE",1224,281,331,257,355]
[null,null,"OPOLSKIE",399,90,103,96,110]
[null,null,"KUJAWSKO-POMORSKIE",898,210,240,220,228]
[null,null,"POMORSKIE",950,228,282,206,234]
[null,null,"WARMIŃSKO-MAZURSKIE",569,128,156,139,146]
[null,null,"POLSKA",17340,3981,4867,3950,4542]
[]
[null,null,"Ni","Ogółem","15-29","30-39","40-49","50 i więcej"]
[null,null,"ŁÓDZKIE",2371,542,413,353,1063]
[null,null,"MAZOWIECKIE",4420,1050,885,649,1836]
[null,null,"MAŁOPOLSKIE",2620,712,449,392,1067]
[null,null,"ŚLĄSKIE",3940,892,697,587,1764]
[null,null,"LUBELSKIE",1871,461,333,277,800]
[null,null,"PODKARPACKIE",1654,429,291,254,680]
[null,null,"PODLASKIE",907,219,150,144,394]
[null,null,"ŚWIĘTOKRZYSKIE",1176,283,203,170,520]
[null,null,"LUBUSKIE",830,194,152,122,362]
[null,null,"WIELKOPOLSKIE",2619,683,485,388,1063]
[null,null,"ZACHODNIOPOMORSKIE",1209,272,217,162,558]
[null,null,"DOLNOŚLĄSKIE",2274,531,384,300,1059]
[null,null,"OPOLSKIE",734,165,121,113,335]
[null,null,"KUJAWSKO-POMORSKIE",1595,398,278,255,664]
[null,null,"POMORSKIE",1711,422,328,245,716]
[null,null,"WARMIŃSKO-MAZURSKIE",1105,275,191,172,467]
[null,null,"POLSKA",31038,7529,5579,4583,13347]

{"sheet":"2007akt","index":9,"n_rows":153,"n_cols":8,"rows_kept":153,"hidden":true,"merged":[[0,1,0,7],[1,1,1,7]]}
[null,"Poddekompozycja różnic we współczynniku AKTYWNOŚCI ZAWODOWEJ"]
[null,2007]
[]
[null,null,"Sekcje","15-29","30-39","40-49","50 i więcej"]
[null,"ŁÓDZKIE","Poziom uczestnictwa w rynku pracy",{"$f":"D41","v":{"v":0.010926754263702421,"d":"1.1%"}},{"$f":"E41","v":{"v":4.5252479370631584E-3,"d":"0.5%"}},{"$f":"F41","v":{"v":0.007850793551781487,"d":"0.8%"}},{"$f":"G41","v":{"v":0.006746197919966931,"d":"0.7%"}}]
[null,null,"Profil struktury wiekowej",{"$f":"D61","v":{"v":-0.014137466729864205,"d":"-1.4%"}},{"$f":"E61","v":{"v":3.3743427722473145E-3,"d":"0.3%"}},{"$f":"F61","v":{"v":-8.086734521152196E-3,"d":"-0.8%"}},{"$f":"G61","v":{"v":0.010055679152150315,"d":"1.0%"}}]
[null,"MAZOWIECKIE","Poziom uczestnictwa w rynku pracy",{"$f":"D42","v":{"v":0.018930060682672445,"d":"1.9%"}},{"$f":"E42","v":{"v":0.006906771046021492,"d":"0.7%"}},{"$f":"F42","v":{"v":0.011318757899177814,"d":"1.1%"}},{"$f":"G42","v":{"v":0.02863441430381729,"d":"2.9%"}}]
[null,null,"Profil struktury wiekowej",{"$f":"D62","v":{"v":0.01172212106257316,"d":"1.2%"}},{"$f":"E62","v":{"v":6.5939165701312745E-4,"d":"0.1%"}},{"$f":"F62","v":{"v":-0.012945898480940672,"d":"-1.3%"}},{"$f":"G62","v":{"v":-2.5628328624985254E-3,"d":"-0.3%"}}]
[null,"MAŁOPOLSKIE","Poziom uczestnictwa w rynku pracy",{"$f":"D43","v":{"v":3.4790267427930606E-3,"d":"0.3%"}},{"$f":"E43","v":{"v":0.010214720441082452,"d":"1.0%"}},{"$f":"F43","v":{"v":-5.0881952087809335E-4,"d":"-0.1%"}},{"$f":"G43","v":{"v":-6.99944930896651E-3,"d":"-0.7%"}}]
[null,null,"Profil struktury wiekowej",{"$f":"D63","v":{"v":0.022258462839531423,"d":"2.2%"}},{"$f":"E63","v":{"v":-0.021438847891140107,"d":"-2.1%"}},{"$f":"F63","v":{"v":-0.008668373942573296,"d":"-0.9%"}},{"$f":"G63","v":{"v":-2.7585196160112434E-3,"d":"-0.3%"}}]
[null,"ŚLĄSKIE","Poziom uczestnictwa w rynku pracy",{"$f":"D44","v":{"v":-0.004416190342646637,"d":"-0.4%"}},{"$f":"E44","v":{"v":-3.1142350499633402E-3,"d":"-0.3%"}},{"$f":"F44","v":{"v":-0.019920316150177617,"d":"-2.0%"}},{"$f":"G44","v":{"v":-0.041765100544201766,"d":"-4.2%"}}]
[null,null,"Profil struktury wiekowej",{"$f":"D64","v":{"v":-0.013799035121922612,"d":"-1.4%"}},{"$f":"E64","v":{"v":-2.5299036027573423E-3,"d":"-0.3%"}},{"$f":"F64","v":{"v":0.017297492924678307,"d":"1.7%"}},{"$f":"G64","v":{"v":2.886833154570573E-3,"d":"0.3%"}}]
[null,"LUBELSKIE","Poziom uczestnictwa w rynku pracy",{"$f":"D45","v":{"v":7.7431705321504545E-3,"d":"0.8%"}},{"$f":"E45","v":{"v":2.58977788413883E-3,"d":"0.3%"}},{"$f":"F45","v":{"v":0.005910281336902737,"d":"0.6%"}},{"$f":"G45","v":{"v":0.037643176565413675,"d":"3.8%"}}]
[null,null,"Profil struktury wiekowej",{"$f":"D65","v":{"v":0.001081959277158838,"d":"0.1%"}},{"$f":"E65","v":{"v":-0.005033924468661067,"d":"-0.5%"}},{"$f":"F65","v":{"v":1.4592245047502018E-3,"d":"0.1%"}},{"$f":"G65","v":{"v":5.6194491962601974E-4,"d":"0.1%"}}]
[null,"PODKARPACKIE","Poziom uczestnictwa w rynku pracy",{"$f":"D46","v":{"v":-0.015598552826552871,"d":"-1.6%"}},{"$f":"E46","v":{"v":-2.1989699722336025E-3,"d":"-0.2%"}},{"$f":"F46","v":{"v":2.285353544199858E-5,"d":"0.0%"}},{"$f":"G46","v":{"v":0.015147470254088621,"d":"1.5%"}}]
[null,null,"Profil struktury wiekowej",{"$f":"D66","v":{"v":0.01923977730912219,"d":"1.9%"}},{"$f":"E66","v":{"v":0.011245374957981025,"d":"1.1%"}},{"$f":"F66","v":{"v":1.766279093229598E-3,"d":"0.2%"}},{"$f":"G66","v":{"v":-0.015817253012892486,"d":"-1.6%"}}]
[null,"PODLASKIE","Poziom uczestnictwa w rynku pracy",{"$f":"D47","v":{"v":-0.013276826286881184,"d":"-1.3%"}},{"$f":"E47","v":{"v":1.1889080883044684E-3,"d":"0.1%"}},{"$f":"F47","v":{"v":0.016339606301931753,"d":"1.6%"}},{"$f":"G47","v":{"v":-0.002685083708703917,"d":"-0.3%"}}]
[null,null,"Profil struktury wiekowej",{"$f":"D67","v":{"v":-1.2087513077243057E-4,"d":"-0.0%"}},{"$f":"E67","v":{"v":0.00873829698854185,"d":"0.9%"}},{"$f":"F67","v":{"v":0.006339674694250248,"d":"0.6%"}},{"$f":"G67","v":{"v":-0.005152589446628651,"d":"-0.5%"}}]
[null,"ŚWIĘTOKRZYSKIE","Poziom uczestnictwa w rynku pracy",{"$f":"D48","v":{"v":0.005297296734834635,"d":"0.5%"}},{"$f":"E48","v":{"v":3.878953480734239E-3,"d":"0.4%"}},{"$f":"F48","v":{"v":0.013368259601820408,"d":"1.3%"}},{"$f":"G48","v":{"v":0.029447579818160225,"d":"2.9%"}}]
[null,null,"Profil struktury wiekowej",{"$f":"D68","v":{"v":1.5152601544371528E-3,"d":"0.2%"}},{"$f":"E68","v":{"v":-3.7168230879239521E-4,"d":"-0.0%"}},{"$f":"F68","v":{"v":-0.006665701322344805,"d":"-0.7%"}},{"$f":"G68","v":{"v":1.591206868760805E-3,"d":"0.2%"}}]
[null,"LUBUSKIE","Poziom uczestnictwa w rynku pracy",{"$f":"D49","v":{"v":-0.01233757777763618,"d":"-1.2%"}},{"$f":"E49","v":{"v":-6.6427100447890046E-3,"d":"-0.7%"}},{"$f":"F49","v":{"v":1.1148413931778863E-4,"d":"0.0%"}},{"$f":"G49","v":{"v":-2.328059202777451E-3,"d":"-0.2%"}}]
[null,null,"Profil struktury wiekowej",{"$f":"D69","v":{"v":-0.005064962893903632,"d":"-0.5%"}},{"$f":"E69","v":{"v":0.027240512035631298,"d":"2.7%"}},{"$f":"F69","v":{"v":-1.6609197272911367E-3,"d":"-0.2%"}},{"$f":"G69","v":{"v":-0.005713782228243468,"d":"-0.6%"}}]
[null,"WIELKOPOLSKIE","Poziom uczestnictwa w rynku pracy",{"$f":"D50","v":{"v":-7.9861671754709245E-5,"d":"-0.0%"}},{"$f":"E50","v":{"v":-1.7543826848201395E-3,"d":"-0.2%"}},{"$f":"F50","v":{"v":0.0029319055990585,"d":"0.3%"}},{"$f":"G50","v":{"v":-0.0093862095072989,"d":"-0.9%"}}]
[null,null,"Profil struktury wiekowej",{"$f":"D70","v":{"v":0.018100796002468198,"d":"1.8%"}},{"$f":"E70","v":{"v":0.010631589731480706,"d":"1.1%"}},{"$f":"F70","v":{"v":0.01090369729774948,"d":"1.1%"}},{"$f":"G70","v":{"v":-0.01816912577240631,"d":"-1.8%"}}]
[null,"ZACHODNIOPOMORSKIE","Poziom uczestnictwa w rynku pracy",{"$f":"D51","v":{"v":-0.026480713802934788,"d":"-2.6%"}},{"$f":"E51","v":{"v":-0.008939342147853593,"d":"-0.9%"}},{"$f":"F51","v":{"v":-0.011525281528119196,"d":"-1.2%"}},{"$f":"G51","v":{"v":-0.013445025501207327,"d":"-1.3%"}}]
[null,null,"Profil struktury wiekowej",{"$f":"D71","v":{"v":-0.022557342408191034,"d":"-2.3%"}},{"$f":"E71","v":{"v":-0.019859850712150053,"d":"-2.0%"}},{"$f":"F71","v":{"v":1.4797150150614876E-3,"d":"0.1%"}},{"$f":"G71","v":{"v":0.019565056509759524,"d":"2.0%"}}]
[null,"DOLNOŚLĄSKIE","Poziom uczestnictwa w rynku pracy",{"$f":"D52","v":{"v":5.4250090017134945E-3,"d":"0.5%"}},{"$f":"E52","v":{"v":-3.498294932485802E-3,"d":"-0.3%"}},{"$f":"F52","v":{"v":-0.003808429976116237,"d":"-0.4%"}},{"$f":"G52","v":{"v":0.002003915076255109,"d":"0.2%"}}]
[null,null,"Profil struktury wiekowej",{"$f":"D72","v":{"v":-0.008523412684234942,"d":"-0.9%"}},{"$f":"E72","v":{"v":-0.010109702965096883,"d":"-1.0%"}},{"$f":"F72","v":{"v":0.002192825819098986,"d":"0.2%"}},{"$f":"G72","v":{"v":0.007703333956144084,"d":"0.8%"}}]
[null,"OPOLSKIE","Poziom uczestnictwa w rynku pracy",{"$f":"D53","v":{"v":-0.009252530374959322,"d":"-0.9%"}},{"$f":"E53","v":{"v":-0.010497409190301068,"d":"-1.0%"}},{"$f":"F53","v":{"v":-3.9889590370965015E-3,"d":"-0.4%"}},{"$f":"G53","v":{"v":-0.012773851414210849,"d":"-1.3%"}}]
[null,null,"Profil struktury wiekowej",{"$f":"D73","v":{"v":-0.02565973920629511,"d":"-2.6%"}},{"$f":"E73","v":{"v":0.006956649936575568,"d":"0.7%"}},{"$f":"F73","v":{"v":-0.008120117657973512,"d":"-0.8%"}},{"$f":"G73","v":{"v":0.015646860387977732,"d":"1.6%"}}]
[null,"KUJAWSKO-POMORSKIE","Poziom uczestnictwa w rynku pracy",{"$f":"D54","v":{"v":-0.010229737166778757,"d":"-1.0%"}},{"$f":"E54","v":{"v":-0.006044703662523166,"d":"-0.6%"}},{"$f":"F54","v":{"v":-3.800441975837445E-3,"d":"-0.4%"}},{"$f":"G54","v":{"v":-0.01879122525456075,"d":"-1.9%"}}]
[null,null,"Profil struktury wiekowej",{"$f":"D74","v":{"v":-0.009295444597516437,"d":"-0.9%"}},{"$f":"E74","v":{"v":-0.004048297816796011,"d":"-0.4%"}},{"$f":"F74","v":{"v":0.008759678269054766,"d":"0.9%"}},{"$f":"G74","v":{"v":3.767745916305144E-3,"d":"0.4%"}}]
[null,"POMORSKIE","Poziom uczestnictwa w rynku pracy",{"$f":"D55","v":{"v":9.8891304359170759E-5,"d":"0.0%"}},{"$f":"E55","v":{"v":-0.006908801706297618,"d":"-0.7%"}},{"$f":"F55","v":{"v":-2.525857446306522E-3,"d":"-0.3%"}},{"$f":"G55","v":{"v":-9.5979135539873094E-4,"d":"-0.1%"}}]
[null,null,"Profil struktury wiekowej",{"$f":"D75","v":{"v":1.2756983828961152E-3,"d":"0.1%"}},{"$f":"E75","v":{"v":0.01927820523455796,"d":"1.9%"}},{"$f":"F75","v":{"v":-0.02156802046731522,"d":"-2.2%"}},{"$f":"G75","v":{"v":3.0400016940547366E-4,"d":"0.0%"}}]
[null,"WARMIŃSKO-MAZURSKIE","Poziom uczestnictwa w rynku pracy",{"$f":"D56","v":{"v":-0.02727883169454284,"d":"-2.7%"}},{"$f":"E56","v":{"v":-0.003458542702066703,"d":"-0.3%"}},{"$f":"F56","v":{"v":-6.680113824230817E-3,"d":"-0.7%"}},{"$f":"G56","v":{"v":-0.013085924728722803,"d":"-1.3%"}}]
[null,null,"Profil struktury wiekowej",{"$f":"D76","v":{"v":-0.01687815174579567,"d":"-1.7%"}},{"$f":"E76","v":{"v":3.7802176034078885E-3,"d":"0.4%"}},{"$f":"F76","v":{"v":0.021346662780208026,"d":"2.1%"}},{"$f":"G76","v":{"v":0.001119161762535164,"d":"0.1%"}}]
[]
[]
[]
[null,null,"Poziom uczestnictwa w rynku pracy","15-29","30-39","40-49","50 i więcej","SUMA (*)"]
[null,null,"ŁÓDZKIE",{"$f":"D80*(E99-E$115)/$D$115","v":{"v":0.010926754263702421,"d":"1.09%"}},{"v":4.5252479370631584E-3,"d":"0.45%"},{"v":0.007850793551781487,"d":"0.79%"},{"v":0.006746197919966931,"d":"0.67%"},{"$f":"SUM(D41:G41)","v":{"v":0.030048993672514,"d":"3.00%"}}]
[null,null,"MAZOWIECKIE",{"v":0.018930060682672445,"d":"1.89%"},{"v":0.006906771046021492,"d":"0.69%"},{"v":0.011318757899177814,"d":"1.13%"},{"v":0.02863441430381729,"d":"2.86%"},{"v":0.06579000393168905,"d":"6.58%"}]
[null,null,"MAŁOPOLSKIE",{"v":3.4790267427930606E-3,"d":"0.35%"},{"v":0.010214720441082452,"d":"1.02%"},{"v":-5.0881952087809335E-4,"d":"-0.05%"},{"v":-6.99944930896651E-3,"d":"-0.70%"},{"v":6.18547835403091E-3,"d":"0.62%"}]
[null,null,"ŚLĄSKIE",{"v":-0.004416190342646637,"d":"-0.44%"},{"v":-3.1142350499633402E-3,"d":"-0.31%"},{"v":-0.019920316150177617,"d":"-1.99%"},{"v":-0.041765100544201766,"d":"-4.18%"},{"v":-0.06921584208698936,"d":"-6.92%"}]
[null,null,"LUBELSKIE",{"v":7.7431705321504545E-3,"d":"0.77%"},{"v":2.58977788413883E-3,"d":"0.26%"},{"v":0.005910281336902737,"d":"0.59%"},{"v":0.037643176565413675,"d":"3.76%"},{"v":0.053886406318605695,"d":"5.39%"}]
[null,null,"PODKARPACKIE",{"v":-0.015598552826552871,"d":"-1.56%"},{"v":-2.1989699722336025E-3,"d":"-0.22%"},{"v":2.285353544199858E-5,"d":"0.00%"},{"v":0.015147470254088621,"d":"1.51%"},{"v":-2.6271990092558532E-3,"d":"-0.26%"}]
[null,null,"PODLASKIE",{"v":-0.013276826286881184,"d":"-1.33%"},{"v":1.1889080883044684E-3,"d":"0.12%"},{"v":0.016339606301931753,"d":"1.63%"},{"v":-0.002685083708703917,"d":"-0.27%"},{"v":0.001566604394651121,"d":"0.16%"}]
[null,null,"ŚWIĘTOKRZYSKIE",{"v":0.005297296734834635,"d":"0.53%"},{"v":3.878953480734239E-3,"d":"0.39%"},{"v":0.013368259601820408,"d":"1.34%"},{"v":0.029447579818160225,"d":"2.94%"},{"v":0.05199208963554951,"d":"5.20%"}]
[null,null,"LUBUSKIE",{"v":-0.01233757777763618,"d":"-1.23%"},{"v":-6.6427100447890046E-3,"d":"-0.66%"},{"v":1.1148413931778863E-4,"d":"0.01%"},{"v":-2.328059202777451E-3,"d":"-0.23%"},{"v":-0.02119686288588485,"d":"-2.12%"}]
[null,null,"WIELKOPOLSKIE",{"v":-7.9861671754709245E-5,"d":"-0.01%"},{"v":-1.7543826848201395E-3,"d":"-0.18%"},{"v":0.0029319055990585,"d":"0.29%"},{"v":-0.0093862095072989,"d":"-0.94%"},{"v":-0.00828854826481525,"d":"-0.83%"}]
[null,null,"ZACHODNIOPOMORSKIE",{"v":-0.026480713802934788,"d":"-2.65%"},{"v":-0.008939342147853593,"d":"-0.89%"},{"v":-0.011525281528119196,"d":"-1.15%"},{"v":-0.013445025501207327,"d":"-1.34%"},{"v":-0.06039036298011491,"d":"-6.04%"}]
[null,null,"DOLNOŚLĄSKIE",{"v":5.4250090017134945E-3,"d":"0.54%"},{"v":-3.498294932485802E-3,"d":"-0.35%"},{"v":-0.003808429976116237,"d":"-0.38%"},{"v":0.002003915076255109,"d":"0.20%"},{"v":1.2219916936656453E-4,"d":"0.01%"}]
[null,null,"OPOLSKIE",{"v":-0.009252530374959322,"d":"-0.93%"},{"v":-0.010497409190301068,"d":"-1.05%"},{"v":-3.9889590370965015E-3,"d":"-0.40%"},{"v":-0.012773851414210849,"d":"-1.28%"},{"v":-0.03651275001656774,"d":"-3.65%"}]
[null,null,"KUJAWSKO-POMORSKIE",{"v":-0.010229737166778757,"d":"-1.02%"},{"v":-0.006044703662523166,"d":"-0.60%"},{"v":-3.800441975837445E-3,"d":"-0.38%"},{"v":-0.01879122525456075,"d":"-1.88%"},{"v":-0.038866108059700116,"d":"-3.89%"}]
[null,null,"POMORSKIE",{"v":9.8891304359170759E-5,"d":"0.01%"},{"v":-0.006908801706297618,"d":"-0.69%"},{"v":-2.525857446306522E-3,"d":"-0.25%"},{"v":-9.5979135539873094E-4,"d":"-0.10%"},{"v":-0.0102955592036437,"d":"-1.03%"}]
[null,null,"WARMIŃSKO-MAZURSKIE",{"v":-0.02727883169454284,"d":"-2.73%"},{"v":-0.003458542702066703,"d":"-0.35%"},{"v":-6.680113824230817E-3,"d":"-0.67%"},{"v":-0.013085924728722803,"d":"-1.31%"},{"v":-0.05050341294956316,"d":"-5.05%"}]
[]
[]
[]
[null,null,"Profil struktury wiekowej","15-29","30-39","40-49","50 i więcej","SUMA (**)"]
[null,null,"ŁÓDZKIE",{"$f":"E$115*(D80-D$96)/$D$115","v":{"v":-0.014137466729864205,"d":"-1.41%"}},{"v":3.3743427722473145E-3,"d":"0.34%"},{"v":-8.086734521152196E-3,"d":"-0.81%"},{"v":0.010055679152150315,"d":"1.01%"},{"$f":"SUM(D61:G61)","v":{"v":-0.008794179326618773,"d":"-0.88%"}}]
[null,null,"MAZOWIECKIE",{"v":0.01172212106257316,"d":"1.17%"},{"v":6.5939165701312745E-4,"d":"0.07%"},{"v":-0.012945898480940672,"d":"-1.29%"},{"v":-2.5628328624985254E-3,"d":"-0.26%"},{"v":-0.00312721862385291,"d":"-0.31%"}]
[null,null,"MAŁOPOLSKIE",{"v":0.022258462839531423,"d":"2.23%"},{"v":-0.021438847891140107,"d":"-2.14%"},{"v":-0.008668373942573296,"d":"-0.87%"},{"v":-2.7585196160112434E-3,"d":"-0.28%"},{"v":-0.010607278610193222,"d":"-1.06%"}]
[null,null,"ŚLĄSKIE",{"v":-0.013799035121922612,"d":"-1.38%"},{"v":-2.5299036027573423E-3,"d":"-0.25%"},{"v":0.017297492924678307,"d":"1.73%"},{"v":2.886833154570573E-3,"d":"0.29%"},{"v":0.003855387354568924,"d":"0.39%"}]
[null,null,"LUBELSKIE",{"v":0.001081959277158838,"d":"0.11%"},{"v":-0.005033924468661067,"d":"-0.50%"},{"v":1.4592245047502018E-3,"d":"0.15%"},{"v":5.6194491962601974E-4,"d":"0.06%"},{"v":-1.9307957671260072E-3,"d":"-0.19%"}]
[null,null,"PODKARPACKIE",{"v":0.01923977730912219,"d":"1.92%"},{"v":0.011245374957981025,"d":"1.12%"},{"v":1.766279093229598E-3,"d":"0.18%"},{"v":-0.015817253012892486,"d":"-1.58%"},{"v":0.01643417834744033,"d":"1.64%"}]
[null,null,"PODLASKIE",{"v":-1.2087513077243057E-4,"d":"-0.01%"},{"v":0.00873829698854185,"d":"0.87%"},{"v":0.006339674694250248,"d":"0.63%"},{"v":-0.005152589446628651,"d":"-0.52%"},{"v":0.009804507105391016,"d":"0.98%"}]
[null,null,"ŚWIĘTOKRZYSKIE",{"v":1.5152601544371528E-3,"d":"0.15%"},{"v":-3.7168230879239521E-4,"d":"-0.04%"},{"v":-0.006665701322344805,"d":"-0.67%"},{"v":1.591206868760805E-3,"d":"0.16%"},{"v":-0.003930916607939243,"d":"-0.39%"}]
[null,null,"LUBUSKIE",{"v":-0.005064962893903632,"d":"-0.51%"},{"v":0.027240512035631298,"d":"2.72%"},{"v":-1.6609197272911367E-3,"d":"-0.17%"},{"v":-0.005713782228243468,"d":"-0.57%"},{"v":0.014800847186193062,"d":"1.48%"}]
[null,null,"WIELKOPOLSKIE",{"v":0.018100796002468198,"d":"1.81%"},{"v":0.010631589731480706,"d":"1.06%"},{"v":0.01090369729774948,"d":"1.09%"},{"v":-0.01816912577240631,"d":"-1.82%"},{"v":0.021466957259292072,"d":"2.15%"}]
[null,null,"ZACHODNIOPOMORSKIE",{"v":-0.022557342408191034,"d":"-2.26%"},{"v":-0.019859850712150053,"d":"-1.99%"},{"v":1.4797150150614876E-3,"d":"0.15%"},{"v":0.019565056509759524,"d":"1.96%"},{"v":-0.02137242159552008,"d":"-2.14%"}]
[null,null,"DOLNOŚLĄSKIE",{"v":-0.008523412684234942,"d":"-0.85%"},{"v":-0.010109702965096883,"d":"-1.01%"},{"v":0.002192825819098986,"d":"0.22%"},{"v":0.007703333956144084,"d":"0.77%"},{"v":-0.008736955874088754,"d":"-0.87%"}]
[null,null,"OPOLSKIE",{"v":-0.02565973920629511,"d":"-2.57%"},{"v":0.006956649936575568,"d":"0.70%"},{"v":-0.008120117657973512,"d":"-0.81%"},{"v":0.015646860387977732,"d":"1.56%"},{"v":-0.011176346539715325,"d":"-1.12%"}]
[null,null,"KUJAWSKO-POMORSKIE",{"v":-0.009295444597516437,"d":"-0.93%"},{"v":-0.004048297816796011,"d":"-0.40%"},{"v":0.008759678269054766,"d":"0.88%"},{"v":3.767745916305144E-3,"d":"0.38%"},{"v":-8.1631822895253739E-4,"d":"-0.08%"}]
[null,null,"POMORSKIE",{"v":1.2756983828961152E-3,"d":"0.13%"},{"v":0.01927820523455796,"d":"1.93%"},{"v":-0.02156802046731522,"d":"-2.16%"},{"v":3.0400016940547366E-4,"d":"0.03%"},{"v":-7.1011668045567206E-4,"d":"-0.07%"}]
[null,null,"WARMIŃSKO-MAZURSKIE",{"v":-0.01687815174579567,"d":"-1.69%"},{"v":3.7802176034078885E-3,"d":"0.38%"},{"v":0.021346662780208026,"d":"2.13%"},{"v":0.001119161762535164,"d":"0.11%"},{"v":0.009367890400355409,"d":"0.94%"}]
[]
[]
[null,null,"Nij/Ni(15+)","15-29","30-39","40-49","50 i więcej"]
[null,null,"ŁÓDZKIE",{"$f":"E137/$D137","v":0.2604166666666667},0.16826923076923078,0.15905448717948717,0.41225961538461536]
[null,null,"MAZOWIECKIE",0.28807796917497736,0.16659111514052583,0.1559383499546691,0.3893925657298277]
[null,null,"MAŁOPOLSKIE",0.2993484093522422,0.15293215791490994,0.15868148715983135,0.38903794557301646]
[null,null,"ŚLĄSKIE",0.2607786778155213,0.16461980663705253,0.17533315913247974,0.39926835641494646]
[null,null,"LUBELSKIE",0.2766964755391899,0.16307206733298263,0.165176223040505,0.39505523408732246]
[null,null,"PODKARPACKIE",0.2961194029850746,0.17313432835820897,0.1653731343283582,0.3653731343283582]
[null,null,"PODLASKIE",0.2754098360655738,0.17158469945355193,0.16830601092896175,0.3846994535519126]
[null,null,"ŚWIĘTOKRZYSKIE",0.2771599657827203,0.16595380667236956,0.15996578272027373,0.39692044482463645]
[null,null,"LUBUSKIE",0.2701212789415656,0.18302094818081588,0.1631753031973539,0.3836824696802646]
[null,null,"WIELKOPOLSKIE",0.2949010654490107,0.17275494672754946,0.17123287671232876,0.3611111111111111]
[null,null,"ZACHODNIOPOMORSKIE",0.25141015310233683,0.15390813859790492,0.1651893634165995,0.42949234488315874]
[null,null,"DOLNOŚLĄSKIE",0.266421868625051,0.1599347205222358,0.1656466748266014,0.4079967360261118]
[null,null,"OPOLSKIE",0.2480916030534351,0.17048346055979643,0.15903307888040713,0.4223918575063613]
[null,null,"KUJAWSKO-POMORSKIE",0.2655960469425571,0.16368128474366894,0.169857936998147,0.40086473131562694]
[null,null,"POMORSKIE",0.27690371302706107,0.17809943360604152,0.15040906230333542,0.394587791063562]
[null,null,"WARMIŃSKO-MAZURSKIE",0.25748502994011974,0.16852010265183917,0.17792985457656116,0.3960650128314799]
[null,null,"POLSKA",0.27553913292772275,0.16618354410218839,0.16424043576593508,0.3940368872041538]
[]
[null,null,"Azij/Nij","Ogółem","15-29","30-39","40-49","50 i więcej"]
[null,null,"ŁÓDZKIE",{"$f":"D118/D137","v":0.5484775641025641},0.5246153846153846,0.8833333333333333,0.8639798488664987,0.3051506316812439]
[null,null,"MAZOWIECKIE",0.570716228467815,0.5373721479150275,0.891156462585034,0.876453488372093,0.3358556461001164]
[null,null,"MAŁOPOLSKIE",0.5346876197776926,0.5083226632522407,0.9047619047619048,0.8357487922705314,0.28669950738916256]
[null,null,"ŚLĄSKIE",0.501959759602822,0.49298597194388777,0.8587301587301587,0.7764530551415797,0.24018324607329844]
[null,null,"LUBELSKIE",0.5649658074697528,0.5171102661596958,0.8774193548387097,0.856687898089172,0.34753661784287615]
[null,null,"PODKARPACKIE",0.5444776119402985,0.4737903225806452,0.8620689655172413,0.8375451263537906,0.31862745098039214]
[null,null,"PODLASKIE",0.5431693989071038,0.47619047619047616,0.8726114649681529,0.8896103896103896,0.29261363636363635]
[null,null,"ŚWIĘTOKRZYSKIE",0.562874251497006,0.5123456790123457,0.8814432989690721,0.8823529411764706,0.33620689655172414]
[null,null,"LUBUSKIE",0.5336273428886439,0.4775510204081633,0.8493975903614458,0.8378378378378378,0.29310344827586204]
[null,null,"WIELKOPOLSKIE",0.5441400304414004,0.5019354838709678,0.8634361233480177,0.8466666666666667,0.28240252897787144]
[null,null,"ZACHODNIOPOMORSKIE",{"$f":"D128/D147","v":0.4931506849315068},0.44551282051282054,0.837696335078534,0.8,0.2795497185741088]
[null,null,"DOLNOŚLĄSKIE",0.5324357405140759,0.5130168453292496,0.8571428571428571,0.8251231527093597,0.299]
[null,null,"OPOLSKIE",0.5114503816793893,0.48205128205128206,0.835820895522388,0.824,0.28012048192771083]
[null,null,"KUJAWSKO-POMORSKIE",0.515750463248919,0.4813953488372093,0.8490566037735849,0.8254545454545454,0.2711864406779661]
[null,null,"POMORSKIE",0.5311516677155443,0.5022727272727273,0.8480565371024735,0.8284518828451883,0.29505582137161085]
[null,null,"WARMIŃSKO-MAZURSKIE",0.5149700598802395,0.44518272425249167,0.8578680203045685,0.8173076923076923,0.2786177105831533]
[null,null,"POLSKA",0.5370624024464052,0.5020809248554914,0.8688901667625072,0.8374709076803724,0.2963621665319321]
[]
[null,null,"Azi","Ogółem","15-29","30-39","40-49","50 i więcej"]
[null,null,"ŁÓDZKIE",1369,341,371,343,314]
[null,null,"MAZOWIECKIE",2518,683,655,603,577]
[null,null,"MAŁOPOLSKIE",1395,397,361,346,291]
[null,null,"ŚLĄSKIE",1921,492,541,521,367]
[null,null,"LUBELSKIE",1074,272,272,269,261]
[null,null,"PODKARPACKIE",912,235,250,232,195]
[null,null,"PODLASKIE",497,120,137,137,103]
[null,null,"ŚWIĘTOKRZYSKIE",658,166,171,165,156]
[null,null,"LUBUSKIE",484,117,141,124,102]
[null,null,"WIELKOPOLSKIE",1430,389,392,381,268]
[null,null,"ZACHODNIOPOMORSKIE",612,139,160,164,149]
[null,null,"DOLNOŚLĄSKIE",1305,335,336,335,299]
[null,null,"OPOLSKIE",402,94,112,103,93]
[null,null,"KUJAWSKO-POMORSKIE",835,207,225,227,176]
[null,null,"POMORSKIE",844,221,240,198,185]
[null,null,"WARMIŃSKO-MAZURSKIE",602,134,169,170,129]
[null,null,"POLSKA",16860,4343,4533,4318,3666]
[]
[null,null,"Ni","Ogółem","15-29","30-39","40-49","50 i więcej"]
[null,null,"ŁÓDZKIE",2496,650,420,397,1029]
[null,null,"MAZOWIECKIE",4412,1271,735,688,1718]
[null,null,"MAŁOPOLSKIE",2609,781,399,414,1015]
[null,null,"ŚLĄSKIE",3827,998,630,671,1528]
[null,null,"LUBELSKIE",1901,526,310,314,751]
[null,null,"PODKARPACKIE",1675,496,290,277,612]
[null,null,"PODLASKIE",915,252,157,154,352]
[null,null,"ŚWIĘTOKRZYSKIE",1169,324,194,187,464]
[null,null,"LUBUSKIE",907,245,166,148,348]
[null,null,"WIELKOPOLSKIE",2628,775,454,450,949]
[null,null,"ZACHODNIOPOMORSKIE",1241,312,191,205,533]
[null,null,"DOLNOŚLĄSKIE",2451,653,392,406,1000]
[null,null,"OPOLSKIE",786,195,134,125,332]
[null,null,"KUJAWSKO-POMORSKIE",1619,430,265,275,649]
[null,null,"POMORSKIE",1589,440,283,239,627]
[null,null,"WARMIŃSKO-MAZURSKIE",1169,301,197,208,463]
[null,null,"POLSKA",31393,8650,5217,5156,12370]

{"sheet":"2002akt","index":10,"n_rows":153,"n_cols":8,"rows_kept":153,"hidden":true,"merged":[[0,1,0,7],[1,1,1,7]]}
[null,"Poddekompozycja różnic we współczynniku AKTYWNOŚCI ZAWODOWEJ"]
[null,2002]
[]
[null,null,"Sekcje","15-29","30-39","40-49","50 i więcej"]
[null,"ŁÓDZKIE","Poziom uczestnictwa w rynku pracy",{"$f":"D41","v":{"v":0.00436769376662966,"d":"0.4%"}},{"$f":"E41","v":{"v":0.011490166011553,"d":"1.1%"}},{"$f":"F41","v":{"v":0.015300920869629671,"d":"1.5%"}},{"$f":"G41","v":{"v":0.006482303792983105,"d":"0.6%"}}]
[null,null,"Profil struktury wiekowej",{"$f":"D61","v":{"v":-0.014058855836925281,"d":"-1.4%"}},{"$f":"E61","v":{"v":-0.022272224151512646,"d":"-2.2%"}},{"$f":"F61","v":{"v":-7.51457001773143E-3,"d":"-0.8%"}},{"$f":"G61","v":{"v":0.017808824505477695,"d":"1.8%"}}]
[null,"MAZOWIECKIE","Poziom uczestnictwa w rynku pracy",{"$f":"D42","v":{"v":0.008702507502730319,"d":"0.9%"}},{"$f":"E42","v":{"v":7.208774412833803E-3,"d":"0.7%"}},{"$f":"F42","v":{"v":0.014406608386193356,"d":"1.4%"}},{"$f":"G42","v":{"v":0.0216498192219744,"d":"2.2%"}}]
[null,null,"Profil struktury wiekowej",{"$f":"D62","v":{"v":-1.2333233357014425E-3,"d":"-0.1%"}},{"$f":"E62","v":{"v":-0.009353718404056783,"d":"-0.9%"}},{"$f":"F62","v":{"v":0.01292321083057175,"d":"1.3%"}},{"$f":"G62","v":{"v":-7.0308965385401125E-4,"d":"-0.1%"}}]
[null,"MAŁOPOLSKIE","Poziom uczestnictwa w rynku pracy",{"$f":"D43","v":{"v":0.015234724391510196,"d":"1.5%"}},{"$f":"E43","v":{"v":0.004117299204625361,"d":"0.4%"}},{"$f":"F43","v":{"v":-4.560402102014794E-3,"d":"-0.5%"}},{"$f":"G43","v":{"v":0.007920781326199843,"d":"0.8%"}}]
[null,null,"Profil struktury wiekowej",{"$f":"D63","v":{"v":0.008102359999127017,"d":"0.8%"}},{"$f":"E63","v":{"v":0.010485195252214337,"d":"1.0%"}},{"$f":"F63","v":{"v":-0.016284169435133215,"d":"-1.6%"}},{"$f":"G63","v":{"v":-2.3489091765304844E-3,"d":"-0.2%"}}]
[null,"ŚLĄSKIE","Poziom uczestnictwa w rynku pracy",{"$f":"D44","v":{"v":-0.010781423472990001,"d":"-1.1%"}},{"$f":"E44","v":{"v":-0.010562911205127456,"d":"-1.1%"}},{"$f":"F44","v":{"v":-0.024434749187217893,"d":"-2.4%"}},{"$f":"G44","v":{"v":-0.03858453937781698,"d":"-3.9%"}}]
[null,null,"Profil struktury wiekowej",{"$f":"D64","v":{"v":-0.008533368147424223,"d":"-0.9%"}},{"$f":"E64","v":{"v":0.009629388845332702,"d":"1.0%"}},{"$f":"F64","v":{"v":-0.008517569845444349,"d":"-0.9%"}},{"$f":"G64","v":{"v":0.004550705574686124,"d":"0.5%"}}]
[null,"LUBELSKIE","Poziom uczestnictwa w rynku pracy",{"$f":"D45","v":{"v":0.01043303843704487,"d":"1.0%"}},{"$f":"E45","v":{"v":0.005282659895598942,"d":"0.5%"}},{"$f":"F45","v":{"v":0.008011217307809935,"d":"0.8%"}},{"$f":"G45","v":{"v":0.03667007669104003,"d":"3.7%"}}]
[null,null,"Profil struktury wiekowej",{"$f":"D65","v":{"v":-0.002569680574277121,"d":"-0.3%"}},{"$f":"E65","v":{"v":0.014791018846629207,"d":"1.5%"}},{"$f":"F65","v":{"v":-0.01708336272407277,"d":"-1.7%"}},{"$f":"G65","v":{"v":0.002479660874618397,"d":"0.2%"}}]
[null,"PODKARPACKIE","Poziom uczestnictwa w rynku pracy",{"$f":"D46","v":{"v":-0.008125732131839918,"d":"-0.8%"}},{"$f":"E46","v":{"v":1.4029417558821282E-3,"d":"0.1%"}},{"$f":"F46","v":{"v":0.004768737359694896,"d":"0.5%"}},{"$f":"G46","v":{"v":0.030591413566041264,"d":"3.1%"}}]
[null,null,"Profil struktury wiekowej",{"$f":"D66","v":{"v":2.0511897942545564E-3,"d":"0.2%"}},{"$f":"E66","v":{"v":0.01987715261111677,"d":"2.0%"}},{"$f":"F66","v":{"v":-0.008483851190177092,"d":"-0.8%"}},{"$f":"G66","v":{"v":-0.004760338259478199,"d":"-0.5%"}}]
[null,"PODLASKIE","Poziom uczestnictwa w rynku pracy",{"$f":"D47","v":{"v":-0.015729894519184412,"d":"-1.6%"}},{"$f":"E47","v":{"v":6.7594367136573985E-3,"d":"0.7%"}},{"$f":"F47","v":{"v":0.00986920074354538,"d":"1.0%"}},{"$f":"G47","v":{"v":0.03038808623512038,"d":"3.0%"}}]
[null,null,"Profil struktury wiekowej",{"$f":"D67","v":{"v":-0.00319996445062079,"d":"-0.3%"}},{"$f":"E67","v":{"v":0.004603834741706628,"d":"0.5%"}},{"$f":"F67","v":{"v":-7.669349831137642E-3,"d":"-0.8%"}},{"$f":"G67","v":{"v":0.002929264672997584,"d":"0.3%"}}]
[null,"ŚWIĘTOKRZYSKIE","Poziom uczestnictwa w rynku pracy",{"$f":"D48","v":{"v":-0.019854758090013868,"d":"-2.0%"}},{"$f":"E48","v":{"v":-0.00490400340914724,"d":"-0.5%"}},{"$f":"F48","v":{"v":-0.005144845233324193,"d":"-0.5%"}},{"$f":"G48","v":{"v":-0.020164557330278002,"d":"-2.0%"}}]
[null,null,"Profil struktury wiekowej",{"$f":"D68","v":{"v":-5.3277223674019734E-3,"d":"-0.5%"}},{"$f":"E68","v":{"v":-0.01713187211315767,"d":"-1.7%"}},{"$f":"F68","v":{"v":-6.5113002363408577E-4,"d":"-0.1%"}},{"$f":"G68","v":{"v":0.008852594761644118,"d":"0.9%"}}]
[null,"LUBUSKIE","Poziom uczestnictwa w rynku pracy",{"$f":"D49","v":{"v":-0.006491639273478233,"d":"-0.6%"}},{"$f":"E49","v":{"v":-0.005889287241006465,"d":"-0.6%"}},{"$f":"F49","v":{"v":-0.011168442227893649,"d":"-1.1%"}},{"$f":"G49","v":{"v":-0.011011691962780424,"d":"-1.1%"}}]
[null,null,"Profil struktury wiekowej",{"$f":"D69","v":{"v":0.010422296282604108,"d":"1.0%"}},{"$f":"E69","v":{"v":8.6260746363516611E-4,"d":"0.1%"}},{"$f":"F69","v":{"v":0.015349165863597794,"d":"1.5%"}},{"$f":"G69","v":{"v":-0.011431558533963364,"d":"-1.1%"}}]
[null,"WIELKOPOLSKIE","Poziom uczestnictwa w rynku pracy",{"$f":"D50","v":{"v":0.015136990534820425,"d":"1.5%"}},{"$f":"E50","v":{"v":-0.003061989604081373,"d":"-0.3%"}},{"$f":"F50","v":{"v":-3.5026286397769977E-3,"d":"-0.4%"}},{"$f":"G50","v":{"v":0.005794295141800315,"d":"0.6%"}}]
[null,null,"Profil struktury wiekowej",{"$f":"D70","v":{"v":0.018492790495674247,"d":"1.8%"}},{"$f":"E70","v":{"v":1.4454482901734768E-3,"d":"0.1%"}},{"$f":"F70","v":{"v":0.003536251670485827,"d":"0.4%"}},{"$f":"G70","v":{"v":-0.012047643113831191,"d":"-1.2%"}}]
[null,"ZACHODNIOPOMORSKIE","Poziom uczestnictwa w rynku pracy",{"$f":"D51","v":{"v":-0.01837588603303145,"d":"-1.8%"}},{"$f":"E51","v":{"v":-0.009423591685280563,"d":"-0.9%"}},{"$f":"F51","v":{"v":1.8827610185247797E-3,"d":"0.2%"}},{"$f":"G51","v":{"v":-0.011677289872282287,"d":"-1.2%"}}]
[null,null,"Profil struktury wiekowej",{"$f":"D71","v":{"v":0.006069406238698228,"d":"0.6%"}},{"$f":"E71","v":{"v":-0.01278224218982412,"d":"-1.3%"}},{"$f":"F71","v":{"v":0.013301187664278808,"d":"1.3%"}},{"$f":"G71","v":{"v":-3.7898233346053472E-3,"d":"-0.4%"}}]
[null,"DOLNOŚLĄSKIE","Poziom uczestnictwa w rynku pracy",{"$f":"D52","v":{"v":2.5185961297910582E-3,"d":"0.3%"}},{"$f":"E52","v":{"v":0.001930731675423958,"d":"0.2%"}},{"$f":"F52","v":{"v":1.3248322703241036E-3,"d":"0.1%"}},{"$f":"G52","v":{"v":-0.01740088698942736,"d":"-1.7%"}}]
[null,null,"Profil struktury wiekowej",{"$f":"D72","v":{"v":-6.1761223415863565E-3,"d":"-0.6%"}},{"$f":"E72","v":{"v":-0.01365554541827428,"d":"-1.4%"}},{"$f":"F72","v":{"v":0.01067707644755541,"d":"1.1%"}},{"$f":"G72","v":{"v":0.004258070939219684,"d":"0.4%"}}]
[null,"OPOLSKIE","Poziom uczestnictwa w rynku pracy",{"$f":"D53","v":{"v":-0.014149361175116245,"d":"-1.4%"}},{"$f":"E53","v":{"v":-0.005026079728464069,"d":"-0.5%"}},{"$f":"F53","v":{"v":0.006299960542854093,"d":"0.6%"}},{"$f":"G53","v":{"v":-0.01583216127956064,"d":"-1.6%"}}]
[null,null,"Profil struktury wiekowej",{"$f":"D73","v":{"v":-0.019751440799639332,"d":"-2.0%"}},{"$f":"E73","v":{"v":0.00764993183872385,"d":"0.8%"}},{"$f":"F73","v":{"v":-0.004804708894399821,"d":"-0.5%"}},{"$f":"G73","v":{"v":0.010193532543335842,"d":"1.0%"}}]
[null,"KUJAWSKO-POMORSKIE","Poziom uczestnictwa w rynku pracy",{"$f":"D54","v":{"v":0.010481383081387895,"d":"1.0%"}},{"$f":"E54","v":{"v":-2.2123548077555662E-4,"d":"-0.0%"}},{"$f":"F54","v":{"v":1.1943775628086603E-3,"d":"0.1%"}},{"$f":"G54","v":{"v":-0.018660470960714257,"d":"-1.9%"}}]
[null,null,"Profil struktury wiekowej",{"$f":"D74","v":{"v":0.004256157017188473,"d":"0.4%"}},{"$f":"E74","v":{"v":0.005493365657320558,"d":"0.5%"}},{"$f":"F74","v":{"v":3.084610767240582E-3,"d":"0.3%"}},{"$f":"G74","v":{"v":-0.005260099883967443,"d":"-0.5%"}}]
[null,"POMORSKIE","Poziom uczestnictwa w rynku pracy",{"$f":"D55","v":{"v":-5.6459021066559015E-3,"d":"-0.6%"}},{"$f":"E55","v":{"v":-0.003539041316567401,"d":"-0.4%"}},{"$f":"F55","v":{"v":-3.8491622396248605E-3,"d":"-0.4%"}},{"$f":"G55","v":{"v":0.009992359071462996,"d":"1.0%"}}]
[null,null,"Profil struktury wiekowej",{"$f":"D75","v":{"v":0.009708784583622562,"d":"1.0%"}},{"$f":"E75","v":{"v":0.00367788665550479,"d":"0.4%"}},{"$f":"F75","v":{"v":-2.2672140427668468E-4,"d":"-0.0%"}},{"$f":"G75","v":{"v":-0.006565572044148445,"d":"-0.7%"}}]
[null,"WARMIŃSKO-MAZURSKIE","Poziom uczestnictwa w rynku pracy",{"$f":"D56","v":{"v":-0.02375459538440646,"d":"-2.4%"}},{"$f":"E56","v":{"v":-0.003757106879243922,"d":"-0.4%"}},{"$f":"F56","v":{"v":-0.004618165821690213,"d":"-0.5%"}},{"$f":"G56","v":{"v":-0.018131053906224538,"d":"-1.8%"}}]
[null,null,"Profil struktury wiekowej",{"$f":"D76","v":{"v":-4.9101099690469665E-4,"d":"-0.0%"}},{"$f":"E76","v":{"v":0.003457546417278761,"d":"0.3%"}},{"$f":"F76","v":{"v":0.02468939533861072,"d":"2.5%"}},{"$f":"G76","v":{"v":-0.009415876841336712,"d":"-0.9%"}}]
[]
[]
[]
[null,null,"Poziom uczestnictwa w rynku pracy","15-29","30-39","40-49","50 i więcej","SUMA (*)"]
[null,null,"ŁÓDZKIE",{"$f":"D80*(E99-E$115)/$D$115","v":{"v":0.00436769376662966,"d":"0.44%"}},{"v":0.011490166011553,"d":"1.15%"},{"v":0.015300920869629671,"d":"1.53%"},{"v":0.006482303792983105,"d":"0.65%"},{"$f":"SUM(D41:G41)","v":{"v":0.03764108444079543,"d":"3.76%"}}]
[null,null,"MAZOWIECKIE",{"v":0.008702507502730319,"d":"0.87%"},{"v":7.208774412833803E-3,"d":"0.72%"},{"v":0.014406608386193356,"d":"1.44%"},{"v":0.0216498192219744,"d":"2.16%"},{"v":0.05196770952373188,"d":"5.20%"}]
[null,null,"MAŁOPOLSKIE",{"v":0.015234724391510196,"d":"1.52%"},{"v":0.004117299204625361,"d":"0.41%"},{"v":-4.560402102014794E-3,"d":"-0.46%"},{"v":0.007920781326199843,"d":"0.79%"},{"v":0.022712402820320606,"d":"2.27%"}]
[null,null,"ŚLĄSKIE",{"v":-0.010781423472990001,"d":"-1.08%"},{"v":-0.010562911205127456,"d":"-1.06%"},{"v":-0.024434749187217893,"d":"-2.44%"},{"v":-0.03858453937781698,"d":"-3.86%"},{"v":-0.08436362324315233,"d":"-8.44%"}]
[null,null,"LUBELSKIE",{"v":0.01043303843704487,"d":"1.04%"},{"v":0.005282659895598942,"d":"0.53%"},{"v":0.008011217307809935,"d":"0.80%"},{"v":0.03667007669104003,"d":"3.67%"},{"v":0.06039699233149377,"d":"6.04%"}]
[null,null,"PODKARPACKIE",{"v":-0.008125732131839918,"d":"-0.81%"},{"v":1.4029417558821282E-3,"d":"0.14%"},{"v":0.004768737359694896,"d":"0.48%"},{"v":0.030591413566041264,"d":"3.06%"},{"v":0.02863736054977837,"d":"2.86%"}]
[null,null,"PODLASKIE",{"v":-0.015729894519184412,"d":"-1.57%"},{"v":6.7594367136573985E-3,"d":"0.68%"},{"v":0.00986920074354538,"d":"0.99%"},{"v":0.03038808623512038,"d":"3.04%"},{"v":0.03128682917313874,"d":"3.13%"}]
[null,null,"ŚWIĘTOKRZYSKIE",{"v":-0.019854758090013868,"d":"-1.99%"},{"v":-0.00490400340914724,"d":"-0.49%"},{"v":-0.005144845233324193,"d":"-0.51%"},{"v":-0.020164557330278002,"d":"-2.02%"},{"v":-0.05006816406276331,"d":"-5.01%"}]
[null,null,"LUBUSKIE",{"v":-0.006491639273478233,"d":"-0.65%"},{"v":-0.005889287241006465,"d":"-0.59%"},{"v":-0.011168442227893649,"d":"-1.12%"},{"v":-0.011011691962780424,"d":"-1.10%"},{"v":-0.03456106070515877,"d":"-3.46%"}]
[null,null,"WIELKOPOLSKIE",{"v":0.015136990534820425,"d":"1.51%"},{"v":-0.003061989604081373,"d":"-0.31%"},{"v":-3.5026286397769977E-3,"d":"-0.35%"},{"v":0.005794295141800315,"d":"0.58%"},{"v":0.01436666743276237,"d":"1.44%"}]
[null,null,"ZACHODNIOPOMORSKIE",{"v":-0.01837588603303145,"d":"-1.84%"},{"v":-0.009423591685280563,"d":"-0.94%"},{"v":1.8827610185247797E-3,"d":"0.19%"},{"v":-0.011677289872282287,"d":"-1.17%"},{"v":-0.03759400657206952,"d":"-3.76%"}]
[null,null,"DOLNOŚLĄSKIE",{"v":2.5185961297910582E-3,"d":"0.25%"},{"v":0.001930731675423958,"d":"0.19%"},{"v":1.3248322703241036E-3,"d":"0.13%"},{"v":-0.01740088698942736,"d":"-1.74%"},{"v":-0.01162672691388824,"d":"-1.16%"}]
[null,null,"OPOLSKIE",{"v":-0.014149361175116245,"d":"-1.41%"},{"v":-0.005026079728464069,"d":"-0.50%"},{"v":0.006299960542854093,"d":"0.63%"},{"v":-0.01583216127956064,"d":"-1.58%"},{"v":-0.02870764164028686,"d":"-2.87%"}]
[null,null,"KUJAWSKO-POMORSKIE",{"v":0.010481383081387895,"d":"1.05%"},{"v":-2.2123548077555662E-4,"d":"-0.02%"},{"v":1.1943775628086603E-3,"d":"0.12%"},{"v":-0.018660470960714257,"d":"-1.87%"},{"v":-7.2059457972932575E-3,"d":"-0.72%"}]
[null,null,"POMORSKIE",{"v":-5.6459021066559015E-3,"d":"-0.56%"},{"v":-0.003539041316567401,"d":"-0.35%"},{"v":-3.8491622396248605E-3,"d":"-0.38%"},{"v":0.009992359071462996,"d":"1.00%"},{"v":-3.0417465913851662E-3,"d":"-0.30%"}]
[null,null,"WARMIŃSKO-MAZURSKIE",{"v":-0.02375459538440646,"d":"-2.38%"},{"v":-0.003757106879243922,"d":"-0.38%"},{"v":-0.004618165821690213,"d":"-0.46%"},{"v":-0.018131053906224538,"d":"-1.81%"},{"v":-0.050260921991565136,"d":"-5.03%"}]
[]
[]
[]
[null,null,"Profil struktury wiekowej","15-29","30-39","40-49","50 i więcej","SUMA (**)"]
[null,null,"ŁÓDZKIE",{"$f":"E$115*(D80-D$96)/$D$115","v":{"v":-0.014058855836925281,"d":"-1.41%"}},{"v":-0.022272224151512646,"d":"-2.23%"},{"v":-7.51457001773143E-3,"d":"-0.75%"},{"v":0.017808824505477695,"d":"1.78%"},{"$f":"SUM(D61:G61)","v":{"v":-0.026036825500691668,"d":"-2.60%"}}]
[null,null,"MAZOWIECKIE",{"v":-1.2333233357014425E-3,"d":"-0.12%"},{"v":-0.009353718404056783,"d":"-0.94%"},{"v":0.01292321083057175,"d":"1.29%"},{"v":-7.0308965385401125E-4,"d":"-0.07%"},{"v":1.6330794369595128E-3,"d":"0.16%"}]
[null,null,"MAŁOPOLSKIE",{"v":0.008102359999127017,"d":"0.81%"},{"v":0.010485195252214337,"d":"1.05%"},{"v":-0.016284169435133215,"d":"-1.63%"},{"v":-2.3489091765304844E-3,"d":"-0.23%"},{"v":-4.5523360322343581E-5,"d":"-0.00%"}]
[null,null,"ŚLĄSKIE",{"v":-0.008533368147424223,"d":"-0.85%"},{"v":0.009629388845332702,"d":"0.96%"},{"v":-0.008517569845444349,"d":"-0.85%"},{"v":0.004550705574686124,"d":"0.46%"},{"v":-2.8708435728497465E-3,"d":"-0.29%"}]
[null,null,"LUBELSKIE",{"v":-0.002569680574277121,"d":"-0.26%"},{"v":0.014791018846629207,"d":"1.48%"},{"v":-0.01708336272407277,"d":"-1.71%"},{"v":0.002479660874618397,"d":"0.25%"},{"v":-2.3823635771022876E-3,"d":"-0.24%"}]
[null,null,"PODKARPACKIE",{"v":2.0511897942545564E-3,"d":"0.21%"},{"v":0.01987715261111677,"d":"1.99%"},{"v":-0.008483851190177092,"d":"-0.85%"},{"v":-0.004760338259478199,"d":"-0.48%"},{"v":0.008684152955716036,"d":"0.87%"}]
[null,null,"PODLASKIE",{"v":-0.00319996445062079,"d":"-0.32%"},{"v":0.004603834741706628,"d":"0.46%"},{"v":-7.669349831137642E-3,"d":"-0.77%"},{"v":0.002929264672997584,"d":"0.29%"},{"v":-3.3362148670542206E-3,"d":"-0.33%"}]
[null,null,"ŚWIĘTOKRZYSKIE",{"v":-5.3277223674019734E-3,"d":"-0.53%"},{"v":-0.01713187211315767,"d":"-1.71%"},{"v":-6.5113002363408577E-4,"d":"-0.07%"},{"v":0.008852594761644118,"d":"0.89%"},{"v":-0.01425812974254961,"d":"-1.43%"}]
[null,null,"LUBUSKIE",{"v":0.010422296282604108,"d":"1.04%"},{"v":8.6260746363516611E-4,"d":"0.09%"},{"v":0.015349165863597794,"d":"1.53%"},{"v":-0.011431558533963364,"d":"-1.14%"},{"v":0.015202511075873702,"d":"1.52%"}]
[null,null,"WIELKOPOLSKIE",{"v":0.018492790495674247,"d":"1.85%"},{"v":1.4454482901734768E-3,"d":"0.14%"},{"v":0.003536251670485827,"d":"0.35%"},{"v":-0.012047643113831191,"d":"-1.20%"},{"v":0.01142684734250236,"d":"1.14%"}]
[null,null,"ZACHODNIOPOMORSKIE",{"v":0.006069406238698228,"d":"0.61%"},{"v":-0.01278224218982412,"d":"-1.28%"},{"v":0.013301187664278808,"d":"1.33%"},{"v":-3.7898233346053472E-3,"d":"-0.38%"},{"v":0.00279852837854757,"d":"0.28%"}]
[null,null,"DOLNOŚLĄSKIE",{"v":-6.1761223415863565E-3,"d":"-0.62%"},{"v":-0.01365554541827428,"d":"-1.37%"},{"v":0.01067707644755541,"d":"1.07%"},{"v":0.004258070939219684,"d":"0.43%"},{"v":-0.004896520373085543,"d":"-0.49%"}]
[null,null,"OPOLSKIE",{"v":-0.019751440799639332,"d":"-1.98%"},{"v":0.00764993183872385,"d":"0.76%"},{"v":-0.004804708894399821,"d":"-0.48%"},{"v":0.010193532543335842,"d":"1.02%"},{"v":-0.006712685311979464,"d":"-0.67%"}]
[null,null,"KUJAWSKO-POMORSKIE",{"v":0.004256157017188473,"d":"0.43%"},{"v":0.005493365657320558,"d":"0.55%"},{"v":3.084610767240582E-3,"d":"0.31%"},{"v":-0.005260099883967443,"d":"-0.53%"},{"v":0.00757403355778217,"d":"0.76%"}]
[null,null,"POMORSKIE",{"v":0.009708784583622562,"d":"0.97%"},{"v":0.00367788665550479,"d":"0.37%"},{"v":-2.2672140427668468E-4,"d":"-0.02%"},{"v":-0.006565572044148445,"d":"-0.66%"},{"v":6.5943777907022235E-3,"d":"0.66%"}]
[null,null,"WARMIŃSKO-MAZURSKIE",{"v":-4.9101099690469665E-4,"d":"-0.05%"},{"v":0.003457546417278761,"d":"0.35%"},{"v":0.02468939533861072,"d":"2.47%"},{"v":-0.009415876841336712,"d":"-0.94%"},{"v":0.01824005391764807,"d":"1.82%"}]
[]
[]
[null,null,"Nij/Ni(15+)","15-29","30-39","40-49","50 i więcej"]
[null,null,"ŁÓDZKIE",{"$f":"E137/$D137","v":0.26581231914014053},0.1455146754857379,0.1889210417527904,0.39975196362133114]
[null,null,"MAZOWIECKIE",0.27952952952952953,0.15365365365365366,0.20245245245245244,0.36436436436436437]
[null,null,"MAŁOPOLSKIE",0.28951426368542793,0.1661526599845798,0.1831148804934464,0.36121819583654585]
[null,null,"ŚLĄSKIE",0.2717219589257504,0.16561348077935756,0.18825697735650343,0.3744075829383886]
[null,null,"LUBELSKIE",0.27810026385224274,0.16886543535620052,0.18258575197889182,0.3704485488126649]
[null,null,"PODKARPACKIE",0.2830423940149626,0.17206982543640897,0.1882793017456359,0.3566084788029925]
[null,null,"PODLASKIE",0.27742616033755274,0.16244725738396623,0.18881856540084388,0.37130801687763715]
[null,null,"ŚWIĘTOKRZYSKIE",0.2751504729148753,0.14875322441960448,0.1934651762682717,0.3826311263972485]
[null,null,"LUBUSKIE",0.2919954904171364,0.1600901916572717,0.2040586245772266,0.3438556933483653]
[null,null,"WIELKOPOLSKIE",0.30062707488011803,0.16045739579490964,0.19623755071929178,0.34267797860568056]
[null,null,"ZACHODNIOPOMORSKIE",0.28733997155049784,0.1514935988620199,0.20270270270270271,0.3584637268847795]
[null,null,"DOLNOŚLĄSKIE",0.27424308907415534,0.1509433962264151,0.20096533567354102,0.37384817902588857]
[null,null,"OPOLSKIE",0.25972396486825594,0.164366373902133,0.19071518193224593,0.3851944792973651]
[null,null,"KUJAWSKO-POMORSKIE",0.2854006586169045,0.16300768386388584,0.1959385290889133,0.3556531284302964]
[null,null,"POMORSKIE",0.29123237277743713,0.1618638871857756,0.19374616799509503,0.35315757204169224]
[null,null,"WARMIŃSKO-MAZURSKIE",0.2803234501347709,0.16172506738544473,0.21024258760107817,0.3477088948787062]
[null,null,"POLSKA",0.2808485980104948,0.15954672761806651,0.1938962753114638,0.3657083990599749]
[]
[null,null,"Azij/Nij","Ogółem","15-29","30-39","40-49","50 i więcej"]
[null,null,"ŁÓDZKIE",{"$f":"D118/D137","v":0.5605622157916494},0.5272161741835147,0.9232954545454546,0.8818380743982495,0.2988624612202689]
[null,null,"MAZOWIECKIE",0.5838338338338338,0.5353625783348255,0.9055374592833876,0.8763906056860321,0.3228021978021978]
[null,null,"MAŁOPOLSKIE",0.566692367000771,0.5472703062583223,0.8932714617169374,0.8231578947368421,0.30202774813233724]
[null,null,"ŚLĄSKIE",0.5057925223802001,0.49612403100775193,0.8441971383147854,0.765034965034965,0.23277074542897327]
[null,null,"LUBELSKIE",0.5862796833773087,0.538899430740038,0.896875,0.861271676300578,0.34472934472934474]
[null,null,"PODKARPACKIE",0.5748129675810474,0.5022026431718062,0.8840579710144928,0.8509933774834437,0.3374125874125874]
[null,null,"PODLASKIE",0.569620253164557,0.4866920152091255,0.9025974025974026,0.8659217877094972,0.3352272727272727]
[null,null,"ŚWIĘTOKRZYSKIE",0.5184866723989682,0.478125,0.861271676300578,0.8222222222222222,0.2606741573033708]
[null,null,"LUBUSKIE",0.5434047350620068,0.5057915057915058,0.8591549295774648,0.8066298342541437,0.2721311475409836]
[null,null,"WIELKOPOLSKIE",0.5684249354481741,0.5460122699386503,0.8689655172413793,0.8270676691729323,0.2992465016146394]
[null,null,"ZACHODNIOPOMORSKIE",{"$f":"D128/D147","v":0.534850640113798},0.48267326732673266,0.8450704225352113,0.8421052631578947,0.2718253968253968]
[null,null,"DOLNOŚLĄSKIE",0.5449758666081614,0.5232,0.8866279069767442,0.8406113537117904,0.2640845070422535]
[null,null,"OPOLSKIE",0.534504391468005,0.48792270531400966,0.8625954198473282,0.8552631578947368,0.2671009771986971]
[null,null,"KUJAWSKO-POMORSKIE",0.5543358946212953,0.5384615384615384,0.8787878787878788,0.8403361344537815,0.26080246913580246]
[null,null,"POMORSKIE",0.5561005518087063,0.5073684210526316,0.8674242424242424,0.8259493670886076,0.3055555555555556]
[null,null,"WARMIŃSKO-MAZURSKIE",0.5363881401617251,0.47115384615384615,0.8666666666666667,0.8247863247863247,0.26098191214470284]
[null,null,"POLSKA",0.554131925441844,0.5181109582760202,0.8795399515738499,0.8369583264154076,0.2898767605633803]
[]
[null,null,"Azi","Ogółem","15-29","30-39","40-49","50 i więcej"]
[null,null,"ŁÓDZKIE",1356,339,325,403,289]
[null,null,"MAZOWIECKIE",2333,598,556,709,470]
[null,null,"MAŁOPOLSKIE",1470,411,385,391,283]
[null,null,"ŚLĄSKIE",1921,512,531,547,331]
[null,null,"LUBELSKIE",1111,284,287,298,242]
[null,null,"PODKARPACKIE",922,228,244,257,193]
[null,null,"PODLASKIE",540,128,139,155,118]
[null,null,"ŚWIĘTOKRZYSKIE",603,153,149,185,116]
[null,null,"LUBUSKIE",482,131,122,146,83]
[null,null,"WIELKOPOLSKIE",1541,445,378,440,278]
[null,null,"ZACHODNIOPOMORSKIE",752,195,180,240,137]
[null,null,"DOLNOŚLĄSKIE",1242,327,305,385,225]
[null,null,"OPOLSKIE",426,101,113,130,82]
[null,null,"KUJAWSKO-POMORSKIE",1010,280,261,300,169]
[null,null,"POMORSKIE",907,241,229,261,176]
[null,null,"WARMIŃSKO-MAZURSKIE",597,147,156,193,101]
[null,null,"POLSKA",17213,4520,4359,5041,3293]
[]
[null,null,"Ni","Ogółem","15-29","30-39","40-49","50 i więcej"]
[null,null,"ŁÓDZKIE",2419,643,352,457,967]
[null,null,"MAZOWIECKIE",3996,1117,614,809,1456]
[null,null,"MAŁOPOLSKIE",2594,751,431,475,937]
[null,null,"ŚLĄSKIE",3798,1032,629,715,1422]
[null,null,"LUBELSKIE",1895,527,320,346,702]
[null,null,"PODKARPACKIE",1604,454,276,302,572]
[null,null,"PODLASKIE",948,263,154,179,352]
[null,null,"ŚWIĘTOKRZYSKIE",1163,320,173,225,445]
[null,null,"LUBUSKIE",887,259,142,181,305]
[null,null,"WIELKOPOLSKIE",2711,815,435,532,929]
[null,null,"ZACHODNIOPOMORSKIE",1406,404,213,285,504]
[null,null,"DOLNOŚLĄSKIE",2279,625,344,458,852]
[null,null,"OPOLSKIE",797,207,131,152,307]
[null,null,"KUJAWSKO-POMORSKIE",1822,520,297,357,648]
[null,null,"POMORSKIE",1631,475,264,316,576]
[null,null,"WARMIŃSKO-MAZURSKIE",1113,312,180,234,387]
[null,null,"POLSKA",31063,8724,4956,6023,11360]

{"sheet":"2012","index":11,"n_rows":59,"n_cols":10,"rows_kept":59,"hidden":true,"merged":[[0,0,0,10],[1,0,1,10],[2,1,3,1],[21,1,22,1]]}
["DEKOMPOZYCJA RÓŻNIC W POZIOMIE WDB PER CAPITA"]
[2012]
[null,"Różnice względem średniej","WDB per capita","WDB na 1 pracującego","Współczynnik dojazdów netto","Udział pracujących wśród aktwnych zawodowo","Współczynnik aktywności zawodowej","Wskaźnik różnicy w metodologii BAEL/demo","Wskaźnik struktury wiekowej","Interakcje"]
[null,null,"WDB_i/N_i","WDB_i/Pp_i","Pp_i/Pz_i","Pz_i/Az_i","Az_i/NB15+_i","NB15+_i/N15+_i","Ni15+_i/N_i"]
[null,"ŁÓDZKIE",{"$f":"(C24-C$40)/C$40","v":{"v":-0.06661418444143814,"d":"-6.7%"}},{"v":-0.09354017707737187,"d":"-9.4%"},{"v":-0.11831932135196202,"d":"-11.8%"},{"v":-0.009827713462703742,"d":"-1.0%"},{"v":0.011621102158579913,"d":"1.2%"},{"v":0.15146328901506562,"d":"15.1%"},{"v":0.0125642039419553,"d":"1.3%"},{"$f":"C5-SUM(D5:I5)","v":{"v":-0.02057556766500135,"d":"-2.1%"}}]
[null,"MAZOWIECKIE",{"v":0.589300776910861,"d":"58.9%"},{"v":0.3081483530489184,"d":"30.8%"},{"v":0.06375314207131902,"d":"6.4%"},{"v":0.023222401265469192,"d":"2.3%"},{"v":0.07843390377178278,"d":"7.8%"},{"v":0.04010003125128493,"d":"4.0%"},{"v":-0.004893508504465788,"d":"-0.5%"},{"v":0.08053645400655252,"d":"8.1%"}]
[null,"MAŁOPOLSKIE",{"v":-0.11959928095177763,"d":"-12.0%"},{"v":-0.1292366191954662,"d":"-12.9%"},{"v":0.057100667156067986,"d":"5.7%"},{"v":-3.7199621324241054E-3,"d":"-0.4%"},{"v":-0.010053487942101053,"d":"-1.0%"},{"v":-0.020307050583406126,"d":"-2.0%"},{"v":-0.01012411596716719,"d":"-1.0%"},{"v":-3.258712287280946E-3,"d":"-0.3%"}]
[null,"ŚLĄSKIE",{"v":0.05919515654336704,"d":"5.9%"},{"v":0.06480108265293905,"d":"6.5%"},{"v":-0.02579992830597846,"d":"-2.6%"},{"v":0.00756648843179681,"d":"0.8%"},{"v":-0.04368599933254888,"d":"-4.4%"},{"v":0.04625243382812691,"d":"4.6%"},{"v":0.012858169066290706,"d":"1.3%"},{"v":-2.7970897972590877E-3,"d":"-0.3%"}]
[null,"LUBELSKIE",{"v":-0.2960722164221493,"d":"-29.6%"},{"v":-0.27482684011811737,"d":"-27.5%"},{"v":-0.10182149856665791,"d":"-10.2%"},{"v":-4.5041981105137605E-3,"d":"-0.5%"},{"v":0.012177119723923132,"d":"1.2%"},{"v":0.0727865339188149,"d":"7.3%"},{"v":-1.9692672564920608E-4,"d":"-0.0%"},{"v":3.1359345605086464E-4,"d":"0.0%"}]
[null,"PODKARPACKIE",{"v":-0.30083771316813596,"d":"-30.1%"},{"v":-0.2700127696667538,"d":"-27.0%"},{"v":0.02281382135468287,"d":"2.3%"},{"v":-0.03595129554004026,"d":"-3.6%"},{"v":0.007531913825349464,"d":"0.8%"},{"v":-0.027903143927370734,"d":"-2.8%"},{"v":-0.008257744481068807,"d":"-0.8%"},{"v":0.010941505267065332,"d":"1.1%"}]
[null,"PODLASKIE",{"v":-0.28266311748443057,"d":"-28.3%"},{"v":-0.21528527934070293,"d":"-21.5%"},{"v":-0.034075154357394506,"d":"-3.4%"},{"v":0.010872609292870877,"d":"1.1%"},{"v":-0.003382000053410005,"d":"-0.3%"},{"v":-0.06462541868981492,"d":"-6.5%"},{"v":0.004285759534994769,"d":"0.4%"},{"v":0.019546366129026105,"d":"2.0%"}]
[null,"ŚWIĘTOKRZYSKIE",{"v":-0.2489356127951809,"d":"-24.9%"},{"v":-0.23385338818848359,"d":"-23.4%"},{"v":-0.1347174608242522,"d":"-13.5%"},{"v":-0.03489869140986291,"d":"-3.5%"},{"v":0.024359449662217793,"d":"2.4%"},{"v":0.13431759373926638,"d":"13.4%"},{"v":0.01029311556222646,"d":"1.0%"},{"v":-0.014436231336292848,"d":"-1.4%"}]
[null,"LUBUSKIE",{"v":-0.16885345961389617,"d":"-16.9%"},{"v":-0.054318703556527584,"d":"-5.4%"},{"v":-0.10148414148621099,"d":"-10.1%"},{"v":0.009939332022355089,"d":"1.0%"},{"v":-0.03816317171801388,"d":"-3.8%"},{"v":9.718855981868257E-3,"d":"1.0%"},{"v":-2.736554246182079E-3,"d":"-0.3%"},{"v":0.008190923388814997,"d":"0.8%"}]
[null,"WIELKOPOLSKIE",{"v":0.06175590782751073,"d":"6.2%"},{"v":-0.0322822385354695,"d":"-3.2%"},{"v":0.1202405578469186,"d":"12.0%"},{"v":0.017274068372779176,"d":"1.7%"},{"v":0.0251806402771336,"d":"2.5%"},{"v":-0.04944658761905297,"d":"-4.9%"},{"v":-0.01201628417959351,"d":"-1.2%"},{"v":-0.007194248335204663,"d":"-0.7%"}]
[null,"ZACHODNIOPOMORSKIE",{"v":-0.1570558146502807,"d":"-15.7%"},{"v":0.006244591628616818,"d":"0.6%"},{"v":0.0381970338337518,"d":"3.8%"},{"v":-0.009437054841159987,"d":"-0.9%"},{"v":-0.06578315459887059,"d":"-6.6%"},{"v":-0.1325408136437248,"d":"-13.3%"},{"v":0.005163370291321338,"d":"0.5%"},{"v":1.1002126797847178E-3,"d":"0.1%"}]
[null,"DOLNOŚLĄSKIE",{"v":0.131604662336363,"d":"13.2%"},{"v":0.16259858773875716,"d":"16.3%"},{"v":0.05588511519392886,"d":"5.6%"},{"v":-0.012304107070318347,"d":"-1.2%"},{"v":-0.03653577525997202,"d":"-3.7%"},{"v":-0.04331349425472219,"d":"-4.3%"},{"v":0.012557699080597113,"d":"1.3%"},{"v":-7.283363091907552E-3,"d":"-0.7%"}]
[null,"OPOLSKIE",{"v":-0.19021756443818227,"d":"-19.0%"},{"v":-0.04566122211770934,"d":"-4.6%"},{"v":-0.039261902569699005,"d":"-3.9%"},{"v":6.2581892483759526E-3,"d":"0.6%"},{"v":-0.026980662436476503,"d":"-2.7%"},{"v":-0.11531780384760988,"d":"-11.5%"},{"v":0.019629946634231153,"d":"2.0%"},{"v":0.011115890650705368,"d":"1.1%"}]
[null,"KUJAWSKO-POMORSKIE",{"v":-0.18637749042980312,"d":"-18.6%"},{"v":-0.10743190413771805,"d":"-10.7%"},{"v":-0.022497512459156543,"d":"-2.2%"},{"v":-0.020340242550417713,"d":"-2.0%"},{"v":0.00776735256152981,"d":"0.8%"},{"v":-0.05248281240483188,"d":"-5.2%"},{"v":-3.1241508279255563E-3,"d":"-0.3%"},{"v":0.011731779388716834,"d":"1.2%"}]
[null,"POMORSKIE",{"v":-0.0226503995456356,"d":"-2.3%"},{"v":0.06705788897258265,"d":"6.7%"},{"v":-0.012003669473407662,"d":"-1.2%"},{"v":5.6449571108838515E-3,"d":"0.6%"},{"v":-6.155974267865896E-3,"d":"-0.6%"},{"v":-0.05817674503702131,"d":"-5.8%"},{"v":-0.015140437502619642,"d":"-1.5%"},{"v":-0.003876419348187589,"d":"-0.4%"}]
[null,"WARMIŃSKO-MAZURSKIE",{"v":-0.2824486662939615,"d":"-28.2%"},{"v":-0.11823839349291437,"d":"-11.8%"},{"v":-0.05414425721405546,"d":"-5.4%"},{"v":-0.012915725004252398,"d":"-1.3%"},{"v":-0.07828931093331676,"d":"-7.8%"},{"v":-0.04706573607352072,"d":"-4.7%"},{"v":-7.649515945872618E-3,"d":"-0.8%"},{"v":0.03585427236997085,"d":"3.6%"}]
[]
[null,"Wartości","WDB per capita","WDB na 1 pracującego","Współczynnik dojazdów netto","Udział pracujących wśród aktwnych zawodowo","Współczynnik aktywności zawodowej","Wskaźnik różnicy w metodologii BAEL/demo","Wskaźnik struktury wiekowej","Weryfikacja"]
[null,null,"WDB_i/N_i","WDB_i/Pp_i","Pp_i/Pz_i","Pz_i/Az_i","Az_i/NB15+_i","NB15+_i/N15+_i","Ni15+_i/N_i"]
[null,"ŁÓDZKIE",{"$f":"C43/I43*1000000","v":{"v":34684.001867980965,"d":"34,684.00"}},{"$f":"C43/D43*1000000","v":{"v":93385.61557083689,"d":"93,385.62"}},{"$f":"D43/E43/1000","v":{"v":0.7859775157423793,"d":"0.79"}},{"$f":"E43/F43","v":{"v":0.8902985074626866,"d":"0.89"}},{"$f":"F43/G43","v":{"v":0.5651623787431463,"d":"0.57"}},{"$f":"G43/H43*1000","v":{"v":1.0917146181554305,"d":"1.09"}},{"$f":"H43/I43","v":{"v":0.8602428612905308,"d":"0.86"}},{"$f":"IF(PRODUCT(D24:I24)-C24<0.0001,\"prawidłowo\",\"nieprawidłowo\")","v":"prawidłowo"}]
[null,"MAZOWIECKIE",{"$f":"C44/I44*1000000","v":{"v":59057.36962819893,"d":"59,057.37"}},{"$f":"C44/D44*1000000","v":{"v":134768.50944542856,"d":"134,768.51"}},{"$f":"D44/E44/1000","v":{"v":0.9482866895193997,"d":"0.95"}},{"$f":"E44/F44","v":{"v":0.9200150206533985,"d":"0.92"}},{"v":0.6024886877828054,"d":"0.60"},{"$f":"G44/H44*1000","v":{"v":0.9861299264106119,"d":"0.99"}},{"$f":"H44/I44","v":{"v":0.8454113351038146,"d":"0.85"}},"prawidłowo"]
[null,"MAŁOPOLSKIE",{"v":32715.11059525467,"d":"32,715.11"},{"v":89708.08443642993,"d":"89,708.08"},{"v":0.9423563160474017,"d":"0.94"},{"v":0.8957902001380262,"d":"0.90"},{"v":0.5530534351145038,"d":"0.55"},{"v":0.9288573282234363,"d":"0.93"},{"v":0.8409675746859717,"d":"0.84"},"prawidłowo"]
[null,"ŚLĄSKIE",{"v":39358.99407912268,"d":"39,358.99"},{"v":109698.30327772381,"d":"109,698.30"},{"v":0.8684542723111864,"d":"0.87"},{"v":0.9059382422802851,"d":"0.91"},{"v":0.5342639593908629,"d":"0.53"},{"v":0.991963084874275,"d":"0.99"},{"v":0.8604926048610555,"d":"0.86"},"prawidłowo"]
[null,"LUBELSKIE",{"v":26157.492596914275,"d":"26,157.49"},{"v":74709.03863413581,"d":"74,709.04"},{"v":0.8006845611409863,"d":"0.80"},{"v":0.8950850661625709,"d":"0.90"},{"v":0.5654730090860502,"d":"0.57"},{"v":1.0171203480062865,"d":"1.02"},{"v":0.8494014040120038,"d":"0.85"},"prawidłowo"]
[null,"PODKARPACKIE",{"v":25980.409877973718,"d":"25,980.41"},{"v":75204.9954555341,"d":"75,205.00"},{"v":0.9117911800086517,"d":"0.91"},{"v":0.8668098818474759,"d":"0.87"},{"v":0.5628778718258767,"d":"0.56"},{"v":0.9216553911546715,"d":"0.92"},{"v":0.8425531854958166,"d":"0.84"},"prawidłowo"]
[null,"PODLASKIE",{"v":26655.765877749876,"d":"26,655.77"},{"v":80843.14978240438,"d":"80,843.15"},{"v":0.8610772913115892,"d":"0.86"},{"v":0.9089108910891089,"d":"0.91"},{"v":0.5567805953693495,"d":"0.56"},{"v":0.8868386110171365,"d":"0.89"},{"v":0.8532097539814297,"d":"0.85"},"prawidłowo"]
[null,"ŚWIĘTOKRZYSKIE",{"v":27909.057727856074,"d":"27,909.06"},{"v":78930.21968789063,"d":"78,930.22"},{"v":0.7713593334034049,"d":"0.77"},{"v":0.8677563150074294,"d":"0.87"},{"v":0.5722789115646258,"d":"0.57"},{"v":1.0754586017026266,"d":"1.08"},{"v":0.858313415672746,"d":"0.86"},"prawidłowo"]
[null,"LUBUSKIE",{"v":30884.857771345538,"d":"30,884.86"},{"v":97426.30370252914,"d":"97,426.30"},{"v":0.8009852993633713,"d":"0.80"},{"v":0.9080717488789237,"d":"0.91"},{"v":0.5373493975903615,"d":"0.54"},{"v":0.9573252102943602,"d":"0.96"},{"v":0.8472438159436421,"d":"0.85"},"prawidłowo"]
[null,"WIELKOPOLSKIE",{"v":39454.14990947942,"d":"39,454.15"},{"v":99696.55197934921,"d":"99,696.55"},{"v":0.9986426061196045,"d":"1.00"},{"v":0.9146666666666666,"d":"0.91"},{"v":0.572737686139748,"d":"0.57"},{"v":0.9012298225516675,"d":"0.90"},{"v":0.8393600477847009,"d":"0.84"},"prawidłowo"]
[null,"ZACHODNIOPOMORSKIE",{"v":31323.25048434273,"d":"31,323.25"},{"v":103665.67632428269,"d":"103,665.68"},{"v":0.9255046019098504,"d":"0.93"},{"v":0.8906497622820919,"d":"0.89"},{"v":0.52191894127378,"d":"0.52"},{"v":0.8224473011279569,"d":"0.82"},{"v":0.853955344616752,"d":"0.85"},"prawidłowo"]
[null,"DOLNOŚLĄSKIE",{"v":42049.683601419456,"d":"42,049.68"},{"v":119773.63147515537,"d":"119,773.63"},{"v":0.9412727077359176,"d":"0.94"},{"v":0.8880718954248366,"d":"0.89"},{"v":0.5382585751978892,"d":"0.54"},{"v":0.9070446737451252,"d":"0.91"},{"v":0.8602373349638789,"d":"0.86"},"prawidłowo"]
[null,"OPOLSKIE",{"v":30090.98171357638,"d":"30,090.98"},{"v":98318.21773226562,"d":"98,318.22"},{"v":0.8564535453529736,"d":"0.86"},{"v":0.9047619047619048,"d":"0.90"},{"v":0.5435967302452316,"d":"0.54"},{"v":0.838776620301594,"d":"0.84"},{"v":0.8662456951721584,"d":"0.87"},"prawidłowo"]
[null,"KUJAWSKO-POMORSKIE",{"v":30233.676333378487,"d":"30,233.68"},{"v":91954.45728884074,"d":"91,954.46"},{"v":0.8713982231837557,"d":"0.87"},{"v":0.8808463251670379,"d":"0.88"},{"v":0.5630094043887147,"d":"0.56"},{"v":0.8983511454681141,"d":"0.90"},{"v":0.8469145260169318,"d":"0.85"},"prawidłowo"]
[null,"POMORSKIE",{"v":36317.66714554577,"d":"36,317.67"},{"v":109930.80475440764,"d":"109,930.80"},{"v":0.8807529984899094,"d":"0.88"},{"v":0.9042105263157895,"d":"0.90"},{"v":0.5552308591466978,"d":"0.56"},{"v":0.8929526672459638,"d":"0.89"},{"v":0.8367058648862262,"d":"0.84"},"prawidłowo"]
[null,"WARMIŃSKO-MAZURSKIE",{"v":26663.734742678866,"d":"26,663.73"},{"v":90841.14742658903,"d":"90,841.15"},{"v":0.8431866150288286,"d":"0.84"},{"v":0.8875219683655536,"d":"0.89"},{"v":0.5149321266968325,"d":"0.51"},{"v":0.903487133280296,"d":"0.90"},{"v":0.8430699174258994,"d":"0.84"},"prawidłowo"]
[null,"POLSKA",{"v":37159.34106757898,"d":"37,159.34"},{"v":103022.34385826488,"d":"103,022.34"},{"v":0.8914537142263238,"d":"0.89"},{"v":0.8991349480968858,"d":"0.90"},{"v":0.5586700173980282,"d":"0.56"},{"v":0.9481106593413475,"d":"0.95"},{"v":0.8495687067956471,"d":"0.85"},"prawidłowo"]
[]
[null,"Dane","WDB_i","PP_i","PZ_i","AZ_i","NB15+_i","N15+_i","N_i"]
[null,"ŁÓDZKIE",87565,937671.1762806585,1193,1340,2371,2171813,2524651]
[null,"MAZOWIECKIE",313108,2323302.389322529,2450,2663,4420,4482168,5301760]
[null,"MAŁOPOLSKIE",109729,1223178.4982295274,1298,1449,2620,2820670,3354077]
[null,"ŚLĄSKIE",181676,1656142.2972974326,1907,2105,3940,3971922,4615870]
[null,"LUBELSKIE",56648,758248.279400514,947,1058,1871,1839507,2165651]
[null,"PODKARPACKIE",55337,735815.4822669819,807,931,1654,1794597,2129951]
[null,"PODLASKIE",31952,395234.4767120194,459,505,907,1022734,1198690]
[null,"ŚWIĘTOKRZYSKIE",35556,450473.8507075884,584,673,1176,1093487,1273995]
[null,"LUBUSKIE",31605,324399.0462421654,405,446,830,866999,1023317]
[null,"WIELKOPOLSKIE",136598,1370137.6555960975,1372,1500,2619,2906029,3462196]
[null,"ZACHODNIOPOMORSKIE",53920,520133.5862733359,562,631,1209,1470003,1721405]
[null,"DOLNOŚLĄSKIE",122548,1023163.4333089425,1087,1224,2274,2507043,2914362]
[null,"OPOLSKIE",30398,309179.72987242346,361,399,734,875084,1010203]
[null,"KUJAWSKO-POMORSKIE",63382,689275.9945383507,791,898,1595,1775475,2096404]
[null,"POMORSKIE",83170,756566.8257028322,859,950,1711,1916115,2290070]
[null,"WARMIŃSKO-MAZURSKIE",38681,425809.2405895585,505,569,1105,1223039,1450697]
[null,"POLSKA",1431872,13898654.858502613,15591,17340,31038,32736685,38533299]

{"sheet":"2007","index":12,"n_rows":59,"n_cols":10,"rows_kept":59,"hidden":true,"merged":[[0,0,0,10],[1,0,1,10],[2,1,3,1],[21,1,22,1]]}
["DEKOMPOZYCJA RÓŻNIC W POZIOMIE WDB PER CAPITA"]
[2007]
[null,"Różnice względem średniej","WDB per capita","WDB na 1 pracującego","Współczynnik dojazdów netto","Udział pracujących wśród aktwnych zawodowo","Współczynnik aktywności zawodowej","Wskaźnik różnicy w metodologii BAEL/demo","Wskaźnik struktury wiekowej","Interakcje"]
[null,null,"WDB_i/N_i","WDB_i/Pp_i","Pp_i/Pz_i","Pz_i/Az_i","Az_i/NB15+_i","NB15+_i/N15+_i","Ni15+_i/N_i"]
[null,"ŁÓDZKIE",{"$f":"(C24-C$40)/C$40","v":{"v":-0.07285009497820537,"d":"-7.3%"}},{"$f":"(D24-D$40)/D$40","v":{"v":-0.12090113393668189,"d":"-12.1%"}},{"$f":"(E24-E$40)/E$40","v":{"v":-0.131508216416094,"d":"-13.2%"}},{"$f":"(F24-F$40)/F$40","v":{"v":0.002861448381771925,"d":"0.3%"}},{"$f":"(G24-G$40)/G$40","v":{"v":0.021254814345895313,"d":"2.1%"}},{"$f":"(H24-H$40)/H$40","v":{"v":0.16908030575852165,"d":"16.9%"}},{"$f":"(I24-I$40)/I$40","v":{"v":0.014208220090370836,"d":"1.4%"}},{"$f":"C5-SUM(D5:I5)","v":{"v":-0.027845533201989216,"d":"-2.8%"}}]
[null,"MAZOWIECKIE",{"$f":"(C25-C$40)/C$40","v":{"v":0.542464313871681,"d":"54.2%"}},{"v":0.2892186138249086,"d":"28.9%"},{"v":0.08386609551752842,"d":"8.4%"},{"v":0.00612597174360351,"d":"0.6%"},{"v":0.0626627853078361,"d":"6.3%"},{"v":0.029345625757364328,"d":"2.9%"},{"v":0.003006786634500953,"d":"0.3%"},{"$f":"C6-SUM(D6:I6)","v":{"v":0.06823843508593913,"d":"6.8%"}}]
[null,"MAŁOPOLSKIE",{"v":-0.11017214304501045,"d":"-11.0%"},{"v":-0.09828153284968426,"d":"-9.8%"},{"v":0.014735309616695641,"d":"1.5%"},{"v":0.011133688934044523,"d":"1.1%"},{"v":-0.004421800256162207,"d":"-0.4%"},{"v":-0.022998130438234076,"d":"-2.3%"},{"v":-0.011212637039662498,"d":"-1.1%"},{"v":8.7295898799241711E-4,"d":"0.1%"}]
[null,"ŚLĄSKIE",{"v":0.05800584898234423,"d":"5.8%"},{"v":0.07953432759654065,"d":"8.0%"},{"v":0.03271328041873279,"d":"3.3%"},{"v":0.01703509081146219,"d":"1.7%"},{"v":-0.0653604547324204,"d":"-6.5%"},{"v":-0.017664486305104123,"d":"-1.8%"},{"v":0.016323376002811096,"d":"1.6%"},{"v":-4.5752848096779625E-3,"d":"-0.5%"}]
[null,"LUBELSKIE",{"v":-0.29995370474752847,"d":"-30.0%"},{"v":-0.28845205908884064,"d":"-28.8%"},{"v":-0.12332377784109608,"d":"-12.3%"},{"v":0.001231689614217293,"d":"0.1%"},{"v":0.05195561055147979,"d":"5.2%"},{"v":0.07203503082396973,"d":"7.2%"},{"v":-0.006100688377223933,"d":"-0.6%"},{"v":-0.007299510430034628,"d":"-0.7%"}]
[null,"PODKARPACKIE",{"v":-0.29523186385315797,"d":"-29.5%"},{"v":-0.2679610471492775,"d":"-26.8%"},{"v":-0.021393072682635142,"d":"-2.1%"},{"v":7.6409034397013616E-4,"d":"0.1%"},{"v":0.013806979338184588,"d":"1.4%"},{"v":-0.014484841169278123,"d":"-1.4%"},{"v":-0.01609428140547354,"d":"-1.6%"},{"v":0.010130308871351579,"d":"1.0%"}]
[null,"PODLASKIE",{"v":-0.25628429986717133,"d":"-25.6%"},{"v":-0.20911833933609925,"d":"-20.9%"},{"v":-0.012270590661579516,"d":"-1.2%"},{"v":0.010583184144235506,"d":"1.1%"},{"v":0.011371111500042117,"d":"1.1%"},{"v":-0.06551893935824243,"d":"-6.6%"},{"v":-0.003208458428374646,"d":"-0.3%"},{"v":0.011877732272846886,"d":"1.2%"}]
[null,"ŚWIĘTOKRZYSKIE",{"v":-0.2035416448159355,"d":"-20.4%"},{"v":-0.2166013888408142,"d":"-21.7%"},{"v":-0.1060123731839197,"d":"-10.6%"},{"v":-0.02484263935093222,"d":"-2.5%"},{"v":0.04806117302761027,"d":"4.8%"},{"v":0.1082138442571226,"d":"10.8%"},{"v":0.00406969793024458,"d":"0.4%"},{"v":-0.016429958655246824,"d":"-1.6%"}]
[null,"LUBUSKIE",{"v":-0.10629976586790116,"d":"-10.6%"},{"v":0.005684919903300053,"d":"0.6%"},{"v":-0.18003001302931737,"d":"-18.0%"},{"v":-1.1306696167110574E-3,"d":"-0.1%"},{"v":-0.00639601569969171,"d":"-0.6%"},{"v":0.09651950658506542,"d":"9.7%"},{"v":-0.004150722959994378,"d":"-0.4%"},{"v":-0.016796771050552134,"d":"-1.7%"}]
[null,"WIELKOPOLSKIE",{"v":0.05529720881228544,"d":"5.5%"},{"v":-0.031917043454968035,"d":"-3.2%"},{"v":0.1251493802491633,"d":"12.5%"},{"v":0.015010186663730043,"d":"1.5%"},{"v":0.01317840899447697,"d":"1.3%"},{"v":-0.047991630649187614,"d":"-4.8%"},{"v":-0.010410824203360628,"d":"-1.0%"},{"v":-0.00772126878756859,"d":"-0.8%"}]
[null,"ZACHODNIOPOMORSKIE",{"v":-0.11237854954740964,"d":"-11.2%"},{"v":0.014708813857190074,"d":"1.5%"},{"v":0.09405899834454291,"d":"9.4%"},{"v":-0.022045957490607802,"d":"-2.2%"},{"v":-0.081762784575635,"d":"-8.2%"},{"v":-0.11045180633756325,"d":"-11.0%"},{"v":9.2790003434431326E-4,"d":"0.1%"},{"v":-7.81371337968087E-3,"d":"-0.8%"}]
[null,"DOLNOŚLĄSKIE",{"v":0.08977932807339088,"d":"9.0%"},{"v":0.1504183441399234,"d":"15.0%"},{"v":-0.04366002418588325,"d":"-4.4%"},{"v":-0.03357769933930665,"d":"-3.4%"},{"v":-0.00861475670472205,"d":"-0.9%"},{"v":0.018883570387258998,"d":"1.9%"},{"v":0.014697300462223246,"d":"1.5%"},{"v":-0.008367406686102807,"d":"-0.8%"}]
[null,"OPOLSKIE",{"v":-0.15678631547192554,"d":"-15.7%"},{"v":-0.012110001626737775,"d":"-1.2%"},{"v":-0.030308605671574076,"d":"-3.0%"},{"v":4.4756532299134845E-3,"d":"0.4%"},{"v":-0.04768909655628305,"d":"-4.8%"},{"v":-0.09438838708044378,"d":"-9.4%"},{"v":0.016097450586036607,"d":"1.6%"},{"v":7.1366716471630565E-3,"d":"0.7%"}]
[null,"KUJAWSKO-POMORSKIE",{"v":-0.13683241701561216,"d":"-13.7%"},{"v":-0.08531832994378973,"d":"-8.5%"},{"v":0.05207713402411536,"d":"5.2%"},{"v":-0.018242255646187887,"d":"-1.8%"},{"v":-0.03968242628865268,"d":"-4.0%"},{"v":-0.04169990045646837,"d":"-4.2%"},{"v":-0.00721131584341168,"d":"-0.7%"},{"v":0.00324467713878282,"d":"0.3%"}]
[null,"POMORSKIE",{"v":-0.015925678470578224,"d":"-1.6%"},{"v":0.07064775239983052,"d":"7.1%"},{"v":0.06351274499057587,"d":"6.4%"},{"v":1.4367279919394451E-3,"d":"0.1%"},{"v":-0.011005675884099422,"d":"-1.1%"},{"v":-0.11525121346843317,"d":"-11.5%"},{"v":-0.013717559855956579,"d":"-1.4%"},{"v":-0.011548454644434885,"d":"-1.2%"}]
[null,"WARMIŃSKO-MAZURSKIE",{"v":-0.2598820128389596,"d":"-26.0%"},{"v":-0.10882760853542191,"d":"-10.9%"},{"v":-0.1213843426404474,"d":"-12.1%"},{"v":-0.009476286394433188,"d":"-0.9%"},{"v":-0.04113552254920771,"d":"-4.1%"},{"v":0.010385575729276274,"d":"1.0%"},{"v":-0.015011743974488413,"d":"-1.5%"},{"v":0.025567915525762652,"d":"2.6%"}]
[]
[null,"Wartości","WDB per capita","WDB na 1 pracującego","Współczynnik dojazdów netto","Udział pracujących wśród aktwnych zawodowo","Współczynnik aktywności zawodowej","Wskaźnik różnicy w metodologii BAEL/demo","Wskaźnik struktury wiekowej","Weryfikacja"]
[null,null,"WDB_i/N_i","WDB_i/Pp_i","Pp_i/Pz_i","Pz_i/Az_i","Az_i/NB15+_i","NB15+_i/N15+_i","Ni15+_i/N_i"]
[null,"ŁÓDZKIE",{"$f":"C43/I43*1000000","v":{"v":25191.928629389746,"d":"25,191.93"}},{"$f":"C43/D43*1000000","v":{"v":66817.23581625754,"d":"66,817.24"}},{"$f":"D43/E43/1000","v":{"v":0.7765057011247677,"d":"0.78"}},{"$f":"E43/F43","v":{"v":0.9065010956902849,"d":"0.91"}},{"$f":"F43/G43","v":{"v":0.5484775641025641,"d":"0.55"}},{"$f":"G43/H43*1000","v":{"v":1.1392583592397458,"d":"1.14"}},{"$f":"H43/I43","v":{"v":0.8571934404268089,"d":"0.86"}},{"$f":"IF(PRODUCT(D24:I24)-C24<0.0001,\"prawidłowo\",\"nieprawidłowo\")","v":"prawidłowo"}]
[null,"MAZOWIECKIE",{"$f":"C44/I44*1000000","v":{"v":41910.86112177575,"d":"41,910.86"}},{"$f":"C44/D44*1000000","v":{"v":97989.0060880173,"d":"97,989.01"}},{"$f":"D44/E44/1000","v":{"v":0.9690686985571144,"d":"0.97"}},{"$f":"E44/F44","v":{"v":0.90945194598888,"d":"0.91"}},{"v":0.570716228467815,"d":"0.57"},{"$f":"G44/H44*1000","v":{"v":1.0030881564890277,"d":"1.00"}},{"$f":"H44/I44","v":{"v":0.84772615837215,"d":"0.85"}},{"$f":"IF(PRODUCT(D25:I25)-C25<0.0001,\"prawidłowo\",\"nieprawidłowo\")","v":"prawidłowo"}]
[null,"MAŁOPOLSKIE",{"v":24177.837632767678,"d":"24,177.84"},{"v":68536.47272833284,"d":"68,536.47"},{"v":0.9072598819512562,"d":"0.91"},{"v":0.9139784946236559,"d":"0.91"},{"v":0.5346876197776926,"d":"0.53"},{"v":0.9520796316630521,"d":"0.95"},{"v":0.8357081166537971,"d":"0.84"},"prawidłowo"]
[null,"ŚLĄSKIE",{"v":28747.463266378247,"d":"28,747.46"},{"v":82051.63551373268,"d":"82,051.64"},{"v":0.9233337206291874,"d":"0.92"},{"v":0.9193128578865174,"d":"0.92"},{"v":0.501959759602822,"d":"0.50"},{"v":0.9572772204291513,"d":"0.96"},{"v":0.8589811381970579,"d":"0.86"},"prawidłowo"]
[null,"LUBELSKIE",{"v":19021.213518707533,"d":"19,021.21"},{"v":54082.274926980775,"d":"54,082.27"},{"v":0.7838232870065429,"d":"0.78"},{"v":0.9050279329608939,"d":"0.91"},{"v":0.5649658074697528,"d":"0.56"},{"v":1.04468860201321,"d":"1.04"},{"v":0.8400286583083012,"d":"0.84"},"prawidłowo"]
[null,"PODKARPACKIE",{"v":19149.512381885994,"d":"19,149.51"},{"v":55639.72520900733,"d":"55,639.73"},{"v":0.874958027911741,"d":"0.87"},{"v":0.9046052631578947,"d":"0.90"},{"v":0.5444776119402985,"d":"0.54"},{"v":0.9603757563317431,"d":"0.96"},{"v":0.8315822247057937,"d":"0.83"},"prawidłowo"]
[null,"PODLASKIE",{"v":20207.770865125014,"d":"20,207.77"},{"v":60112.15400603991,"d":"60,112.15"},{"v":0.8831143046107865,"d":"0.88"},{"v":0.9134808853118712,"d":"0.91"},{"v":0.5431693989071038,"d":"0.54"},{"v":0.9106434815841016,"d":"0.91"},{"v":0.8424731272952896,"d":"0.84"},"prawidłowo"]
[null,"ŚWIĘTOKRZYSKIE",{"v":21640.860805142882,"d":"21,640.86"},{"v":59543.393537015196,"d":"59,543.39"},{"v":0.7993011587203133,"d":"0.80"},{"v":0.8814589665653495,"d":"0.88"},{"v":0.562874251497006,"d":"0.56"},{"v":1.0799445339009277,"d":"1.08"},{"v":0.8486245149151347,"d":"0.85"},"prawidłowo"]
[null,"LUBUSKIE",{"v":24283.055407092448,"d":"24,283.06"},{"v":76438.59984821426,"d":"76,438.60"},{"v":0.7331230780405226,"d":"0.73"},{"v":0.9028925619834711,"d":"0.90"},{"v":0.5336273428886439,"d":"0.53"},{"v":1.068548505858167,"d":"1.07"},{"v":0.8416767395716924,"d":"0.84"},"prawidłowo"]
[null,"WIELKOPOLSKIE",{"v":28673.86581522474,"d":"28,673.87"},{"v":73580.60588433317,"d":"73,580.61"},{"v":1.0059794748721036,"d":"1.01"},{"v":0.9174825174825175,"d":"0.92"},{"v":0.5441400304414004,"d":"0.54"},{"v":0.9277236880193734,"d":"0.93"},{"v":0.8363857967298536,"d":"0.84"},"prawidłowo"]
[null,"ZACHODNIOPOMORSKIE",{"v":24117.88655599487,"d":"24,117.89"},{"v":77124.47452462926,"d":"77,124.47"},{"v":0.9781820227195218,"d":"0.98"},{"v":0.8839869281045751,"d":"0.88"},{"v":0.4931506849315068,"d":"0.49"},{"v":0.8668568023810971,"d":"0.87"},{"v":0.845969114875809,"d":"0.85"},"prawidłowo"]
[null,"DOLNOŚLĄSKIE",{"v":29610.792069232666,"d":"29,610.79"},{"v":87439.28215033017,"d":"87,439.28"},{"v":0.8550494748134141,"d":"0.86"},{"v":0.8735632183908046,"d":"0.87"},{"v":0.5324357405140759,"d":"0.53"},{"v":0.9928929765886287,"d":"0.99"},{"v":0.8576068037562404,"d":"0.86"},"prawidłowo"]
[null,"OPOLSKIE",{"v":22911.266932025053,"d":"22,911.27"},{"v":75086.06998598293,"d":"75,086.07"},{"v":0.866986781291642,"d":"0.87"},{"v":0.9079601990049752,"d":"0.91"},{"v":0.5114503816793893,"d":"0.51"},{"v":0.8825104615664449,"d":"0.88"},{"v":0.8587901894535469,"d":"0.86"},"prawidłowo"]
[null,"KUJAWSKO-POMORSKIE",{"v":23453.441593389787,"d":"23,453.44"},{"v":69521.76052579744,"d":"69,521.76"},{"v":0.9406466566920676,"d":"0.94"},{"v":0.8874251497005988,"d":"0.89"},{"v":0.515750463248919,"d":"0.52"},{"v":0.9338549231285697,"d":"0.93"},{"v":0.8390899727801074,"d":"0.84"},"prawidłowo"]
[null,"POMORSKIE",{"v":26738.64273696018,"d":"26,738.64"},{"v":81376.19795666191,"d":"81,376.20"},{"v":0.9508710678829924,"d":"0.95"},{"v":0.9052132701421801,"d":"0.91"},{"v":0.5311516677155443,"d":"0.53"},{"v":0.8621798228217752,"d":"0.86"},{"v":0.8335909937944385,"d":"0.83"},"prawidłowo"]
[null,"WARMIŃSKO-MAZURSKIE",{"v":20110.01609221999,"d":"20,110.02"},{"v":67734.90233251882,"d":"67,734.90"},{"v":0.7855573074299155,"d":"0.79"},{"v":0.8953488372093024,"d":"0.90"},{"v":0.5149700598802395,"d":"0.51"},{"v":0.9846117563822888,"d":"0.98"},{"v":0.832497168961298,"d":"0.83"},"prawidłowo"]
[null,"POLSKA",{"v":27171.365162139078,"d":"27,171.37"},{"v":76006.50893280182,"d":"76,006.51"},{"v":0.8940852588385467,"d":"0.89"},{"v":0.9039145907473309,"d":"0.90"},{"v":0.5370624024464052,"d":"0.54"},{"v":0.9744911052116075,"d":"0.97"},{"v":0.8451848678079427,"d":"0.85"},"prawidłowo"]
[]
[null,"Dane","WDB_i","PP_i","PZ_i","AZ_i","NB15+_i","N15+_i","N_i"]
[null,"ŁÓDZKIE",64388,963643.5750958368,1241,1369,2496,2190899,2555898]
[null,"MAZOWIECKIE",217454,2219167.319695792,2290,2518,4412,4398417,5188488]
[null,"MAŁOPOLSKIE",79280,1156756.3494878516,1275,1395,2609,2740317,3279036]
[null,"ŚLĄSKIE",133794,1630607.3506311448,1766,1921,3827,3997797,4654115]
[null,"LUBELSKIE",41204,761876.2349703597,972,1074,1901,1819681,2166213]
[null,"PODKARPACKIE",40163,721840.3730271864,825,912,1675,1744109,2097338]
[null,"PODLASKIE",24101,400933.8942932971,454,497,915,1004784,1192660]
[null,"ŚWIĘTOKRZYSKIE",27604,463594.6720577817,580,658,1169,1082463,1275550]
[null,"LUBUSKIE",24489,320374.7851037084,437,484,907,848815,1008481]
[null,"WIELKOPOLSKIE",97115,1319845.0710321998,1312,1430,2628,2832740,3386882]
[null,"ZACHODNIOPOMORSKIE",40814,529196.4742912613,541,612,1241,1431609,1692271]
[null,"DOLNOŚLĄSKIE",85232,974756.4012872921,1140,1305,2451,2468544,2878410]
[null,"OPOLSKIE",23761,316450.1751714493,365,402,786,890641,1037088]
[null,"KUJAWSKO-POMORSKIE",48458,697019.1726088221,741,835,1619,1733674,2066136]
[null,"POMORSKIE",59117,726465.4958626062,764,844,1589,1843003,2210920]
[null,"WARMIŃSKO-MAZURSKIE",28680,423415.38870472444,539,602,1169,1187270,1426155]
[null,"POLSKA",1035654,13625859.344699452,15240,16860,31393,32214763,38115641]

{"sheet":"2002","index":13,"n_rows":59,"n_cols":10,"rows_kept":59,"hidden":true,"merged":[[0,0,0,10],[1,0,1,10],[2,1,3,1],[21,1,22,1]]}
["DEKOMPOZYCJA RÓŻNIC W POZIOMIE WDB PER CAPITA"]
[2002]
[null,"Różnice względem średniej","WDB per capita","WDB na 1 pracującego","Współczynnik dojazdów netto","Udział pracujących wśród aktwnych zawodowo","Współczynnik aktywności zawodowej","Wskaźnik różnicy w metodologii BAEL/demo","Wskaźnik struktury wiekowej","Interakcje"]
[null,null,"WDB_i/N_i","WDB_i/Pp_i","Pp_i/Pz_i","Pz_i/Az_i","Az_i/NB15+_i","NB15+_i/N15+_i","Ni15+_i/N_i"]
[null,"ŁÓDZKIE",{"$f":"(C24-C$40)/C$40","v":{"v":-0.08781168170772338,"d":"-8.8%"}},{"$f":"(D24-D$40)/D$40","v":{"v":-0.11879832849201695,"d":"-11.9%"}},{"$f":"(E24-E$40)/E$40","v":{"v":-0.098785804548399,"d":"-9.9%"}},{"$f":"(F24-F$40)/F$40","v":{"v":-0.005262732074541203,"d":"-0.5%"}},{"$f":"(G24-G$40)/G$40","v":{"v":0.01160425894010383,"d":"1.2%"}},{"$f":"(H24-H$40)/H$40","v":{"v":0.11905585029371696,"d":"11.9%"}},{"$f":"(I24-I$40)/I$40","v":{"v":0.02002395192347285,"d":"2.0%"}},{"$f":"C5-SUM(D5:I5)","v":{"v":-0.015648877750059867,"d":"-1.6%"}}]
[null,"MAZOWIECKIE",{"$f":"(C25-C$40)/C$40","v":{"v":0.5129604865486753,"d":"51.3%"}},{"v":0.26209120004995423,"d":"26.2%"},{"v":0.1457633047056652,"d":"14.6%"},{"v":0.03588263713026231,"d":"3.6%"},{"v":0.05360078896069134,"d":"5.4%"},{"v":-0.05196105068118789,"d":"-5.2%"},{"v":0.01118150376543355,"d":"1.1%"},{"$f":"C6-SUM(D6:I6)","v":{"v":0.05640210261785661,"d":"5.6%"}}]
[null,"MAŁOPOLSKIE",{"v":-0.11475928445004555,"d":"-11.5%"},{"v":-0.10819955712998637,"d":"-10.8%"},{"v":-0.05942581076981378,"d":"-5.9%"},{"v":0.04673729018526585,"d":"4.7%"},{"v":0.02266687945999821,"d":"2.3%"},{"v":5.432422452510618E-5,"d":"0.0%"},{"v":-0.014162893620944708,"d":"-1.4%"},{"v":-2.4295167990898425E-3,"d":"-0.2%"}]
[null,"ŚLĄSKIE",{"v":0.08774251782070196,"d":"8.8%"},{"v":0.08765121906054338,"d":"8.8%"},{"v":0.11165033380104056,"d":"11.2%"},{"v":-2.0119566891639387E-3,"d":"-0.2%"},{"v":-0.08723446681600205,"d":"-8.7%"},{"v":-0.030739032775788298,"d":"-3.1%"},{"v":0.0189267328630621,"d":"1.9%"},{"v":-0.010500311622989797,"d":"-1.1%"}]
[null,"LUBELSKIE",{"v":-0.27802798006243806,"d":"-27.8%"},{"v":-0.2699693494735681,"d":"-27.0%"},{"v":-0.1556975936450137,"d":"-15.6%"},{"v":0.04322561119847291,"d":"4.3%"},{"v":0.058014628754391555,"d":"5.8%"},{"v":0.07271146177912555,"d":"7.3%"},{"v":-0.01069908393946706,"d":"-1.1%"},{"v":-0.015613654736379268,"d":"-1.6%"}]
[null,"PODKARPACKIE",{"v":-0.25863266059645784,"d":"-25.9%"},{"v":-0.24056515075024903,"d":"-24.1%"},{"v":-0.01848566513337966,"d":"-1.8%"},{"v":0.022728488949873647,"d":"2.3%"},{"v":0.037321513505494425,"d":"3.7%"},{"v":-0.033715581229695014,"d":"-3.4%"},{"v":-0.029785937893888833,"d":"-3.0%"},{"v":0.003869671955386622,"d":"0.4%"}]
[null,"PODLASKIE",{"v":-0.2384795718995158,"d":"-23.8%"},{"v":-0.20472076927554922,"d":"-20.5%"},{"v":-0.06914365488741192,"d":"-6.9%"},{"v":0.03616418624400049,"d":"3.6%"},{"v":0.02795061430608463,"d":"2.8%"},{"v":-0.021209720007922164,"d":"-2.1%"},{"v":-0.013291707335660067,"d":"-1.3%"},{"v":0.005771479056942447,"d":"0.6%"}]
[null,"ŚWIĘTOKRZYSKIE",{"v":-0.20833552344013678,"d":"-20.8%"},{"v":-0.2233698735821511,"d":"-22.3%"},{"v":-0.0258568440127634,"d":"-2.6%"},{"v":0.01282839900049887,"d":"1.3%"},{"v":-0.0643262938053129,"d":"-6.4%"},{"v":0.10454594634486704,"d":"10.5%"},{"v":-3.2217382541417308E-4,"d":"-0.0%"},{"v":-0.011834683559861114,"d":"-1.2%"}]
[null,"LUBUSKIE",{"v":-0.12018066585750058,"d":"-12.0%"},{"v":0.020355163549966915,"d":"2.0%"},{"v":-0.11940672927959504,"d":"-11.9%"},{"v":-0.07754055292518769,"d":"-7.8%"},{"v":-0.01935854962928494,"d":"-1.9%"},{"v":0.08832532709066422,"d":"8.8%"},{"v":-5.3952998856258445E-3,"d":"-0.5%"},{"v":-0.00716002477843819,"d":"-0.7%"}]
[null,"WIELKOPOLSKIE",{"v":0.04112850924151648,"d":"4.1%"},{"v":-0.02378124907183786,"d":"-2.4%"},{"v":0.02331420155548216,"d":"2.3%"},{"v":0.022013825931951884,"d":"2.2%"},{"v":0.025793514775264734,"d":"2.6%"},{"v":0.004550562542185605,"d":"0.5%"},{"v":-0.010400035281943032,"d":"-1.0%"},{"v":-3.6231120958700458E-4,"d":"-0.0%"}]
[null,"ZACHODNIOPOMORSKIE",{"v":-0.044327374873628984,"d":"-4.4%"},{"v":0.07196800300667865,"d":"7.2%"},{"v":-0.01658200886841009,"d":"-1.7%"},{"v":-0.07823658750081054,"d":"-7.8%"},{"v":-0.034795478193521856,"d":"-3.5%"},{"v":0.017862785357328045,"d":"1.8%"},{"v":1.062342716520726E-3,"d":"0.1%"},{"v":-0.005606431391413917,"d":"-0.6%"}]
[null,"DOLNOŚLĄSKIE",{"v":0.02732522086204635,"d":"2.7%"},{"v":0.10048973147285825,"d":"10.0%"},{"v":0.06400847530584437,"d":"6.4%"},{"v":-0.0758589992641339,"d":"-7.6%"},{"v":-0.01652324728697383,"d":"-1.7%"},{"v":-0.05191285127791835,"d":"-5.2%"},{"v":0.018184007220658743,"d":"1.8%"},{"v":-0.011061895308288935,"d":"-1.1%"}]
[null,"OPOLSKIE",{"v":-0.18563863870327538,"d":"-18.6%"},{"v":-0.043732320523708686,"d":"-4.4%"},{"v":-0.04727206493685706,"d":"-4.7%"},{"v":2.6764855567887797E-3,"d":"0.3%"},{"v":-0.03542032695226633,"d":"-3.5%"},{"v":-0.08381417719949481,"d":"-8.4%"},{"v":8.756346067997231E-3,"d":"0.9%"},{"v":0.013167419284265486,"d":"1.3%"}]
[null,"KUJAWSKO-POMORSKIE",{"v":-0.10177683312967142,"d":"-10.2%"},{"v":-0.05376736149231662,"d":"-5.4%"},{"v":-0.10792901370313983,"d":"-10.8%"},{"v":-0.018153826701782002,"d":"-1.8%"},{"v":3.6808776048894104E-4,"d":"0.0%"},{"v":0.09209766561364381,"d":"9.2%"},{"v":-0.007976058100700956,"d":"-0.8%"},{"v":-0.006416326505864781,"d":"-0.6%"}]
[null,"POMORSKIE",{"v":3.0336503651890194E-3,"d":"0.3%"},{"v":0.0849269819630417,"d":"8.5%"},{"v":0.023914971858538896,"d":"2.4%"},{"v":-0.020946020863222708,"d":"-2.1%"},{"v":0.003552631199317091,"d":"0.4%"},{"v":-0.06994474492053739,"d":"-7.0%"},{"v":-0.011912152544517126,"d":"-1.2%"},{"v":-6.558016327431449E-3,"d":"-0.7%"}]
[null,"WARMIŃSKO-MAZURSKIE",{"v":-0.246515573776584,"d":"-24.7%"},{"v":-0.07465875930529499,"d":"-7.5%"},{"v":-0.04887681716805751,"d":"-4.9%"},{"v":-0.0774103429642772,"d":"-7.7%"},{"v":-0.03202086807391698,"d":"-3.2%"},{"v":-0.0196285409238923,"d":"-2.0%"},{"v":-0.02215423542630265,"d":"-2.2%"},{"v":0.028233990085157645,"d":"2.8%"}]
[]
[null,"Wartości","WDB per capita","WDB na 1 pracującego","Współczynnik dojazdów netto","Udział pracujących wśród aktwnych zawodowo","Współczynnik aktywności zawodowej","Wskaźnik różnicy w metodologii BAEL/demo","Wskaźnik struktury wiekowej","Weryfikacja"]
[null,null,"WDB_i/N_i","WDB_i/Pp_i","Pp_i/Pz_i","Pz_i/Az_i","Az_i/NB15+_i","NB15+_i/N15+_i","Ni15+_i/N_i"]
[null,"ŁÓDZKIE",{"$f":"C43/I43*1000000","v":{"v":17064.639599904887,"d":"17,064.64"}},{"$f":"C43/D43*1000000","v":{"v":48385.81293794369,"d":"48,385.81"}},{"$f":"D43/E43/1000","v":{"v":0.8514509862836459,"d":"0.85"}},{"$f":"E43/F43","v":{"v":0.7964601769911505,"d":"0.80"}},{"$f":"F43/G43","v":{"v":0.5605622157916494,"d":"0.56"}},{"$f":"G43/H43*1000","v":{"v":1.1065428290169472,"d":"1.11"}},{"$f":"H43/I43","v":{"v":0.838423244789789,"d":"0.84"}},{"$f":"IF(PRODUCT(D24:I24)-C24<0.0001,\"prawidłowo\",\"nieprawidłowo\")","v":"prawidłowo"}]
[null,"MAZOWIECKIE",{"$f":"C44/I44*1000000","v":{"v":28303.5036890019,"d":"28,303.50"}},{"$f":"C44/D44*1000000","v":{"v":69300.03731352287,"d":"69,300.04"}},{"$f":"D44/E44/1000","v":{"v":1.0824965926667318,"d":"1.08"}},{"$f":"E44/F44","v":{"v":0.8294042006000857,"d":"0.83"}},{"v":0.5838338338338338,"d":"0.58"},{"$f":"G44/H44*1000","v":{"v":0.937438199105211,"d":"0.94"}},{"$f":"H44/I44","v":{"v":0.8311550683292572,"d":"0.83"}},{"$f":"IF(PRODUCT(D25:I25)-C25<0.0001,\"prawidłowo\",\"nieprawidłowo\")","v":"prawidłowo"}]
[null,"MAŁOPOLSKIE",{"v":16560.52096600259,"d":"16,560.52"},{"v":48967.77979646956,"d":"48,967.78"},{"v":0.8886376015101194,"d":"0.89"},{"v":0.8380952380952381,"d":"0.84"},{"v":0.566692367000771,"d":"0.57"},{"v":0.9888719502316072,"d":"0.99"},{"v":0.8103228791891307,"d":"0.81"},"prawidłowo"]
[null,"ŚLĄSKIE",{"v":20348.796045594525,"d":"20,348.80"},{"v":59721.73014280659,"d":"59,721.73"},{"v":1.0502672704163725,"d":"1.05"},{"v":0.7990629880270692,"d":"0.80"},{"v":0.5057925223802001,"d":"0.51"},{"v":0.9584229173606275,"d":"0.96"},{"v":0.8375213699238704,"d":"0.84"},"prawidłowo"]
[null,"LUBELSKIE",{"v":13506.193923327897,"d":"13,506.19"},{"v":40085.17872519409,"d":"40,085.18"},{"v":0.7976817500665031,"d":"0.80"},{"v":0.8352835283528353,"d":"0.84"},{"v":0.5862796833773087,"d":"0.59"},{"v":1.0607166526357268,"d":"1.06"},{"v":0.8131700069913773,"d":"0.81"},"prawidłowo"]
[null,"PODKARPACKIE",{"v":13869.029239210471,"d":"13,869.03"},{"v":41699.73088166234,"d":"41,699.73"},{"v":0.9273171158327608,"d":"0.93"},{"v":0.8188720173535792,"d":"0.82"},{"v":0.5748129675810474,"d":"0.57"},{"v":0.9554796519766634,"d":"0.96"},{"v":0.7974812949811169,"d":"0.80"},"prawidłowo"]
[null,"PODLASKIE",{"v":14246.040420500387,"d":"14,246.04"},{"v":43667.90637767921,"d":"43,667.91"},{"v":0.8794563569178353,"d":"0.88"},{"v":0.8296296296296296,"d":"0.83"},{"v":0.569620253164557,"d":"0.57"},{"v":0.9678456755777212,"d":"0.97"},{"v":0.8110389631896557,"d":"0.81"},"prawidłowo"]
[null,"ŚWIĘTOKRZYSKIE",{"v":14809.956130366507,"d":"14,809.96"},{"v":42643.904606444186,"d":"42,643.90"},{"v":0.9203529584120275,"d":"0.92"},{"v":0.8109452736318408,"d":"0.81"},{"v":0.5184866723989682,"d":"0.52"},{"v":1.092195171426747,"d":"1.09"},{"v":0.821699456356081,"d":"0.82"},"prawidłowo"]
[null,"LUBUSKIE",{"v":16459.101206511434,"d":"16,459.10"},{"v":56026.57787666983,"d":"56,026.58"},{"v":0.8319687069442049,"d":"0.83"},{"v":0.7385892116182573,"d":"0.74"},{"v":0.5434047350620068,"d":"0.54"},{"v":1.0761559273503756,"d":"1.08"},{"v":0.8175295279886053,"d":"0.82"},"prawidłowo"]
[null,"WIELKOPOLSKIE",{"v":19476.77078418814,"d":"19,476.77"},{"v":53603.09608592836,"d":"53,603.10"},{"v":0.9668088791653632,"d":"0.97"},{"v":0.81829980532122,"d":"0.82"},{"v":0.5684249354481741,"d":"0.57"},{"v":0.993317912662037,"d":"0.99"},{"v":0.8134158143033708,"d":"0.81"},"prawidłowo"]
[null,"ZACHODNIOPOMORSKIE",{"v":17878.11638917653,"d":"17,878.12"},{"v":58860.582027927216,"d":"58,860.58"},{"v":0.929115656082719,"d":"0.93"},{"v":0.738031914893617,"d":"0.74"},{"v":0.534850640113798,"d":"0.53"},{"v":1.0064812813093706,"d":"1.01"},{"v":0.8228374794871705,"d":"0.82"},"prawidłowo"]
[null,"DOLNOŚLĄSKIE",{"v":19218.547633588943,"d":"19,218.55"},{"v":60426.67871481813,"d":"60,426.68"},{"v":1.0052560981458407,"d":"1.01"},{"v":0.7399355877616747,"d":"0.74"},{"v":0.5449758666081614,"d":"0.54"},{"v":0.9374858595540052,"d":"0.94"},{"v":0.8369108759821172,"d":"0.84"},"prawidłowo"]
[null,"OPOLSKIE",{"v":15234.55503204968,"d":"15,234.56"},{"v":52507.60473316028,"d":"52,507.60"},{"v":0.9001202422948955,"d":"0.90"},{"v":0.8028169014084507,"d":"0.80"},{"v":0.534504391468005,"d":"0.53"},{"v":0.9059412468115869,"d":"0.91"},{"v":0.8291616753486539,"d":"0.83"},"prawidłowo"]
[null,"KUJAWSKO-POMORSKIE",{"v":16803.38841832893,"d":"16,803.39"},{"v":51956.59168945969,"d":"51,956.59"},{"v":0.8428126464839708,"d":"0.84"},{"v":0.7861386138613862,"d":"0.79"},{"v":0.5543358946212953,"d":"0.55"},{"v":1.0798860844646356,"d":"1.08"},{"v":0.8154082369418403,"d":"0.82"},"prawidłowo"]
[null,"POMORSKIE",{"v":18764.116363716297,"d":"18,764.12"},{"v":59572.14528515108,"d":"59,572.15"},{"v":0.9673764761580085,"d":"0.97"},{"v":0.7839029768467475,"d":"0.78"},{"v":0.5561005518087063,"d":"0.56"},{"v":0.9196555943365906,"d":"0.92"},{"v":0.812172907938869,"d":"0.81"},"prawidłowo"]
[null,"WARMIŃSKO-MAZURSKIE",{"v":14095.708002175787,"d":"14,095.71"},{"v":50809.46805218708,"d":"50,809.47"},{"v":0.8986041012078015,"d":"0.90"},{"v":0.7386934673366834,"d":"0.74"},{"v":0.5363881401617251,"d":"0.54"},{"v":0.9694091742863563,"d":"0.97"},{"v":0.8037542817419453,"d":"0.80"},"prawidłowo"]
[null,"POLSKA",{"v":18707.364759781063,"d":"18,707.36"},{"v":54908.898271994876,"d":"54,908.90"},{"v":0.9447820402529072,"d":"0.94"},{"v":0.8006739092546331,"d":"0.80"},{"v":0.554131925441844,"d":"0.55"},{"v":0.9888182334478789,"d":"0.99"},{"v":0.821964271729858,"d":"0.82"},"prawidłowo"]
[]
[null,"Dane","WDB_i","PP_i","PZ_i","AZ_i","NB15+_i","N15+_i","N_i"]
[null,"ŁÓDZKIE",44494,919567.0651863376,1080,1356,2419,2186088,2607380]
[null,"MAZOWIECKIE",145158,2094630.9068101263,1935,2333,3996,4262681,5128623]
[null,"MAŁOPOLSKIE",53610,1094801.525060467,1232,1470,2594,2623191,3237217]
[null,"ŚLĄSKIE",96281,1612160.2600891315,1535,1921,3798,3962760,4731533]
[null,"LUBELSKIE",29673,740248.6640617149,928,1111,1895,1786528,2196992]
[null,"PODKARPACKIE",29195,700124.4224537344,755,922,1604,1678738,2105050]
[null,"PODLASKIE",17205,393996.4478991902,448,540,948,979495,1207704]
[null,"ŚWIĘTOKRZYSKIE",19192,450052.5966634814,489,603,1163,1064828,1295885]
[null,"LUBUSKIE",16594,296180.85967213695,356,482,887,824230,1008196]
[null,"WIELKOPOLSKIE",65350,1219145.9966275229,1261,1541,2711,2729237,3355279]
[null,"ZACHODNIOPOMORSKIE",30352,515659.189125909,555,752,1406,1396946,1697718]
[null,"DOLNOŚLĄSKIE",55824,923830.3541960276,919,1242,2279,2430970,2904694]
[null,"OPOLSKIE",16164,307841.1228648543,342,426,797,879748,1061009]
[null,"KUJAWSKO-POMORSKIE",34769,669193.2413082728,794,1010,1822,1687215,2069166]
[null,"POMORSKIE",40974,687804.674548344,711,907,1631,1773490,2183636]
[null,"WARMIŃSKO-MAZURSKIE",20135,396284.4086326405,441,597,1113,1148122,1428449]
[null,"POLSKA",714968,13020986.078765567,13782,17213,31063,31414267,38218531]